{"text_format":"1","workbook":"xlsx","n_sheets":33,"sheets":["General data","XBRL Errors","Index","Show","Hierarchies","T00.01","T00.02","T00.03","T01.01","T01.02","T01.03","T01.09","T02.00","T09.01","T09.02","T09.03","T11.09","T22.09","T31.01","T31.02","T70.00","T70.01","T71.00","T71.01","T80.01","T80.02","T80.03","T81.01","T81.02","T81.03","T82.00","T83.00","T90.00"],"not_rendered":{"charts":0,"images":3,"macros":1,"external_links":0,"defined_names":49,"comments":0,"pivot_tables":0},"unopened":[],"bounds":{"document_bytes":16777216,"sheet_cells":100000,"rows_first":2000,"rows_last":500,"rows_between":2000,"halvings":0,"cell_chars":16384,"cell_head_chars":4096},"cells_cut":0,"cells_raw":0,"read":"whole","date_system":"1900"}

{"sheet":"General data","index":0,"n_rows":247,"n_cols":23,"rows_kept":247,"cut":false,"hidden":false,"merged":[[0,6,2,6],[3,0,5,9]]}
[null,null,null,null,null,null,null,"Version:",null,"5.0.0.1",null,null,null,null,null,null,"Not applicable/All geographical areas","http://standards.iso.org/iso/17442","Module with all tables","FBO-ALL","01","EUR","NL FBO 5.0.0"]
[null,null,null,null,null,null,null,null,null,null,null,null,null,null,null,null,"AFGHANISTAN","http://standards.iso.org/iso/17442","Fund Manager individual ifrs","am_ind_ifrs",null,"AED"]
[null,null,null,null,null,null,null," ",null,null,null,null,null,null,null,null,"ALBANIA","http://standards.iso.org/iso/17442","Fund Manager individual gaap","am_ind_gaap",null,"AFN"]
[null,null,null,null,null,null,null,null,null,null,null,null,null,null,null,null,"ALGERIA","http://standards.iso.org/iso/17442","Fund Manager consolidated ifrs","am_con_ifrs",null,"ALL"]
[null,null,null,null,null,null,null,null,null,null,null,null,null,null,null,null,"AMERICAN SAMOA","http://standards.iso.org/iso/17442","Fund Manager consolidated gaap","am_con_gaap",null,"AMD"]
[null,null,null,null,null,null,null,null,null,null,null,null,null,null,null,null,"ANDORRA","http://standards.iso.org/iso/17442","Tier 3 ifams individual ifrs","t3ifam_ind_ifrs",null,"ANG"]
[null,null,null,null,null,null,null,null,null,null,null,null,null,null,null,null,"ANGOLA","http://standards.iso.org/iso/17442","Tier 3 ifams individual gaap","t3ifam_ind_gaap",null,"AOA"]
[null,"General Data",null,null,null,null,null,null,null,null,null,"/General data label{B}","/General data value{E}",null,null,null,"ANGUILLA","http://standards.iso.org/iso/17442","Tier 3 ifams consolidated ifrs","t3ifam_con_ifrs",null,"ARS"]
[null,null,null,null,null,null,null,null,null,null,null,null,null,null,null,null,"ANTARCTICA","http://standards.iso.org/iso/17442","Tier 3 ifams consolidated gaap","t3ifam_con_gaap",null,"AUD"]
["*","Identifier",":","LEGALIDENTIFIER20POS",{"$f":"\"\"&D10","v":"LEGALIDENTIFIER20POS"},{"$f":"IF(D10=\"\",1,0)","v":0},null,null,null,null,null,null,null,null,null,null,"ANTIGUA AND BARBUDA","http://standards.iso.org/iso/17442","Tier 2 ifams individual ifrs","t2ifam_ind_ifrs",null,"AWG"]
{"$rows_left_out":238}
{"sheet":"XBRL Errors","index":1,"n_rows":1,"n_cols":2,"rows_kept":1,"cut":false,"hidden":false,"merged":[]}
["Timestamp","Error"]

{"sheet":"Index","index":2,"n_rows":33,"n_cols":5,"rows_kept":33,"cut":false,"hidden":false,"merged":[[2,1,2,14]]}
[]
[]
[null,"Index"]
[]
[null,"Template Code","Template Name","Reporting Status"]
[null,"T00.01","T00.01 - Nature of Report (FINREP)",null,{"$f":"IF($D$6=\"Reported\",\"@ForceFilingCode:true\",IF($D$6=\"Not Reported\",\"@ForceFilingCode:false\",\"\"))","v":""}]
[null,"T00.02","T00.02 - Assets under management -  AUM additional details",null,{"$f":"IF($D$7=\"Reported\",\"@ForceFilingCode:true\",IF($D$7=\"Not Reported\",\"@ForceFilingCode:false\",\"\"))","v":""}]
[null,"T00.03","T00.03 - Fund management - Number of participants / Assets under Management",null,{"$f":"IF($D$8=\"Reported\",\"@ForceFilingCode:true\",IF($D$8=\"Not Reported\",\"@ForceFilingCode:false\",\"\"))","v":""}]
[null,"T01.01","T01.01 - Balance Sheet Statement [Statement of Financial Position]: Assets",null,{"$f":"IF($D$9=\"Reported\",\"@ForceFilingCode:true\",IF($D$9=\"Not Reported\",\"@ForceFilingCode:false\",\"\"))","v":""}]
[null,"T01.02","T01.02 - Balance Sheet Statement [Statement of Financial Position]: Liabilities",null,{"$f":"IF($D$10=\"Reported\",\"@ForceFilingCode:true\",IF($D$10=\"Not Reported\",\"@ForceFilingCode:false\",\"\"))","v":""}]
{"$rows_left_out":24}
{"sheet":"Show","index":3,"n_rows":58,"n_cols":39,"rows_kept":58,"cut":false,"hidden":true,"merged":[]}
["Sheet","Prefix","FBO-ALL","am_ind_ifrs","am_ind_gaap","am_con_ifrs","am_con_gaap","t3ifam_ind_ifrs","t3ifam_ind_gaap","t3ifam_con_ifrs","t3ifam_con_gaap","t2ifam_ind_ifrs","t2ifam_ind_gaap","t2ifam_con_ifrs","t2ifam_con_gaap","t3if_ind_ifrs","t3if_ind_gaap","t3if_con_ifrs","t3if_con_gaap","t2if_ind_ifrs","t2if_ind_gaap","t2if_con_ifrs","t2if_con_gaap","t2psp_ind_ifrs","t2psp_ind_gaap","t2psp_con_ifrs","t2psp_con_gaap","t3psp_ind_ifrs","t3psp_ind_gaap","t3psp_con_ifrs","t3psp_con_gaap","psp_ind_ifrs","psp_ind_gaap","psp_con_ifrs","psp_con_gaap","cf_ind_ifrs","cf_ind_gaap","cf_con_ifrs","cf_con_gaap"]
["T00.01",{"$f":"IF(AND(HLOOKUP('General data'!$E$22,$C$1:$AN$2,2,FALSE)=\"X\",Index!D6=\"Reported\"),\"/\",\"!\")","v":"!"},"X","X","X","X","X","X","X","X","X","X","X","X","X","X","X","X","X","X","X","X","X","X","X","X","X","X","X","X","X","X","X","X","X","X","X","X","X"]
["T00.02",{"$f":"IF(AND(HLOOKUP('General data'!$E$22,$C$1:$AN$3,3,FALSE)=\"X\",Index!D7=\"Reported\"),\"/\",\"!\")","v":"!"},"X",null,null,null,null,"X","X","X","X",null,null,null,null,"X","X","X","X",null,null,null,null,"X","X","X","X"]
["T00.03",{"$f":"IF(AND(HLOOKUP('General data'!$E$22,$C$1:$AN$4,4,FALSE)=\"X\",Index!D8=\"Reported\"),\"/\",\"!\")","v":"!"},"X","X","X","X","X","X","X","X","X","X","X","X","X","X","X","X","X","X","X","X","X"]
["T01.01",{"$f":"IF(AND(HLOOKUP('General data'!$E$22,$C$1:$AN$5,5,FALSE)=\"X\",Index!D9=\"Reported\"),\"/\",\"!\")","v":"!"},"X","X","X","X","X","X","X","X","X","X","X","X","X","X","X","X","X","X","X","X","X","X","X","X","X","X","X","X","X","X","X","X","X","X","X","X","X"]
["T01.02",{"$f":"IF(AND(HLOOKUP('General data'!$E$22,$C$1:$AN$6,6,FALSE)=\"X\",Index!D10=\"Reported\"),\"/\",\"!\")","v":"!"},"X","X","X","X","X","X","X","X","X","X","X","X","X","X","X","X","X","X","X","X","X","X","X","X","X","X","X","X","X","X","X","X","X","X","X","X","X"]
["T01.03",{"$f":"IF(AND(HLOOKUP('General data'!$E$22,$C$1:$AN$7,7,FALSE)=\"X\",Index!D11=\"Reported\"),\"/\",\"!\")","v":"!"},"X","X","X","X","X","X","X","X","X","X","X","X","X","X","X","X","X","X","X","X","X","X","X","X","X","X","X","X","X","X","X","X","X","X","X","X","X"]
["T01.09",{"$f":"IF(AND(HLOOKUP('General data'!$E$22,$C$1:$AN$8,8,FALSE)=\"X\",Index!D12=\"Reported\"),\"/\",\"!\")","v":"!"},"X","X","X","X","X","X","X","X","X","X","X","X","X","X","X","X","X","X","X","X","X","X","X","X","X","X","X","X","X","X","X","X","X"]
["T02.00",{"$f":"IF(AND(HLOOKUP('General data'!$E$22,$C$1:$AN$9,9,FALSE)=\"X\",Index!D13=\"Reported\"),\"/\",\"!\")","v":"!"},"X","X","X","X","X","X","X","X","X","X","X","X","X","X","X","X","X","X","X","X","X","X","X","X","X","X","X","X","X","X","X","X","X","X","X","X","X"]
["T09.01",{"$f":"IF(AND(HLOOKUP('General data'!$E$22,$C$1:$AN$10,10,FALSE)=\"X\",Index!D14=\"Reported\"),\"/\",\"!\")","v":"!"},"X","X","X","X","X","X","X","X","X","X","X","X","X","X","X","X","X","X","X","X","X","X","X","X","X","X","X","X","X","X","X","X","X"]
{"$rows_left_out":49}
{"sheet":"Hierarchies","index":4,"n_rows":250,"n_cols":15,"rows_kept":250,"cut":false,"hidden":true,"merged":[]}
["hier_dom080_001","hier_dom104_001","hier_dom098_001","hier_dom098_001","hier_dom001_001","hier_dom030_021","hier_dom091_001","hier_dom059_002","hier_dom094_001","hier_dom112_001","hier_dom100_001","hier_dom082_001","hier_dom113_001","hier_dom092_001","hier_dom108_001"]
["National GAAP","Individual","Not applicable / All or Total","Not applicable / All or Total","Yes","Albania","Alternative Investment Fund (AIF)","Hedge fund","Alternative Investment Fund (AIF)","Internal management","Payment service provider","Method A","Professional indemnity insurance","Capital","No trigger hit"]
["IFRS","Consolidated","Assets","Assets","No","Austria","Undertakings for Collective Investment in Transferable Securities (UCITS)","Private Equity Fund","Undertakings for Collective Investment in Transferable Securities (UCITS)","External management","Electronic money institution","Method B","Comparable guarantee","Profitability","Recovery trigger hit"]
[null,null,"Liabilities","Liabilities",null,"Belgium","Other than Alternative Investment Fund and Undertakings for Collective Investment in Transferable Securities","Real Estate Fund","Alternative Investment Fund and Undertakings for Collective Investment in Transferable Securities (AIF and UCITS)",null,"Payment service provider and Electronic money institution","Method C",null,"Liquidity","Exit trigger hit"]
[null,null,null,null,null,"Bulgaria",null,"Fund of funds",null,null,null,"No Method",null,"Other quantitative indicators"]
[null,null,null,null,null,"Cyprus",null,"Other"]
[null,null,null,null,null,"Czech Republic"]
[null,null,null,null,null,"Denmark"]
[null,null,null,null,null,"Estonia"]
[null,null,null,null,null,"Finland"]
{"$rows_left_out":241}
{"sheet":"T00.01","index":5,"n_rows":16,"n_cols":9,"rows_kept":16,"cut":false,"hidden":true,"merged":[[1,1,1,14],[4,1,4,11],[8,3,9,3]]}
["Back to Index"]
[null,"Table group 0: Nature of Report"]
[]
[]
[null,"T00.01 - Nature of Report (FINREP)"]
[]
[]
[]
[null,null,null,"x-axis"]
[]
{"$rows_left_out":7}
{"sheet":"T00.02","index":6,"n_rows":20,"n_cols":11,"rows_kept":20,"cut":false,"hidden":true,"merged":[[1,1,1,14],[4,1,4,11],[8,3,9,5],[10,3,12,3],[10,4,12,4],[10,5,12,5]]}
["Back to Index"]
[null,"Table group 1: Assets under management -  AUM additional details"]
[]
[]
[null,"T00.02 - Assets under management -  AUM additional details"]
[]
[]
[]
[null,null,null,"x-axis"]
[]
{"$rows_left_out":11}
{"sheet":"T00.03","index":7,"n_rows":24,"n_cols":10,"rows_kept":24,"cut":false,"hidden":true,"merged":[[1,1,1,14],[4,1,4,11],[8,3,9,4],[10,3,11,3],[10,4,11,4]]}
["Back to Index"]
[null,"Table group 2: Fund management - Number of participants / Assets under Management"]
[]
[]
[null,"T00.03 - Fund management - Number of participants / Assets under Management"]
[]
[]
[]
[null,null,null,"x-axis"]
[]
{"$rows_left_out":15}
{"sheet":"T01.01","index":8,"n_rows":94,"n_cols":9,"rows_kept":94,"cut":false,"hidden":true,"merged":[[1,1,1,14],[4,1,4,11],[8,3,9,3],[10,3,13,3]]}
["Back to Index"]
[null,"Table group 3: Balance Sheet Statement [Statement of Financial Position]"]
[]
[]
[null,"T01.01 - Balance Sheet Statement [Statement of Financial Position]: Assets"]
[]
[]
[]
[null,null,null,"x-axis"]
[]
{"$rows_left_out":85}
{"sheet":"T01.02","index":9,"n_rows":69,"n_cols":9,"rows_kept":69,"cut":false,"hidden":true,"merged":[[1,1,1,14],[4,1,4,11],[8,3,9,3],[10,3,13,3]]}
["Back to Index"]
[null,"Table group 3: Balance Sheet Statement [Statement of Financial Position]"]
[]
[]
[null,"T01.02 - Balance Sheet Statement [Statement of Financial Position]: Liabilities"]
[]
[]
[]
[null,null,null,"x-axis"]
[]
{"$rows_left_out":60}
{"sheet":"T01.03","index":10,"n_rows":77,"n_cols":9,"rows_kept":77,"cut":false,"hidden":true,"merged":[[1,1,1,14],[4,1,4,11],[8,3,9,3],[10,3,13,3]]}
["Back to Index"]
[null,"Table group 3: Balance Sheet Statement [Statement of Financial Position]"]
[]
[]
[null,"T01.03 - Balance Sheet Statement [Statement of Financial Position]: Equity"]
[]
[]
[]
[null,null,null,"x-axis"]
[]
{"$rows_left_out":68}
{"sheet":"T01.09","index":11,"n_rows":15,"n_cols":9,"rows_kept":15,"cut":false,"hidden":true,"merged":[[1,1,1,14],[4,1,4,11],[8,3,9,3]]}
["Back to Index"]
[null,"Table group 4: Details other assets / other liabilities"]
[]
[]
[null,"T01.09 - Details other assets and liabilities"]
[]
[]
[]
[null,null,null,"x-axis"]
[]
{"$rows_left_out":6}
{"sheet":"T02.00","index":12,"n_rows":98,"n_cols":9,"rows_kept":98,"cut":false,"hidden":true,"merged":[[1,1,1,14],[4,1,4,11],[8,3,9,3],[10,3,11,3]]}
["Back to Index"]
[null,"Table group 5: Statement of profit or loss"]
[]
[]
[null,"T02.00 - Statement of profit or loss"]
[]
[]
[]
[null,null,null,"x-axis"]
[]
{"$rows_left_out":89}
{"sheet":"T09.01","index":13,"n_rows":41,"n_cols":9,"rows_kept":41,"cut":false,"hidden":true,"merged":[[1,1,1,14],[4,1,4,11],[8,3,9,3],[10,3,11,3]]}
["Back to Index"]
[null,"Table group 6: Off-balance sheet items: commitment given"]
[]
[]
[null,"T09.01 - Off-balance sheet items subject to credit risk: Loan commitments, financial guarantees and other commitments given"]
[]
[]
[]
[null,null,null,"x-axis"]
[]
{"$rows_left_out":32}
{"sheet":"T09.02","index":14,"n_rows":36,"n_cols":10,"rows_kept":36,"cut":false,"hidden":true,"merged":[[1,1,1,14],[4,1,4,11],[8,3,9,4],[10,3,11,3],[10,4,11,4]]}
["Back to Index"]
[null,"Table group 7: Off-balance sheet items: commitments received"]
[]
[]
[null,"T09.02 - Loan commitments, financial guarantees and other commitments received"]
[]
[]
[]
[null,null,null,"x-axis"]
[]
{"$rows_left_out":27}
{"sheet":"T09.03","index":15,"n_rows":17,"n_cols":9,"rows_kept":17,"cut":false,"hidden":true,"merged":[[1,1,1,14],[4,1,4,11],[8,3,9,3]]}
["Back to Index"]
[null,"Table group 8: Off-balance sheet items: qualitative information"]
[]
[]
[null,"T09.03 - Off-balance sheet items: Qualitative information"]
[]
[]
[]
[null,null,null,"x-axis"]
[]
{"$rows_left_out":8}
{"sheet":"T11.09","index":16,"n_rows":14,"n_cols":19,"rows_kept":14,"cut":false,"hidden":true,"merged":[[1,1,1,14],[4,1,4,11],[8,3,9,13]]}
["Back to Index"]
[null,"Table group 9: Managed Funds: Breakdown by fund"]
[]
[]
[null,"T11.09 - Managed Funds: Breakdown by fund"]
[]
[]
[]
[null,null,null,"x-axis"]
[]
{"$rows_left_out":5}
{"sheet":"T22.09","index":17,"n_rows":24,"n_cols":9,"rows_kept":24,"cut":false,"hidden":true,"merged":[[1,1,1,14],[4,1,4,11],[8,3,9,3],[10,3,11,3]]}
["Back to Index"]
[null,"Table group 10: Fee and commission income by activity"]
[]
[]
[null,"T22.09 - Fee and commission income by activity"]
[]
[]
[]
[null,null,null,"x-axis"]
[]
{"$rows_left_out":15}
{"sheet":"T31.01","index":18,"n_rows":30,"n_cols":14,"rows_kept":30,"cut":false,"hidden":true,"merged":[[1,1,1,14],[4,1,4,11],[8,3,9,8],[10,3,11,3],[10,4,11,4],[10,5,11,5],[10,6,11,6],[10,7,11,7],[10,8,11,8]]}
["Back to Index"]
[null,"Table group 11: Related parties: amounts payable to and amounts receivable from"]
[]
[]
[null,"T31.01 - Related parties: amounts payable to and amounts receivable from"]
[]
[]
[]
[null,null,null,"x-axis"]
[]
{"$rows_left_out":21}
{"sheet":"T31.02","index":19,"n_rows":23,"n_cols":14,"rows_kept":23,"cut":false,"hidden":true,"merged":[[1,1,1,14],[4,1,4,11],[8,3,9,8]]}
["Back to Index"]
[null,"Table group 12: Related parties: expenses and income generated by transactions with"]
[]
[]
[null,"T31.02 - Related parties: expenses and income generated by transactions with"]
[]
[]
[]
[null,null,null,"x-axis"]
[]
{"$rows_left_out":14}
{"sheet":"T70.00","index":20,"n_rows":36,"n_cols":9,"rows_kept":36,"cut":false,"hidden":true,"merged":[[1,1,1,14],[4,1,4,11],[8,3,9,3],[10,3,11,3]]}
["Back to Index"]
[null,"Table group 13: Fixed overheads requirement calculation (IF3)"]
[]
[]
[null,"T70.00 - Fixed overheads requirement calculation (IF3)"]
[]
[]
[]
[null,null,null,"x-axis"]
[]
{"$rows_left_out":27}
{"sheet":"T70.01","index":21,"n_rows":27,"n_cols":9,"rows_kept":27,"cut":false,"hidden":true,"merged":[[1,1,1,14],[4,1,4,11],[8,3,9,3],[10,3,11,3]]}
["Back to Index"]
[null,"Table group 14: Fixed overheads requirement calculation (IF3)"]
[]
[]
[null,"T70.01 - Fixed overheads requirement calculation crowdfunder"]
[]
[]
[]
[null,null,null,"x-axis"]
[]
{"$rows_left_out":18}
{"sheet":"T71.00","index":22,"n_rows":33,"n_cols":9,"rows_kept":33,"cut":false,"hidden":true,"merged":[[1,1,1,14],[4,1,4,11],[8,3,9,3],[10,3,12,3]]}
["Back to Index"]
[null,"Table group 15: Capital requirements: Fund management"]
[]
[]
[null,"T71.00 - Capital requirements: Fund management"]
[]
[]
[]
[null,null,null,"x-axis"]
[]
{"$rows_left_out":24}
{"sheet":"T71.01","index":23,"n_rows":22,"n_cols":9,"rows_kept":22,"cut":false,"hidden":true,"merged":[[1,1,1,14],[4,1,4,11],[8,3,9,3],[10,3,11,3]]}
["Back to Index"]
[null,"Table group 16: Capital requirements: Fund management"]
[]
[]
[null,"T71.01 - Capital requirements: Crowdfunder"]
[]
[]
[]
[null,null,null,"x-axis"]
[]
{"$rows_left_out":13}
{"sheet":"T80.01","index":24,"n_rows":30,"n_cols":9,"rows_kept":30,"cut":false,"hidden":true,"merged":[[1,1,1,14],[4,1,4,11],[8,3,9,3],[10,3,12,3]]}
["Back to Index"]
[null,"Table group 17: General information for Payment services"]
[]
[]
[null,"T80.01 - General information for Payment services"]
[]
[]
[]
[null,null,null,"x-axis"]
[]
{"$rows_left_out":21}
{"sheet":"T80.02","index":25,"n_rows":60,"n_cols":9,"rows_kept":60,"cut":false,"hidden":true,"merged":[[1,1,1,14],[4,1,4,11],[8,3,9,3],[10,3,12,3]]}
["Back to Index"]
[null,"Table group 18:  General information for Payment service providers"]
[]
[]
[null,"T80.02 - General information for Payment service providers"]
[]
[]
[]
[null,null,null,"x-axis"]
[]
{"$rows_left_out":51}
{"sheet":"T80.03","index":26,"n_rows":28,"n_cols":9,"rows_kept":28,"cut":false,"hidden":true,"merged":[[1,1,1,14],[4,1,4,11],[8,3,9,3],[10,3,12,3]]}
["Back to Index"]
[null,"Table group 19: General information for Electronic Money Institutions"]
[]
[]
[null,"T80.03 - General information for Electronic Money Institutions"]
[]
[]
[]
[null,null,null,"x-axis"]
[]
{"$rows_left_out":19}
{"sheet":"T81.01","index":27,"n_rows":27,"n_cols":9,"rows_kept":27,"cut":false,"hidden":true,"merged":[[1,1,1,14],[4,1,4,11],[8,3,9,3],[10,3,11,3]]}
["Back to Index"]
[null,"Table group 20: Fee factor - base for calculating supervisory fee for payment service provider"]
[]
[]
[null,"T81.01 - Method A - Own funds based on fixed overheads (based on  (EU) 2015/337 Article 9 Method A)"]
[]
[]
[]
[null,null,null,"x-axis"]
[]
{"$rows_left_out":18}
{"sheet":"T81.02","index":28,"n_rows":27,"n_cols":9,"rows_kept":27,"cut":false,"hidden":true,"merged":[[1,1,1,14],[4,1,4,11],[8,3,9,3],[10,3,11,3]]}
["Back to Index"]
[null,"Table group 21: Calculation of Own funds - Method B - (EU) 2015/337 Article 9"]
[]
[]
[null,"T81.02 - Calculation of Own funds - Method B - (EU) 2015/337 Article 9"]
[]
[]
[]
[null,null,null,"x-axis"]
[]
{"$rows_left_out":18}
{"sheet":"T81.03","index":29,"n_rows":37,"n_cols":9,"rows_kept":37,"cut":false,"hidden":true,"merged":[[1,1,1,14],[4,1,4,11],[8,3,9,3],[10,3,12,3]]}
["Back to Index"]
[null,"Table group 22: Calculation of Own funds - Method C - (EU) 1915/337 Article 9"]
[]
[]
[null,"T81.03 - Calculation of Own funds - Method C - (EU) 2015/337 Article 9"]
[]
[]
[]
[null,null,null,"x-axis"]
[]
{"$rows_left_out":28}
{"sheet":"T82.00","index":30,"n_rows":14,"n_cols":14,"rows_kept":14,"cut":false,"hidden":true,"merged":[[1,1,1,14],[4,1,4,11],[8,3,9,8]]}
["Back to Index"]
[null,"Table group 23: Recovery and exit triggers"]
[]
[]
[null,"T82.00 - Recovery and exit triggers"]
[]
[]
[]
[null,null,null,"x-axis"]
[]
{"$rows_left_out":5}
{"sheet":"T83.00","index":31,"n_rows":32,"n_cols":9,"rows_kept":32,"cut":false,"hidden":true,"merged":[[1,1,1,14],[4,1,4,11],[8,3,9,3],[10,3,11,3]]}
["Back to Index"]
[null,"Table group 25: Third-party funds"]
[]
[]
[null,"T83.00 - Third-party funds"]
[]
[]
[]
[null,null,null,"x-axis"]
[]
{"$rows_left_out":23}
{"sheet":"T90.00","index":32,"n_rows":71,"n_cols":9,"rows_kept":71,"cut":false,"hidden":true,"merged":[[1,1,1,14],[4,1,4,11],[8,3,9,3],[10,3,15,3]]}
["Back to Index"]
[null,"Table group 24: Own funds composition"]
[]
[]
[null,"T90.00 - Own funds composition"]
[]
[]
[]
[null,null,null,"x-axis"]
[]
{"$rows_left_out":61}