{"text_format":"1","workbook":"xlsx","n_sheets":30,"sheets":["General data","XBRL Errors","Index","Show","Hierarchies","T8076","T8097a","T8097b","T9001HK1","T9001HK2","T9001HK3","T9001HK4","T9001HK5","T9001HK6","T9007HK1","T9007HK2","T9007HK3","T9007HK4","T9013HK1","T9013HK2","T9013HK3","T9013HK4","T9013HK5","T9013HK6","T9013HK7","T9013HK8","T9017HK1","T9017HK2","T9017HK3","T9017HK4"],"not_rendered":{"charts":0,"images":3,"macros":1,"external_links":0,"defined_names":42,"comments":0,"pivot_tables":0},"unopened":[],"bounds":{"document_bytes":16777216,"sheet_cells":100000,"rows_first":2000,"rows_last":500,"rows_between":2000,"halvings":0,"cell_chars":16384,"cell_head_chars":4096},"cells_cut":0,"cells_raw":0,"read":"whole","date_system":"1900"}

{"sheet":"General data","index":0,"n_rows":247,"n_cols":23,"rows_kept":247,"cut":false,"hidden":false,"merged":[[0,6,2,6],[3,0,5,9]]}
[null,null,null,null,null,null,null,"Version:",null,"2.1.0.1",null,null,null,null,null,null,"Not applicable/All geographical areas","http://standards.iso.org/iso/17442","Module with all tables","BSI-ALL","01","EUR","NL BSI 2.1.0"]
[null,null,null,null,null,null,null,null,null,null,null,null,null,null,null,null,"AFGHANISTAN","http://standards.iso.org/iso/17442","Balance sheet items monthly reporting full","BSIM-FULL","12","AED"]
[null,null,null,null,null,null,null," ",null,null,null,null,null,null,null,null,"ALBANIA","http://standards.iso.org/iso/17442","Balance sheet items monthly reporting limited","BSIM-LTD","13","AFN"]
[null,null,null,null,null,null,null,null,null,null,null,null,null,null,null,null,"ALGERIA","http://standards.iso.org/iso/17442","Balance sheet items quarterly reporting full","BSIQ-FULL","14","ALL"]
[null,null,null,null,null,null,null,null,null,null,null,null,null,null,null,null,"AMERICAN SAMOA","http://standards.iso.org/iso/17442","Balance sheet items quarterly reporting limited","BSIQ-LTD","15","AMD"]
[null,null,null,null,null,null,null,null,null,null,null,null,null,null,null,null,"ANDORRA","http://standards.iso.org/iso/17442","Minimum reserve monthly","MRRM","16","ANG"]
{"$rows_left_out":242}
{"sheet":"XBRL Errors","index":1,"n_rows":1,"n_cols":2,"rows_kept":1,"cut":false,"hidden":false,"merged":[]}
["Timestamp","Error"]

{"sheet":"Index","index":2,"n_rows":30,"n_cols":5,"rows_kept":30,"cut":false,"hidden":false,"merged":[[2,1,2,14]]}
[]
[]
[null,"Index"]
[]
[null,"Template Code","Template Name","Reporting Status"]
[null,"T8076","T8076 - Deposits with savings character for households in the Netherlands",null,{"$f":"IF($D$6=\"Reported\",\"@ForceFilingCode:true\",IF($D$6=\"Not Reported\",\"@ForceFilingCode:false\",\"\"))","v":""}]
{"$rows_left_out":25}
{"sheet":"Show","index":3,"n_rows":52,"n_cols":9,"rows_kept":52,"cut":false,"hidden":true,"merged":[]}
["Sheet","Prefix","BSI-ALL","BSIM-FULL","BSIM-LTD","BSIQ-FULL","BSIQ-LTD","MRRM","BSI-SIF"]
["T8076",{"$f":"IF(AND(HLOOKUP('General data'!$E$22,$C$1:$J$2,2,FALSE)=\"X\",Index!D6=\"Reported\"),\"/\",\"!\")","v":"!"},"X","X","X","X"]
["T8097a",{"$f":"IF(AND(HLOOKUP('General data'!$E$22,$C$1:$J$3,3,FALSE)=\"X\",Index!D7=\"Reported\"),\"/\",\"!\")","v":"!"},"X",null,null,null,null,"X"]
["T8097b",{"$f":"IF(AND(HLOOKUP('General data'!$E$22,$C$1:$J$4,4,FALSE)=\"X\",Index!D8=\"Reported\"),\"/\",\"!\")","v":"!"},"X","X","X","X",null,null,"X"]
["T9001HK1",{"$f":"IF(AND(HLOOKUP('General data'!$E$22,$C$1:$J$5,5,FALSE)=\"X\",Index!D9=\"Reported\"),\"/\",\"!\")","v":"!"},"X","X","X","X","X",null,"X"]
["T9001HK2",{"$f":"IF(AND(HLOOKUP('General data'!$E$22,$C$1:$J$6,6,FALSE)=\"X\",Index!D10=\"Reported\"),\"/\",\"!\")","v":"!"},"X","X","X","X","X",null,"X"]
{"$rows_left_out":47}
{"sheet":"Hierarchies","index":4,"n_rows":264,"n_cols":14,"rows_kept":264,"cut":false,"hidden":true,"merged":[]}
["hier_dom030_017","hier_dom030_017","hier_dom030_003","hier_dom030_003","hier_dom031_001","hier_dom031_001","hier_dom030_028","hier_dom030_028","hier_dom001_003","hier_dom001_003","hier_dom030_016","hier_dom030_016","hier_dom008_002","hier_dom008_002"]
["Not applicable / All or Total","Not applicable / All or Total","Not applicable / All or Total","Not applicable / All or Total","Not applicable / All or Total","Not applicable / All or Total","Not applicable / All or Total","Not applicable / All or Total","Not applicable / All or Total","Not applicable / All or Total","Not applicable / All or Total","Not applicable / All or Total","Not applicable / All or Total","Not applicable / All or Total"]
["Afghanistan","Afghanistan","Netherlands","Netherlands","Sales","Sales","Austria","Austria","Acting as servicer","Acting as servicer","Netherlands","Netherlands","MFI's","MFI's"]
["Albania","Albania","Rest of the euro area","Rest of the euro area","Repurchase","Repurchase","Belgium","Belgium","Not acting as servicer","Not acting as servicer","Rest of the euro area","Rest of the euro area","Non special purpose vehicles (SPV's) non MFI's","Non special purpose vehicles (SPV's) non MFI's"]
["Algeria","Algeria","Rest of the world (Outside EMU area)","Rest of the world (Outside EMU area)",null,null,"Croatia","Croatia",null,null,"Rest of the world (Outside EMU area)","Rest of the world (Outside EMU area)"]
["American Samoa (East)","American Samoa (East)",null,null,null,null,"Cyprus","Cyprus"]
{"$rows_left_out":259}
{"sheet":"T8076","index":5,"n_rows":18,"n_cols":13,"rows_kept":18,"cut":false,"hidden":true,"merged":[[1,1,1,14],[4,1,4,11],[8,3,9,7],[10,3,11,3],[10,4,11,4],[10,5,11,5],[10,6,11,6],[10,7,11,7]]}
["Back to Index"]
[null,"Table group 1: Savings households"]
[]
[]
[null,"T8076 - Deposits with savings character for households in the Netherlands"]
[]
{"$rows_left_out":13}
{"sheet":"T8097a","index":6,"n_rows":24,"n_cols":16,"rows_kept":24,"cut":false,"hidden":true,"merged":[[1,1,1,14],[4,1,4,11],[8,3,9,10],[10,3,10,6],[10,9,10,10],[11,3,11,4],[11,5,11,6],[11,7,12,7],[11,8,12,8],[11,9,11,10]]}
["Back to Index"]
[null,"Table group 2: Minimumreserve group a"]
[]
[]
[null,"T8097a - Reporting of statistical positions for calculating minimum reserves"]
[]
{"$rows_left_out":19}
{"sheet":"T8097b","index":7,"n_rows":24,"n_cols":10,"rows_kept":24,"cut":false,"hidden":true,"merged":[[1,1,1,14],[4,1,4,11],[8,3,9,4],[10,3,10,4],[11,3,11,4]]}
["Back to Index"]
[null,"Table group 2: Minimumreserve group b"]
[]
[]
[null,"T8097b - Reporting of statistical positions for calculating minimum reserves"]
[]
{"$rows_left_out":19}
{"sheet":"T9001HK1","index":8,"n_rows":216,"n_cols":32,"rows_kept":216,"cut":false,"hidden":true,"merged":[[14,23,15,23],[14,24,15,24],[14,25,15,25],[13,22,13,23],[13,24,13,25],[13,20,15,20],[13,21,15,21],[14,9,15,9],[14,10,15,10],[14,11,15,11],[14,13,15,13],[14,14,14,17],[13,6,15,6],[13,8,15,8],[13,9,13,11],[13,12,15,12],[13,13,13,19],[1,1,1,14],[4,1,4,11],[9,3,10,26],[11,3,11,7],[11,8,11,25],[11,26,15,26],[12,3,15,3],[12,4,12,6],[12,7,15,7],[12,8,12,11],[14,18,15,18],[14,19,15,19],[14,22,15,22],[12,12,12,25],[13,4,15,4],[13,5,15,5]]}
["Back to Index"]
[null,"Table group 3a: BSI positions"]
[]
[]
[null,"T9001HK1 - Debt positions owed by Dutch MFIs to counterparties in MFIs, government and private sector"]
[]
{"$rows_left_out":211}
{"sheet":"T9001HK2","index":9,"n_rows":59,"n_cols":32,"rows_kept":59,"cut":false,"hidden":true,"merged":[[14,23,15,23],[14,24,15,24],[14,25,15,25],[13,22,13,23],[13,24,13,25],[13,20,15,20],[13,21,15,21],[14,9,15,9],[14,10,15,10],[14,11,15,11],[14,13,15,13],[14,14,14,17],[13,6,15,6],[13,8,15,8],[13,9,13,11],[13,12,15,12],[13,13,13,19],[1,1,1,14],[4,1,4,11],[9,3,10,26],[11,3,11,7],[11,8,11,25],[11,26,15,26],[12,3,15,3],[12,4,12,6],[12,7,15,7],[12,8,12,11],[14,18,15,18],[14,19,15,19],[14,22,15,22],[12,12,12,25],[13,4,15,4],[13,5,15,5]]}
["Back to Index"]
[null,"Table group 3a: BSI positions"]
[]
[]
[null,"T9001HK2 - Securities held by Dutch MFIs"]
[]
{"$rows_left_out":54}
{"sheet":"T9001HK3","index":10,"n_rows":55,"n_cols":11,"rows_kept":55,"cut":false,"hidden":true,"merged":[[1,1,1,14],[4,1,4,11],[9,3,10,5],[11,3,11,4],[11,5,14,5],[12,3,14,3],[12,4,14,4]]}
["Back to Index"]
[null,"Table group 3b: BSI positions - loans granted and deposits placed - details"]
[]
[]
[null,"T9001HK3 - Loans granted and deposits placed with over-coverage of real estate as collateral (LTV ratio <= 1)"]
[]
{"$rows_left_out":50}
{"sheet":"T9001HK4","index":11,"n_rows":29,"n_cols":11,"rows_kept":29,"cut":false,"hidden":true,"merged":[[1,1,1,14],[4,1,4,11],[9,3,10,5],[11,3,11,4],[11,5,14,5],[12,3,14,3],[12,4,14,4]]}
["Back to Index"]
[null,"Table group 3b: BSI positions - loans granted and deposits placed - details"]
[]
[]
[null,"T9001HK4 - Loans granted and deposits placed in euros by Dutch MFIs, broken down into original and remaining maturities"]
[]
{"$rows_left_out":24}
{"sheet":"T9001HK5","index":12,"n_rows":61,"n_cols":10,"rows_kept":61,"cut":false,"hidden":true,"merged":[[1,1,1,14],[4,1,4,11],[8,3,9,4],[10,3,10,4],[11,3,12,3],[11,4,12,4]]}
["Back to Index"]
[null,"Table group 3c: BSI positions - business breakdown"]
[]
[]
[null,"T9001HK5 - Business breakdown of the loans granted and deposits placed by non-financial corporations"]
[]
{"$rows_left_out":56}
{"sheet":"T9001HK6","index":13,"n_rows":72,"n_cols":11,"rows_kept":72,"cut":false,"hidden":true,"merged":[[1,1,1,14],[4,1,4,11],[8,3,9,5],[10,3,14,3],[10,4,14,4],[10,5,14,5]]}
["Back to Index"]
[null,"Table group 3d: BSI positions - total overview"]
[]
[]
[null,"T9001HK6 - Total overview of the balance sheet items of Dutch MFIs"]
[]
{"$rows_left_out":67}
{"sheet":"T9007HK1","index":14,"n_rows":99,"n_cols":30,"rows_kept":99,"cut":false,"hidden":true,"merged":[[14,9,15,9],[14,10,15,10],[14,11,15,11],[14,12,15,12],[14,13,14,16],[13,12,13,18],[13,19,15,19],[13,20,15,20],[13,21,13,22],[13,23,15,23],[14,17,15,17],[14,18,15,18],[14,21,15,21],[14,22,15,22],[1,1,1,14],[4,1,4,11],[9,3,10,24],[11,3,11,7],[11,8,11,23],[11,24,15,24],[12,3,15,3],[12,4,12,6],[12,7,15,7],[12,8,12,11],[12,12,12,23],[13,4,15,4],[13,5,15,5],[13,6,15,6],[13,8,15,8],[13,9,13,11]]}
["Back to Index"]
[null,"Table group 4a: Write-downs and other price revaluations, additional information for sector MFIs, government and private sector"]
[]
[]
[null,"T9007HK1 - Write-downs and other price revaluations, additional information for sector MFIs, government and private sector"]
[]
{"$rows_left_out":94}
{"sheet":"T9007HK2","index":15,"n_rows":36,"n_cols":10,"rows_kept":36,"cut":false,"hidden":true,"merged":[[1,1,1,14],[4,1,4,11],[9,3,10,4],[11,3,13,3],[11,4,13,4]]}
["Back to Index"]
[null,"Table group 4b: Price revaluations for loans granted with over-coverage of real estate as collateral (LTV ratio <= 1)"]
[]
[]
[null,"T9007HK2 - Price revaluations for loans granted with over-coverage of real estate as collateral (LTV ratio <= 1)"]
[]
{"$rows_left_out":31}
{"sheet":"T9007HK3","index":16,"n_rows":22,"n_cols":15,"rows_kept":22,"cut":false,"hidden":true,"merged":[[1,1,1,14],[4,1,4,11],[9,3,10,9],[11,3,11,4],[11,5,11,6]]}
["Back to Index"]
[null,"Table group 4c: Other flows of participations and loans, additional information for sector MFIs, government and private sector"]
[]
[]
[null,"T9007HK3 - Other flows of participations and loans, additional information for sector MFIs, government and private sector"]
[]
{"$rows_left_out":17}
{"sheet":"T9007HK4","index":17,"n_rows":56,"n_cols":11,"rows_kept":56,"cut":false,"hidden":true,"merged":[[1,1,1,14],[4,1,4,11],[8,3,9,5],[10,3,14,3],[10,4,14,4],[10,5,14,5]]}
["Back to Index"]
[null,"Table group 4d: Total overview of write-downs and other price revaluations, additional information for total all sectors, not-allocated and grand total"]
[]
[]
[null,"T9007HK4 - Total overview of write-downs and other price revaluations, additional information for total all sectors, not-allocated and grand total"]
[]
{"$rows_left_out":51}
{"sheet":"T9013HK1","index":18,"n_rows":44,"n_cols":19,"rows_kept":44,"cut":false,"hidden":true,"merged":[[1,1,1,14],[4,1,4,11],[12,3,13,13],[14,3,16,3],[14,4,14,5],[14,6,16,6],[14,7,16,7],[14,8,16,8],[14,9,16,9],[14,10,14,11],[14,12,16,12],[14,13,16,13],[15,4,16,4],[15,5,16,5],[15,10,16,10],[15,11,16,11]]}
["Back to Index"]
[null,"Table group 5: Securitisation and other loan transfers"]
[]
[]
[null,"T9013HK1 - Gross flows (sold vs. repurchased) of securitised loans transferred to FVCs - Transactions with effect on reported position of loans in MFI balance sheet (‘derecognised’)"]
[]
{"$rows_left_out":39}
{"sheet":"T9013HK2","index":19,"n_rows":42,"n_cols":19,"rows_kept":42,"cut":false,"hidden":true,"merged":[[1,1,1,14],[4,1,4,11],[10,3,11,13],[12,3,14,3],[12,4,12,5],[12,6,14,6],[12,7,14,7],[12,8,14,8],[12,9,14,9],[12,10,12,11],[12,12,14,12],[12,13,14,13],[13,4,14,4],[13,5,14,5],[13,10,14,10],[13,11,14,11]]}
["Back to Index"]
[null,"Table group 5: Securitisation and other loan transfers"]
[]
[]
[null,"T9013HK2 - Net flows (sales less repurchases) of securitised loans to FVCs - Transactions without effect on reported position of loans in MFI balance sheet (‘not derecognised’)"]
[]
{"$rows_left_out":37}
{"sheet":"T9013HK3","index":20,"n_rows":42,"n_cols":19,"rows_kept":42,"cut":false,"hidden":true,"merged":[[1,1,1,14],[4,1,4,11],[10,3,11,13],[12,3,14,3],[12,4,12,5],[12,6,14,6],[12,7,14,7],[12,8,14,8],[12,9,14,9],[12,10,12,11],[12,12,14,12],[12,13,14,13],[13,4,14,4],[13,5,14,5],[13,10,14,10],[13,11,14,11]]}
["Back to Index"]
[null,"Table group 5: Securitisation and other loan transfers"]
[]
[]
[null,"T9013HK3 - Outstanding amounts of securitised loans transferred to FVCs (‘derecognised’) serviced by reporting agent"]
[]
{"$rows_left_out":37}
{"sheet":"T9013HK4","index":21,"n_rows":42,"n_cols":19,"rows_kept":42,"cut":false,"hidden":true,"merged":[[1,1,1,14],[4,1,4,11],[10,3,11,13],[12,3,14,3],[12,4,12,5],[12,6,14,6],[12,7,14,7],[12,8,14,8],[12,9,14,9],[12,10,12,11],[12,12,14,12],[12,13,14,13],[13,4,14,4],[13,5,14,5],[13,10,14,10],[13,11,14,11]]}
["Back to Index"]
[null,"Table group 5: Securitisation and other loan transfers"]
[]
[]
[null,"T9013HK4 - Outstanding amounts of securitised loans not tranferred to FVCs ('not derecognised')"]
[]
{"$rows_left_out":37}
{"sheet":"T9013HK5","index":22,"n_rows":45,"n_cols":19,"rows_kept":45,"cut":false,"hidden":true,"merged":[[1,1,1,14],[4,1,4,11],[13,3,14,13],[15,3,17,3],[15,4,15,5],[15,6,17,6],[15,7,17,7],[15,8,17,8],[15,9,17,9],[15,10,15,11],[15,12,17,12],[15,13,17,13],[16,4,17,4],[16,5,17,5],[16,10,17,10],[16,11,17,11]]}
["Back to Index"]
[null,"Table group 5: Securitisation and other loan transfers"]
[]
[]
[null,"T9013HK5 - Gross flows (sales/repurchases) of loans transferred to non-FVCs. With impact on reported stock."]
[]
{"$rows_left_out":40}
{"sheet":"T9013HK6","index":23,"n_rows":43,"n_cols":19,"rows_kept":43,"cut":false,"hidden":true,"merged":[[1,1,1,14],[4,1,4,11],[11,3,12,13],[13,3,15,3],[13,4,13,5],[13,6,15,6],[13,7,15,7],[13,8,15,8],[13,9,15,9],[13,10,13,11],[13,12,15,12],[13,13,15,13],[14,4,15,4],[14,5,15,5],[14,10,15,10],[14,11,15,11]]}
["Back to Index"]
[null,"Table group 5: Securitisation and other loan transfers"]
[]
[]
[null,"T9013HK6 - Outstanding amount of loans transferred to non-FVCs and serviced by reporting agent. With impact on reported stock"]
[]
{"$rows_left_out":38}
{"sheet":"T9013HK7","index":24,"n_rows":43,"n_cols":19,"rows_kept":43,"cut":false,"hidden":true,"merged":[[1,1,1,14],[4,1,4,11],[11,3,12,13],[13,3,15,3],[13,4,13,5],[13,6,15,6],[13,7,15,7],[13,8,15,8],[13,9,15,9],[13,10,13,11],[13,12,15,12],[13,13,15,13],[14,4,15,4],[14,5,15,5],[14,10,15,10],[14,11,15,11]]}
["Back to Index"]
[null,"Table group 5: Securitisation and other loan transfers"]
[]
[]
[null,"T9013HK7 - Net flows (sales less repurchases) of loans transferred to non-FVCs. Without impact on reported stock"]
[]
{"$rows_left_out":38}
{"sheet":"T9013HK8","index":25,"n_rows":43,"n_cols":19,"rows_kept":43,"cut":false,"hidden":true,"merged":[[1,1,1,14],[4,1,4,11],[11,3,12,13],[13,3,15,3],[13,4,13,5],[13,6,15,6],[13,7,15,7],[13,8,15,8],[13,9,15,9],[13,10,13,11],[13,12,15,12],[13,13,15,13],[14,4,15,4],[14,5,15,5],[14,10,15,10],[14,11,15,11]]}
["Back to Index"]
[null,"Table group 5: Securitisation and other loan transfers"]
[]
[]
[null,"T9013HK8 - Outstanding amount of loans transferred to non-FVCs. Without impact on reported stock."]
[]
{"$rows_left_out":38}
{"sheet":"T9017HK1","index":26,"n_rows":42,"n_cols":19,"rows_kept":42,"cut":false,"hidden":true,"merged":[[1,1,1,14],[4,1,4,11],[10,3,11,13],[12,3,14,3],[12,4,12,5],[12,6,14,6],[12,7,14,7],[12,8,14,8],[12,9,14,9],[12,10,12,11],[12,12,14,12],[12,13,14,13],[13,4,14,4],[13,5,14,5],[13,10,14,10],[13,11,14,11]]}
["Back to Index"]
[null,"Table group 6: Write-downs and other price revaluations on securitised and transferred loans"]
[]
[]
[null,"T9017HK1 - Write-downs and other price revaluations on outstanding amounts of securitised loans to FVC ('derecognised') and serviced by reporting agent"]
[]
{"$rows_left_out":37}
{"sheet":"T9017HK2","index":27,"n_rows":42,"n_cols":19,"rows_kept":42,"cut":false,"hidden":true,"merged":[[1,1,1,14],[4,1,4,11],[10,3,11,13],[12,3,14,3],[12,4,12,5],[12,6,14,6],[12,7,14,7],[12,8,14,8],[12,9,14,9],[12,10,12,11],[12,12,14,12],[12,13,14,13],[13,4,14,4],[13,5,14,5],[13,10,14,10],[13,11,14,11]]}
["Back to Index"]
[null,"Table group 6: Write-downs and other price revaluations on securitised and transferred loans"]
[]
[]
[null,"T9017HK2 - Write-downs and other price revaluations on outstanding amounts of securitised loans not transferred to FVC ('not derecognised')"]
[]
{"$rows_left_out":37}
{"sheet":"T9017HK3","index":28,"n_rows":43,"n_cols":19,"rows_kept":43,"cut":false,"hidden":true,"merged":[[1,1,1,14],[4,1,4,11],[11,3,12,13],[13,3,15,3],[13,4,13,5],[13,6,15,6],[13,7,15,7],[13,8,15,8],[13,9,15,9],[13,10,13,11],[13,12,15,12],[13,13,15,13],[14,4,15,4],[14,5,15,5],[14,10,15,10],[14,11,15,11]]}
["Back to Index"]
[null,"Table group 6: Write-downs and other price revaluations on securitised and transferred loans"]
[]
[]
[null,"T9017HK3 - Write-downs and other price revaluations on outstanding amounts of loans transferred to non-FVCs. With impact on reported stock"]
[]
{"$rows_left_out":38}
{"sheet":"T9017HK4","index":29,"n_rows":43,"n_cols":19,"rows_kept":43,"cut":false,"hidden":true,"merged":[[1,1,1,14],[4,1,4,11],[11,3,12,13],[13,3,15,3],[13,4,13,5],[13,6,15,6],[13,7,15,7],[13,8,15,8],[13,9,15,9],[13,10,13,11],[13,12,15,12],[13,13,15,13],[14,4,15,4],[14,5,15,5],[14,10,15,10],[14,11,15,11]]}
["Back to Index"]
[null,"Table group 6: Write-downs and other price revaluations on securitised and transferred loans"]
[]
[]
[null,"T9017HK4 - Write-downs and other price revaluations on outstanding amounts of loans transferred to non-FVCs. Without impact on reported stock"]
[]
{"$rows_left_out":37}