{"text_format":"1","workbook":"xlsx","n_sheets":23,"sheets":["General data","XBRL Errors","Index","Show","Hierarchies","R_01.00","R_06.00","R_04.00","R_08.00","R_07.00","R_01.01","R_06.01","R_04.01","R_02.00","R_02.01","R_02.02","R_03.00","R_05.00","R_05.01","R_09.00","R_10.00","R_11.00","R_12.00"],"not_rendered":{"charts":0,"images":3,"macros":1,"external_links":0,"defined_names":38,"comments":0,"pivot_tables":0},"unopened":[],"bounds":{"document_bytes":16777216,"sheet_cells":100000,"rows_first":2000,"rows_last":500,"rows_between":2000,"halvings":0,"cell_chars":16384,"cell_head_chars":4096},"cells_cut":0,"cells_raw":0,"read":"whole","date_system":"1900"}

{"sheet":"General data","index":0,"n_rows":247,"n_cols":23,"rows_kept":247,"cut":false,"hidden":false,"merged":[[0,6,2,6],[3,0,5,9]]}
[null,null,null,null,null,null,null,"Version:",null,"3.2.2.0.1",null,null,null,null,null,null,"Not applicable/All geographical areas","http://standards.iso.org/iso/17442","Remuneration Benchmarking","REM_BM: REMUNERATION BENCHMARKING","01","EUR","EBA 3.2.0 REM"]
[null,null,null,null,null,null,null,null,null,null,null,null,null,null,null,null,"AFGHANISTAN","http://standards.iso.org/iso/17442","Remuneration on gender pay gap","REM_GAP: REMUNERATION ON GENDER PAY GAP","14","AED"]
[null,null,null,null,null,null,null," ",null,null,null,null,null,null,null,null,"ALBANIA","http://standards.iso.org/iso/17442","Remuneration High Earners","REM_HE: REMUNERATION HIGH EARNERS","15","AFN"]
[null,null,null,null,null,null,null,null,null,null,null,null,null,null,null,null,"ALGERIA","http://standards.iso.org/iso/17442","Remunerations approved higher ratios, Country level","REM_HR_COUNTRY: REMUNERATIONS APPROVED HIGHER RATIOS, COUNTRY LEVEL","16","ALL"]
[null,null,null,null,null,null,null,null,null,null,null,null,null,null,null,null,"AMERICAN SAMOA","http://standards.iso.org/iso/17442","Remunerations approved higher ratios, Institution level","REM_HR_INSTITUTION: REMUNERATIONS APPROVED HIGHER RATIOS, INSTITUTION LEVEL","17","AMD"]
[null,null,null,null,null,null,null,null,null,null,null,null,null,null,null,null,"ANDORRA","http://standards.iso.org/iso/17442",null,null,"18","ANG"]
[null,null,null,null,null,null,null,null,null,null,null,null,null,null,null,null,"ANGOLA","http://standards.iso.org/iso/17442",null,null,"19","AOA"]
[null,"General Data",null,null,null,null,null,null,null,null,null,"/General data label{B}","/General data value{E}",null,null,null,"ANGUILLA","http://standards.iso.org/iso/17442",null,null,"20","ARS"]
[null,null,null,null,null,null,null,null,null,null,null,null,null,null,null,null,"ANTARCTICA","http://standards.iso.org/iso/17442",null,null,"All","AUD"]
["*","Identifier",":","LEGALIDENTIFIER20POS",{"$f":"\"\"&D10","v":"LEGALIDENTIFIER20POS"},{"$f":"IF(D10=\"\",1,0)","v":0},null,null,null,null,null,null,null,null,null,null,"ANTIGUA AND BARBUDA","http://standards.iso.org/iso/17442",null,null,"All","AWG"]
{"$rows_left_out":238}
{"sheet":"XBRL Errors","index":1,"n_rows":1,"n_cols":2,"rows_kept":1,"cut":false,"hidden":false,"merged":[]}
["Timestamp","Error"]

{"sheet":"Index","index":2,"n_rows":23,"n_cols":5,"rows_kept":23,"cut":false,"hidden":false,"merged":[[2,1,2,14]]}
[]
[]
[null,"Index"]
[]
[null,"Template Code","Template Name","Reporting Status"]
[null,"R_01.00","Information on remuneration for all staff",null,{"$f":"IF($D$6=\"Reported\",\"@ForceFilingCode:true\",IF($D$6=\"Not Reported\",\"@ForceFilingCode:false\",\"\"))","v":""}]
[null,"R_06.00","Information on the gender pay gap",null,{"$f":"IF($D$7=\"Reported\",\"@ForceFilingCode:true\",IF($D$7=\"Not Reported\",\"@ForceFilingCode:false\",\"\"))","v":""}]
[null,"R_04.00","Information on the remuneration of high earners",null,{"$f":"IF($D$8=\"Reported\",\"@ForceFilingCode:true\",IF($D$8=\"Not Reported\",\"@ForceFilingCode:false\",\"\"))","v":""}]
[null,"R_08.00","Approved higher ratios between variable and fixed remuneration – aggregation by competent authorities",null,{"$f":"IF($D$9=\"Reported\",\"@ForceFilingCode:true\",IF($D$9=\"Not Reported\",\"@ForceFilingCode:false\",\"\"))","v":""}]
[null,"R_07.00","Approved higher ratios between variable and fixed remuneration – institutions",null,{"$f":"IF($D$10=\"Reported\",\"@ForceFilingCode:true\",IF($D$10=\"Not Reported\",\"@ForceFilingCode:false\",\"\"))","v":""}]
{"$rows_left_out":14}
{"sheet":"Show","index":3,"n_rows":45,"n_cols":7,"rows_kept":45,"cut":false,"hidden":true,"merged":[]}
["Sheet","Prefix","REM_BM: REMUNERATION BENCHMARKING","REM_GAP: REMUNERATION ON GENDER PAY GAP","REM_HE: REMUNERATION HIGH EARNERS","REM_HR_COUNTRY: REMUNERATIONS APPROVED HIGHER RATIOS, COUNTRY LEVEL","REM_HR_INSTITUTION: REMUNERATIONS APPROVED HIGHER RATIOS, INSTITUTION LEVEL"]
["R_01.00",{"$f":"IF(HLOOKUP('General data'!$E$22,$C$1:$G$2,2,FALSE)=\"X\",\"/\",\"!\")","v":"/"},"X"]
["R_06.00",{"$f":"IF(HLOOKUP('General data'!$E$22,$C$1:$G$3,3,FALSE)=\"X\",\"/\",\"!\")","v":"!"},null,"X"]
["R_04.00",{"$f":"IF(HLOOKUP('General data'!$E$22,$C$1:$G$4,4,FALSE)=\"X\",\"/\",\"!\")","v":"!"},null,null,"X"]
["R_08.00",{"$f":"IF(HLOOKUP('General data'!$E$22,$C$1:$G$5,5,FALSE)=\"X\",\"/\",\"!\")","v":"!"},null,null,null,"X"]
["R_07.00",{"$f":"IF(HLOOKUP('General data'!$E$22,$C$1:$G$6,6,FALSE)=\"X\",\"/\",\"!\")","v":"!"},null,null,null,null,"X"]
["R_01.01",{"$f":"IF(AND(HLOOKUP('General data'!$E$22,$C$1:$H$7,7,FALSE)=\"X\",Index!D11=\"Reported\"),\"/\",\"!\")","v":"!"},"X"]
["R_06.01",{"$f":"IF(AND(HLOOKUP('General data'!$E$22,$C$1:$H$8,8,FALSE)=\"X\",Index!D12=\"Reported\"),\"/\",\"!\")","v":"!"},null,"X"]
["R_04.01",{"$f":"IF(AND(HLOOKUP('General data'!$E$22,$C$1:$H$9,9,FALSE)=\"X\",Index!D13=\"Reported\"),\"/\",\"!\")","v":"!"},null,null,"X"]
["R_02.00",{"$f":"IF(AND(HLOOKUP('General data'!$E$22,$C$1:$H$10,10,FALSE)=\"X\",Index!D14=\"Reported\"),\"/\",\"!\")","v":"!"},"X"]
{"$rows_left_out":36}
{"sheet":"Hierarchies","index":4,"n_rows":104,"n_cols":6,"rows_kept":104,"cut":false,"hidden":true,"merged":[]}
["hier_IA_IA1","hier_IA_IA1","hier_IA_IA2","hier_IA_IA2","hier_GA_GA9","hier_GA_GA9"]
[">= 1,000,000 and < 1 500,000",">= 1,000,000 and < 1 500,000",">= 1,000,000 and < 2,000,000",">= 1,000,000 and < 2,000,000","AUSTRIA","AUSTRIA"]
[">= 1,500,000 and < 2,000,000",">= 1,500,000 and < 2,000,000",">= 2,000,000 and < 3,000,000",">= 2,000,000 and < 3,000,000","BELGIUM","BELGIUM"]
[">= 2,000,000 and < 2,500,000",">= 2,000,000 and < 2,500,000",">= 3,000,000 and < 4,000,000",">= 3,000,000 and < 4,000,000","BULGARIA","BULGARIA"]
[">= 2,500,000 and < 3,000,000",">= 2,500,000 and < 3,000,000",">= 4,000,000 and < 5,000,000",">= 4,000,000 and < 5,000,000","CROATIA","CROATIA"]
[">= 3,000,000 and < 3,500,000",">= 3,000,000 and < 3,500,000",">= 5,000,000 and < 6,000,000",">= 5,000,000 and < 6,000,000","CYPRUS","CYPRUS"]
[">= 3,500,000 and < 4,000,000",">= 3,500,000 and < 4,000,000",">= 6,000,000 and < 7,000,000",">= 6,000,000 and < 7,000,000","CZECH REPUBLIC","CZECH REPUBLIC"]
[">= 4,000,000 and < 4,500,000",">= 4,000,000 and < 4,500,000",">= 7,000,000 and < 8,000,000",">= 7,000,000 and < 8,000,000","DENMARK","DENMARK"]
[">= 4,500,000 and < 5,000,000",">= 4,500,000 and < 5,000,000",">= 8,000,000 and < 9,000,000",">= 8,000,000 and < 9,000,000","ESTONIA","ESTONIA"]
[">= 5,000,000 and < 6,000,000",">= 5,000,000 and < 6,000,000",">= 9,000,000 and < 10,000,000",">= 9,000,000 and < 10,000,000","FINLAND","FINLAND"]
{"$rows_left_out":95}
{"sheet":"R_01.00","index":5,"n_rows":23,"n_cols":19,"rows_kept":23,"cut":false,"hidden":false,"merged":[[10,10,11,10],[10,11,11,11],[10,12,11,12],[1,1,1,14],[4,1,4,11],[8,3,9,12],[10,3,11,3],[10,4,11,4],[10,5,11,5],[10,6,11,6],[10,7,11,7],[10,8,11,8],[10,9,11,9]]}
["Back to Index"]
[null,"Information on remuneration for all staff"]
[]
[]
[null,"R 01.00"]
[]
[]
[]
[null,null,null,"Columns"]
[]
{"$rows_left_out":14}
{"sheet":"R_06.00","index":6,"n_rows":33,"n_cols":19,"rows_kept":33,"cut":false,"hidden":true,"merged":[[23,3,23,6],[23,7,23,10],[1,1,1,14],[4,1,4,11],[8,3,9,3],[17,1,17,11],[21,3,22,10]]}
["Back to Index"]
[null,"Information on the gender pay gap"]
[]
[]
[null,"R 06.00.a"]
[]
[]
[]
[null,null,null,"Columns"]
[]
{"$rows_left_out":24}
{"sheet":"R_04.00","index":7,"n_rows":84,"n_cols":18,"rows_kept":84,"cut":false,"hidden":true,"merged":[[1,1,1,14],[4,1,4,11],[6,1,6,2],[7,1,7,2],[10,3,11,11],[77,3,78,11],[12,8,14,8],[12,9,14,9],[12,10,14,10],[12,11,14,11],[57,1,57,11],[59,1,59,2],[12,3,14,3],[12,4,14,4],[12,5,14,5],[12,6,14,6],[12,7,14,7],[60,1,60,2],[63,3,64,10],[71,1,71,11],[73,1,73,2],[74,1,74,2]]}
["Back to Index"]
[null,"Information on the remuneration of high earners"]
[]
[]
[null,"R 04.00.a"]
[]
[null,"Payment band",null,null,null,null,null,null,null,null,null,null,null,null,null,null,{"$f":"Show!$B$4&\"R 04.00.a Table {\"&COLUMN($B$1)&\"}\"","v":"!R 04.00.a Table {2}"}]
[null,"EEA state in which high earner is located",null,null,null,null,null,null,null,null,null,null,null,null,null,null,{"$f":"Show!$B$4&Show!$B$4&\"R 04.00.a Table {\"&COLUMN($D$1)&\"}\"","v":"!!R 04.00.a Table {4}"}]
[]
[]
{"$rows_left_out":75}
{"sheet":"R_08.00","index":8,"n_rows":29,"n_cols":10,"rows_kept":29,"cut":false,"hidden":true,"merged":[[1,1,1,14],[4,1,4,11],[8,3,9,3],[10,3,11,3]]}
["Back to Index"]
[null,"Approved higher ratios between variable and fixed remuneration – aggregation by competent authorities"]
[]
[]
[null,"R 08.00"]
[]
[]
[]
[null,null,null,"Columns"]
[]
{"$rows_left_out":20}
{"sheet":"R_07.00","index":9,"n_rows":21,"n_cols":10,"rows_kept":21,"cut":false,"hidden":true,"merged":[[1,1,1,14],[4,1,4,11],[8,3,9,3]]}
["Back to Index"]
[null,"Approved higher ratios between variable and fixed remuneration – institutions"]
[]
[]
[null,"R 07.00"]
[]
[]
[]
[null,null,null,"Columns"]
[]
{"$rows_left_out":12}
{"sheet":"R_01.01","index":10,"n_rows":25,"n_cols":18,"rows_kept":25,"cut":false,"hidden":true,"merged":[[10,10,11,10],[10,11,11,11],[1,1,1,14],[4,1,4,11],[8,3,9,11],[10,3,11,3],[10,4,11,4],[10,5,11,5],[10,6,11,6],[10,7,11,7],[10,8,11,8],[10,9,11,9]]}
["Back to Index"]
[null,"General information and information on remuneration for all staff in investment firms"]
[]
[]
[null,"R 01.01"]
[]
[]
[]
[null,null,null,"Columns"]
[]
{"$rows_left_out":16}
{"sheet":"R_06.01","index":11,"n_rows":33,"n_cols":19,"rows_kept":33,"cut":false,"hidden":true,"merged":[[23,3,23,6],[23,7,23,10],[1,1,1,14],[4,1,4,11],[8,3,9,3],[17,1,17,11],[21,3,22,10]]}
["Back to Index"]
[null,"Information on the gender pay gap for IF"]
[]
[]
[null,"R 06.01.a"]
[]
[]
[]
[null,null,null,"Columns"]
[]
{"$rows_left_out":24}
{"sheet":"R_04.01","index":12,"n_rows":87,"n_cols":17,"rows_kept":87,"cut":false,"hidden":true,"merged":[[63,1,63,2],[1,1,1,14],[4,1,4,11],[6,1,6,2],[7,1,7,2],[10,3,11,10],[12,3,14,3],[12,4,14,4],[12,5,14,5],[12,6,14,6],[12,7,14,7],[12,8,14,8],[12,9,14,9],[12,10,14,10],[60,1,60,11],[62,1,62,2],[66,3,67,9],[74,1,74,11],[76,1,76,2],[77,1,77,2],[80,3,81,10]]}
["Back to Index"]
[null,"Information on the remuneration of high earners - IFD"]
[]
[]
[null,"R 04.01.a"]
[]
[null,"Payment band",null,null,null,null,null,null,null,null,null,null,null,null,null,{"$f":"Show!$B$9&\"R 04.01.a Table {\"&COLUMN($B$1)&\"}\"","v":"!R 04.01.a Table {2}"},{"$f":"Show!$B$9&Show!$B$9&\"R 04.01.a Table {\"&COLUMN($D$1)&\"}\"","v":"!!R 04.01.a Table {4}"}]
[null,"EEA state in which high earner is located"]
[]
[]
{"$rows_left_out":78}
{"sheet":"R_02.00","index":13,"n_rows":19,"n_cols":13,"rows_kept":19,"cut":false,"hidden":true,"merged":[[1,1,1,14],[4,1,4,11],[8,3,9,6]]}
["Back to Index"]
[null,"Information on remuneration of identified staff"]
[]
[]
[null,"R 02.00"]
[]
[]
[]
[null,null,null,"Columns"]
[]
{"$rows_left_out":10}
{"sheet":"R_02.01","index":14,"n_rows":59,"n_cols":13,"rows_kept":59,"cut":false,"hidden":true,"merged":[[1,1,1,14],[4,1,4,11],[8,3,9,6],[10,3,12,3],[10,4,12,4],[10,5,12,5],[10,6,12,6]]}
["Back to Index"]
[null,"Information on remuneration of identified staff in investment firms"]
[]
[]
[null,"R 02.01"]
[]
[]
[]
[null,null,null,"Columns"]
[]
{"$rows_left_out":50}
{"sheet":"R_02.02","index":15,"n_rows":22,"n_cols":18,"rows_kept":22,"cut":false,"hidden":true,"merged":[[10,10,11,10],[10,11,11,11],[1,1,1,14],[4,1,4,11],[8,3,9,11],[10,3,11,3],[10,4,11,4],[10,5,11,5],[10,6,11,6],[10,7,11,7],[10,8,11,8],[10,9,11,9]]}
["Back to Index"]
[null,"Information on remuneration of identified staff per business area"]
[]
[]
[null,"R 02.02"]
[]
[]
[]
[null,null,null,"Columns"]
[]
{"$rows_left_out":13}
{"sheet":"R_03.00","index":16,"n_rows":14,"n_cols":10,"rows_kept":14,"cut":false,"hidden":true,"merged":[[1,1,1,14],[4,1,4,11],[8,3,9,3]]}
["Back to Index"]
[null,"Information on identified staff remunerated EUR 1 million or more per financial year"]
[]
[]
[null,"R 03.00"]
[]
[]
[]
[null,null,null,"Columns"]
[]
{"$rows_left_out":5}
{"sheet":"R_05.00","index":17,"n_rows":35,"n_cols":11,"rows_kept":35,"cut":false,"hidden":true,"merged":[[1,1,1,14],[4,1,4,11],[8,3,9,4],[10,3,11,3],[10,4,11,4]]}
["Back to Index"]
[null,"Derogations from the application of requirements to pay out parts of variable remuneration deferred and in instruments under Directive 2013/36/EU (CRD)"]
[]
[]
[null,"R 05.00"]
[]
[]
[]
[null,null,null,"Columns"]
[]
{"$rows_left_out":26}
{"sheet":"R_05.01","index":18,"n_rows":35,"n_cols":11,"rows_kept":35,"cut":false,"hidden":true,"merged":[[1,1,1,14],[4,1,4,11],[8,3,9,4],[10,3,11,3],[10,4,11,4]]}
["Back to Index"]
[null,"Derogations from the application of requirement to pay out a part of variable remuneration deferred and in instruments for investment firms under Directive (EU) 2019/2034"]
[]
[]
[null,"R 05.01"]
[]
[]
[]
[null,null,null,"Columns"]
[]
{"$rows_left_out":26}
{"sheet":"R_09.00","index":19,"n_rows":39,"n_cols":13,"rows_kept":39,"cut":false,"hidden":true,"merged":[[1,1,1,14],[4,1,4,11],[8,3,9,6],[10,3,13,3],[10,4,13,4],[10,5,13,5],[10,6,13,6]]}
["Back to Index"]
[null,"Remuneration awarded for the financial year"]
[]
[]
[null,"R 09.00"]
[]
[]
[]
[null,null,null,"Columns"]
[]
{"$rows_left_out":30}
{"sheet":"R_10.00","index":20,"n_rows":30,"n_cols":13,"rows_kept":30,"cut":false,"hidden":true,"merged":[[1,1,1,14],[4,1,4,11],[8,3,9,6],[10,3,12,3],[10,4,12,4],[10,5,12,5],[10,6,12,6]]}
["Back to Index"]
[null,"Special payments  to staff whose professional activities have a material impact on institutions’ risk profile (identified staff)"]
[]
[]
[null,"R 10.00"]
[]
[]
[]
[null,null,null,"Columns"]
[]
{"$rows_left_out":21}
{"sheet":"R_11.00","index":21,"n_rows":41,"n_cols":18,"rows_kept":41,"cut":false,"hidden":true,"merged":[[1,1,1,14],[4,1,4,11],[8,3,9,10],[10,3,10,10],[11,3,11,5],[11,6,12,6],[11,7,12,7],[11,8,12,8],[11,9,12,9],[11,10,12,10]]}
["Back to Index"]
[null,"Deferred remuneration"]
[]
[]
[null,"R 11.00"]
[]
[]
[]
[null,null,null,"Columns"]
[]
{"$rows_left_out":32}
{"sheet":"R_12.00","index":22,"n_rows":35,"n_cols":20,"rows_kept":35,"cut":false,"hidden":true,"merged":[[25,3,26,9],[27,3,27,9],[1,1,1,14],[4,1,4,11],[8,3,9,11],[10,3,10,5],[10,6,10,11],[21,1,21,11]]}
["Back to Index"]
[null,"Information on remuneration of staff whose professional activities have a material impact on institutions’ risk profile (identified staff)"]
[]
[]
[null,"R 12.00.a"]
[]
[]
[]
[null,null,null,"Columns"]
[]
{"$rows_left_out":25}