{"text_format":"1","workbook":"xlsx","n_sheets":25,"sheets":["General data","XBRL Errors","Index","Show","Hierarchies","M_01.00","J_10.01","M_02.00","J_10.02","M_03.00","J_11.01","M_04.00","J_11.02","M_05.00","J_08.00","M_06.00","J_09.00","M_07.00","J_05.00","J_06.00","J_07.00","J_02.00","J_03.00","J_04.00","J_01.00"],"not_rendered":{"charts":0,"images":3,"macros":1,"external_links":0,"defined_names":86,"comments":0,"pivot_tables":0},"unopened":[],"bounds":{"document_bytes":16777216,"sheet_cells":100000,"rows_first":2000,"rows_last":500,"rows_between":2000,"halvings":0,"cell_chars":16384,"cell_head_chars":4096},"cells_cut":0,"cells_raw":0,"read":"whole","date_system":"1900"}

{"sheet":"General data","index":0,"n_rows":247,"n_cols":23,"rows_kept":247,"cut":false,"hidden":false,"merged":[[0,6,2,6],[3,0,5,9]]}
[null,null,null,null,null,null,null,"Version:",null,"3.4.0.0.1",null,null,null,null,null,null,"Not applicable/All geographical areas","https://eurofiling.info/eu/rs","MREL TLAC","MREL_TLAC: MREL TLAC","01","EUR","EBA 3.4.0"]
[null,null,null,null,null,null,null,null,null,null,null,null,null,null,null,null,"AFGHANISTAN","https://eurofiling.info/eu/rs","Interest Rate Risk in the Banking Book","IRRBB: INTEREST RATE RISK IN THE BANKING BOOK","17","AED"]
[null,null,null,null,null,null,null," ",null,null,null,null,null,null,null,null,"ALBANIA","https://eurofiling.info/eu/rs",null,null,"18","AFN"]
[null,null,null,null,null,null,null,null,null,null,null,null,null,null,null,null,"ALGERIA","https://eurofiling.info/eu/rs",null,null,"19","ALL"]
[null,null,null,null,null,null,null,null,null,null,null,null,null,null,null,null,"AMERICAN SAMOA","https://eurofiling.info/eu/rs",null,null,"20","AMD"]
[null,null,null,null,null,null,null,null,null,null,null,null,null,null,null,null,"ANDORRA","https://eurofiling.info/eu/rs",null,null,"All","ANG"]
{"$rows_left_out":242}
{"sheet":"XBRL Errors","index":1,"n_rows":3,"n_cols":2,"rows_kept":3,"cut":false,"hidden":false,"merged":[]}
["Timestamp","Error"]
["2024-09-11T10:47:44","FILING RULE ERROR S 2.8.(c): inappropriateSchemeOrIdentifier: If scheme 'http://standards.iso.org/iso/17442' or scheme 'LEI' has been used, the identifier must be a valid LEI-code. Please use the national identifierScheme when reporting with a national Identifier."]
["2024-09-11T10:47:44","v16332_s: [J 01.00 (r0030;0150;0180;0190;0200, c0010, All sheets)] {J 01.00} >= 0 FAILS because -2342 >= 0 is not true (Warning)"]

{"sheet":"Index","index":2,"n_rows":25,"n_cols":5,"rows_kept":25,"cut":false,"hidden":false,"merged":[[2,1,2,14]]}
[]
[]
[null,"Index"]
[]
[null,"Template Code","Template Name","Reporting Status"]
[null,"M_01.00","MREL and TLAC key metrics (resolution groups / entities) (KM2)",null,{"$f":"IF($D$6=\"Reported\",\"@ForceFilingCode:true\",IF($D$6=\"Not Reported\",\"@ForceFilingCode:false\",\"\"))","v":""}]
{"$rows_left_out":20}
{"sheet":"Show","index":3,"n_rows":49,"n_cols":4,"rows_kept":49,"cut":false,"hidden":true,"merged":[]}
["Sheet","Prefix","MREL_TLAC: MREL TLAC","IRRBB: INTEREST RATE RISK IN THE BANKING BOOK"]
["M_01.00",{"$f":"IF(HLOOKUP('General data'!$E$22,$C$1:$D$2,2,FALSE)=\"X\",\"/\",\"!\")","v":"!"},"X"]
["J_10.01",{"$f":"IF(HLOOKUP('General data'!$E$22,$C$1:$D$3,3,FALSE)=\"X\",\"/\",\"!\")","v":"/"},null,"X"]
["M_02.00",{"$f":"IF(AND(HLOOKUP('General data'!$E$22,$C$1:$E$4,4,FALSE)=\"X\",Index!D8=\"Reported\"),\"/\",\"!\")","v":"!"},"X"]
["J_10.02",{"$f":"IF(AND(HLOOKUP('General data'!$E$22,$C$1:$E$5,5,FALSE)=\"X\",Index!D9=\"Reported\"),\"/\",\"!\")","v":"!"},null,"X"]
["M_03.00",{"$f":"IF(AND(HLOOKUP('General data'!$E$22,$C$1:$E$6,6,FALSE)=\"X\",Index!D10=\"Reported\"),\"/\",\"!\")","v":"!"},"X"]
{"$rows_left_out":44}
{"sheet":"Hierarchies","index":4,"n_rows":359,"n_cols":50,"rows_kept":359,"cut":false,"hidden":true,"merged":[]}
["hier_SC_SC1_1","hier_ZZ_ZZ28","hier_ZZ_ZZ28","hier_CT_CT53","hier_CT_CT53","hier_BT_BT3","hier_BT_BT3","hier_OL_OL3","hier_OL_OL3","hier_GA_GA4","hier_GA_GA9","hier_AP_AP16","hier_ZZ_ZZ810","hier_ZZ_ZZ811","hier_TR_TR8","hier_TR_TR9","hier_ZZ_ZZ812","hier_ZZ_ZZ813","hier_TR_TR10","hier_TR_TR11","hier_ZZ_ZZ814","hier_ZZ_ZZ815","hier_ZZ_ZZ816","hier_IM_IM51","hier_MC_MC141","hier_TR_TR12","hier_TR_TR13","hier_ZZ_ZZ818","hier_ZZ_ZZ819","hier_ZZ_ZZ820","hier_ZZ_ZZ822","hier_ZZ_ZZ823","hier_ZZ_ZZ824","hier_CS_CS2","hier_CS_CS3","hier_TR_TR14","hier_ZZ_ZZ827","hier_AP_AP17","hier_ZZ_ZZ821","hier_ZZ_ZZ825","hier_ZZ_ZZ826","hier_CU_CU3_4","hier_CU_CU3_4","hier_ZZ_ZZ828","hier_ZZ_ZZ829","hier_ZZ_ZZ830","hier_ZZ_ZZ831","hier_ZZ_ZZ832","hier_CU_CU5","hier_CU_CU5"]
["Individual","Rank 1 - Ranking in insolvency (master scale)","Rank 1 - Ranking in insolvency (master scale)","Resolution entity","Resolution entity","LEI code type","LEI code type","CET1 capital","CET1 capital","ALBANIA","AUSTRIA","Approach used for the purpose of the SOT (NII/EVE) - Simplified SA","Methodology (NII) - Repricing gap","Conditional Cash Flows (NII) - All material items","Option risk (NII) considered","Basis Risk (NII) considered","Methodology (EVE) - duration Gap","Conditional Cash Flows (EVE) - All material items","Option risk (EVE) considered","Basis Risk (EVE) considered","Commercial margins/other spread components (EVE) considered","Penalty fees from loan prepayments considered","Pension obligations/pension plan assets considered","Non-performing exposures considered","Fixed rate loan committments considered","Risk of prepayment considered","Risk of early redemption  considered","Time series model (Basel/EBA Stable/non-stable/PTR approach)","Identification of core component NMD balances - Yes","All core balances allocated in only one repricing tenor.","Exemptions to the 5-year NMD repricing cap - Yes","Modelling of operational NMDs from financial customers - Yes","Changes in balance sheet structure due to interest rates - Reduction of the duration gap between asset/liabilities by reducing the duration of the asset.","IRRBB mitigation and hedging strategies (EVE) - Parallel shock up","IRRBB mitigation and hedging strategies (NII) - Parallel shock up","Materiality of the basis risk - Yes","Different perimeter of instruments subject to the CSRBB - Yes","Requirement from the Competent Authority (NII/EVE) - Yes","5-year NMD repricing cap on IRRBB risk management - Yes","SOT on NII risk measure under the IMS Approach - PTR of Retail Term deposits - Yes","SOT on NII risk measure under the IMS Approach - PTR of Fixed Retail Loans - Yes","Not applicable/ All currencies","Not applicable/ All currencies","Risk-free yield curve (discounting in EVE SOT) - Interbank secured","Risk-free yield curve (internal risk measures of EVE) - Interbank secured","Change of material assumptions (EVE) - Yes","Change of material assumptions (NII) - Yes","Bindness of the post-shock interest rate floor (NII/EVE) - Yes","All currencies","All currencies"]
["Consolidated","Rank 2 - Ranking in insolvency (master scale)","Rank 2 - Ranking in insolvency (master scale)","Entities other than the resolution entity","Entities other than the resolution entity","National code type","National code type","Eligible AT1 capital","Eligible AT1 capital","AUSTRIA","BELGIUM","Approach used for the purpose of the SOT (NII/EVE) - SA","Methodology (NII) - Full revaluation","Conditional Cash Flows (NII) - Some material items","Option risk (NII) not considered","Basis Risk (NII) not considered","Methodology  (EVE) - Full Revaluation","Conditional Cash Flows (EVE) - Some material items","Option risk (EVE) not considered","Basis Risk (EVE) not considered","Commercial margins/other spread components (EVE) not considered","Penalty fees from loan prepayments not considered","Pension obligations/pension plan assets not considered","Non-performing exposures not considered","Fixed rate loan committments not considered","Risk of prepayment not considered","Risk of early redemption not considered","Replication portfolio","Identification of core component NMD balances - No","Core balances allocated in different repricing tenors.","Exemptions to the 5-year NMD repricing cap - No","Modelling of operational NMDs from financial customers - No","Changes in balance sheet structure due to interest rates - Reduction of the duration gap between asset/liabilities by increasing the duration of liabilities.","IRRBB mitigation and hedging strategies (EVE) - Parallel shock down","IRRBB mitigation and hedging strategies (NII) - Parallel shock down","Materiality of the basis risk - No","Different perimeter of instruments subject to the CSRBB - No","Requirement from the Competent Authority (NII/EVE) - No","5-year NMD repricing cap on IRRBB risk management - No","SOT on NII risk measure under the IMS Approach - PTR of Retail Term deposits - No","SOT on NII risk measure under the IMS Approach - PTR of Fixed Retail Loans - No","UAE Dirham","UAE Dirham","Risk-free yield curve (discounting in EVE SOT) - Interbank unsecured overnight","Risk-free yield curve (internal risk measures of EVE) - Interbank unsecured overnight","Change of material assumptions (EVE) - No","Change of material assumptions (NII) - No","Bindness of the post-shock interest rate floor (NII/EVE) - No","UAE Dirham","UAE Dirham"]
["Sub-consolidated","Rank 3 - Ranking in insolvency (master scale)","Rank 3 - Ranking in insolvency (master scale)",null,null,null,null,"Eligible T2 Capital","Eligible T2 Capital","BELGIUM","BULGARIA","Approach used for the purpose of the SOT (NII/EVE) - IMS","Methodology (NII) - Mix","Conditional Cash Flows (NII) - Not considered",null,null,"Methodology (EVE) - Mix","Conditional Cash Flows (EVE) - Not considered",null,null,null,null,null,null,null,null,null,"Economical models (modelling financial wealth allocation to NMDs or alternative investments according to different market scenarios/economic factors)","Identification of core component NMD balances - Not applicable",null,"Exemptions to the 5-year NMD repricing cap - Not applicable","Modelling of operational NMDs from financial customers - Not applicable","Changes in balance sheet structure due to interest rates - Reduction of the duration gap between asset/liabilities by reducing the duration of the asset and increasing the duration of liabilities.","IRRBB mitigation and hedging strategies (EVE) - Steepener shock",null,"Materiality of the basis risk - Not applicable","Different perimeter of instruments subject to the CSRBB - Not applicable","Requirement from the Competent Authority (NII/EVE) - Not applicable","5-year NMD repricing cap on IRRBB risk management - Not applicable","SOT on NII risk measure under the IMS Approach - PTR of Retail Term deposits - Not applicable","SOT on NII risk measure under the IMS Approach - PTR of Fixed Retail Loans - Not applicable","Afghani","Afghani","Risk-free yield curve (discounting in EVE SOT) - Interbank unsecured term","Risk-free yield curve (internal risk measures of EVE) - Interbank unsecured term","Change of material assumptions (EVE) - Not applicable","Change of material assumptions (NII) - Not applicable","Bindness of the post-shock interest rate floor (NII/EVE) - Not applicable","Afghani","Afghani"]
["Resolution Group","Rank 4 - Ranking in insolvency (master scale)","Rank 4 - Ranking in insolvency (master scale)",null,null,null,null,"Eligible liabilities","Eligible liabilities","BULGARIA","CROATIA",null,"Methodology (NII) - Other",null,null,null,"Methodology (EVE) - Other",null,null,null,null,null,null,null,null,null,null,"Expert judgement",null,null,null,null,"Changes in balance sheet structure due to interest rates - Increase of the duration gap by increasing the duration of assets.","IRRBB mitigation and hedging strategies (EVE) - Flattener shock",null,null,null,null,null,null,null,"Lek","Lek","Risk-free yield curve (discounting in EVE SOT) - Sovereign curve","Risk-free yield curve (internal risk measures of EVE) - Sovereign curve",null,null,null,"Lek","Lek"]
[null,"Rank 5 - Ranking in insolvency (master scale)","Rank 5 - Ranking in insolvency (master scale)",null,null,null,null,null,null,"CYPRUS","CYPRUS",null,null,null,null,null,null,null,null,null,null,null,null,null,null,null,null,"Other general approach for NMD modelling",null,null,null,null,"Changes in balance sheet structure due to interest rates - Increase of the duration gap by reducing the duration of liabilities.","IRRBB mitigation and hedging strategies (EVE) - Short rates shock up",null,null,null,null,null,null,null,"Armenian Dram","Armenian Dram","Risk-free yield curve (discounting in EVE SOT) - Product specific curve","Risk-free yield curve (internal risk measures of EVE) - Product specific curve",null,null,null,"Armenian Dram","Armenian Dram"]
{"$rows_left_out":354}
{"sheet":"M_01.00","index":5,"n_rows":40,"n_cols":11,"rows_kept":40,"cut":false,"hidden":true,"merged":[[1,1,1,14],[4,1,4,11],[8,3,9,4],[10,3,13,3],[10,4,13,4]]}
["Back to Index"]
[null,"MREL and TLAC key metrics (resolution groups / entities) (KM2)"]
[]
[]
[null,"M 01.00"]
[]
{"$rows_left_out":35}
{"sheet":"J_10.01","index":6,"n_rows":51,"n_cols":10,"rows_kept":51,"cut":false,"hidden":true,"merged":[[1,1,1,14],[4,1,4,11],[8,3,9,3],[10,3,11,3]]}
["Back to Index"]
[null,"General qualitative information"]
[]
[]
[null,"J 10.01"]
[]
{"$rows_left_out":46}
{"sheet":"M_02.00","index":7,"n_rows":114,"n_cols":11,"rows_kept":114,"cut":false,"hidden":true,"merged":[[85,3,90,3],[1,1,1,14],[4,1,4,11],[8,3,9,4],[10,3,15,3],[10,4,15,4],[58,1,58,11],[62,3,63,4],[64,3,68,3],[64,4,68,4],[79,1,79,11],[83,3,84,3]]}
["Back to Index"]
[null,"MREL and TLAC capacity and composition (resolution groups / entities) (TLAC1)"]
[]
[]
[null,"M 02.00.a"]
[]
{"$rows_left_out":109}
{"sheet":"J_10.02","index":8,"n_rows":20,"n_cols":10,"rows_kept":20,"cut":false,"hidden":true,"merged":[[1,1,1,14],[4,1,4,11],[6,1,6,2],[9,3,10,3]]}
["Back to Index"]
[null,"Qualitative information \"currency by currency\""]
[]
[]
[null,"J 10.02"]
[]
{"$rows_left_out":15}
{"sheet":"M_03.00","index":9,"n_rows":55,"n_cols":11,"rows_kept":55,"cut":false,"hidden":true,"merged":[[1,1,1,14],[4,1,4,11],[8,3,9,4],[10,3,14,3],[10,4,14,4]]}
["Back to Index"]
[null,"Internal MREL and internal TLAC (ILAC)"]
[]
[]
[null,"M 03.00"]
[]
{"$rows_left_out":50}
{"sheet":"J_11.01","index":10,"n_rows":50,"n_cols":10,"rows_kept":50,"cut":false,"hidden":true,"merged":[[1,1,1,14],[4,1,4,11],[8,3,9,3],[10,3,11,3]]}
["Back to Index"]
[null,"General qualitative information (simplified for SNCIS and 'other' institutions)"]
[]
[]
[null,"J 11.01"]
[]
{"$rows_left_out":45}
{"sheet":"M_04.00","index":11,"n_rows":45,"n_cols":10,"rows_kept":45,"cut":false,"hidden":true,"merged":[[1,1,1,14],[4,1,4,11],[8,3,9,3],[10,3,12,3]]}
["Back to Index"]
[null,"Funding structure of eligible liabilities (LIAB MREL)"]
[]
[]
[null,"M 04.00"]
[]
{"$rows_left_out":40}
{"sheet":"J_11.02","index":12,"n_rows":18,"n_cols":10,"rows_kept":18,"cut":false,"hidden":true,"merged":[[1,1,1,14],[4,1,4,11],[6,1,6,2],[9,3,10,3]]}
["Back to Index"]
[null,"Qualitative information \"currency by currency\" (simplified for SNCIS and 'other' institutions)"]
[]
[]
[null,"J 11.02"]
[]
{"$rows_left_out":13}
{"sheet":"M_05.00","index":13,"n_rows":17,"n_cols":26,"rows_kept":17,"cut":false,"hidden":true,"merged":[[1,1,1,14],[4,1,4,11],[8,1,13,1],[8,2,13,2],[8,3,9,12],[10,3,13,3],[10,4,10,5],[11,4,13,4],[10,6,10,12],[11,6,13,6],[11,5,13,5],[11,7,11,12],[12,7,13,7],[12,8,12,11],[12,12,13,12]]}
["Back to Index"]
[null,"Creditor ranking (entity that is not a resolution entity) (TLAC2)"]
[]
[]
[null,"M 05.00"]
[]
{"$rows_left_out":12}
{"sheet":"J_08.00","index":14,"n_rows":111,"n_cols":17,"rows_kept":111,"cut":false,"hidden":true,"merged":[[12,3,15,3],[12,4,15,4],[1,1,1,14],[4,1,4,11],[6,1,6,2],[9,3,10,4],[11,3,11,4],[56,10,60,10],[49,1,49,11],[51,1,51,2],[54,3,55,10],[56,3,60,3],[56,4,60,4],[56,5,60,5],[56,6,60,6],[56,7,60,7],[56,8,60,8],[56,9,60,9]]}
["Back to Index"]
[null,"Relevant parameters"]
[]
[]
[null,"J 08.00.a"]
[]
{"$rows_left_out":106}
{"sheet":"M_06.00","index":15,"n_rows":17,"n_cols":23,"rows_kept":17,"cut":false,"hidden":true,"merged":[[11,6,11,11],[12,6,13,6],[12,7,12,10],[12,11,13,11],[1,1,1,14],[4,1,4,11],[8,1,13,1],[8,2,9,11],[10,2,13,2],[10,3,10,4],[11,3,13,3],[10,5,10,11],[11,5,13,5],[11,4,13,4]]}
["Back to Index"]
[null,"Creditor ranking (resolution entities) (TLAC3)"]
[]
[]
[null,"M 06.00"]
[]
{"$rows_left_out":12}
{"sheet":"J_09.00","index":16,"n_rows":80,"n_cols":17,"rows_kept":80,"cut":false,"hidden":true,"merged":[[12,3,14,3],[12,4,14,4],[1,1,1,14],[4,1,4,11],[6,1,6,2],[9,3,10,4],[11,3,11,4],[47,10,50,10],[40,1,40,11],[42,1,42,2],[45,3,46,10],[47,3,50,3],[47,4,50,4],[47,5,50,5],[47,6,50,6],[47,7,50,7],[47,8,50,8],[47,9,50,9]]}
["Back to Index"]
[null,"Relevant parameters (simplified for  SNCIS and 'other' institutions)"]
[]
[]
[null,"J 09.00.a"]
[]
{"$rows_left_out":75}
{"sheet":"M_07.00","index":17,"n_rows":15,"n_cols":32,"rows_kept":15,"cut":false,"hidden":true,"merged":[[10,10,10,14],[1,1,1,14],[4,1,4,11],[8,1,11,1],[8,2,11,2],[8,3,11,3],[8,4,11,4],[8,5,9,14],[10,6,11,6],[10,7,11,7],[10,9,11,9]]}
["Back to Index"]
[null,"Instruments governed by third-country law (MTCI)"]
[]
[]
[null,"M 07.00"]
[]
{"$rows_left_out":10}
{"sheet":"J_05.00","index":18,"n_rows":135,"n_cols":54,"rows_kept":135,"cut":false,"hidden":true,"merged":[[1,1,1,14],[4,1,4,11],[6,1,6,2],[9,3,10,41],[11,3,11,27],[11,28,11,41],[12,28,12,31],[13,28,14,28],[13,14,14,14],[13,15,14,15],[13,16,14,16],[13,12,14,12],[13,13,14,13],[12,3,12,6],[13,3,14,3],[12,7,14,7],[12,8,14,8],[12,9,12,27],[75,3,76,41],[13,31,14,31],[13,34,14,34],[13,35,14,35],[13,36,14,36],[13,37,14,37],[13,38,14,38],[13,23,14,23],[13,24,14,24],[13,25,14,25],[13,26,14,26],[13,27,14,27],[13,29,13,30],[13,17,14,17],[13,18,14,18],[13,19,14,19],[13,39,14,39],[13,40,14,40],[13,41,14,41],[70,1,70,11],[72,1,72,2],[13,20,14,20],[13,21,14,21],[13,22,14,22],[12,32,14,32],[12,33,14,33],[12,34,12,41],[13,4,13,5],[13,6,14,6],[13,9,14,9],[13,10,14,10],[13,11,14,11],[77,3,77,27],[77,28,77,41],[78,3,78,6],[79,3,80,3],[78,7,80,7],[78,8,80,8],[78,9,78,27],[78,28,78,31],[79,28,80,28],[78,32,80,32],[79,20,80,20],[78,33,80,33],[78,34,78,41],[79,4,79,5],[79,6,80,6],[79,9,80,9],[79,10,80,10],[79,11,80,11],[79,12,80,12],[79,13,80,13],[79,14,80,14],[79,15,80,15],[79,16,80,16],[79,17,80,17],[79,18,80,18],[79,19,80,19],[79,36,80,36],[79,21,80,21],[79,22,80,22],[79,23,80,23],[79,24,80,24],[79,25,80,25],[79,26,80,26],[79,27,80,27],[79,29,79,30],[79,31,80,31],[79,34,80,34],[79,35,80,35],[79,37,80,37],[79,38,80,38],[79,39,80,39],[79,40,80,40],[79,41,80,41]]}
["Back to Index"]
[null,"Repricing cash flows"]
[]
[]
[null,"J 05.00.a"]
[]
{"$rows_left_out":130}
{"sheet":"J_06.00","index":19,"n_rows":125,"n_cols":54,"rows_kept":125,"cut":false,"hidden":true,"merged":[[1,1,1,14],[4,1,4,11],[6,1,6,2],[9,3,10,41],[11,3,11,27],[11,28,11,41],[12,28,12,31],[13,28,14,28],[13,14,14,14],[13,15,14,15],[13,16,14,16],[13,12,14,12],[13,13,14,13],[12,3,12,6],[13,3,14,3],[12,7,14,7],[12,8,14,8],[12,9,12,27],[70,3,71,41],[13,31,14,31],[13,34,14,34],[13,35,14,35],[13,36,14,36],[13,37,14,37],[13,38,14,38],[13,23,14,23],[13,24,14,24],[13,25,14,25],[13,26,14,26],[13,27,14,27],[13,29,13,30],[13,17,14,17],[13,18,14,18],[13,19,14,19],[13,39,14,39],[13,40,14,40],[13,41,14,41],[65,1,65,11],[67,1,67,2],[13,20,14,20],[13,21,14,21],[13,22,14,22],[12,32,14,32],[12,33,14,33],[12,34,12,41],[13,4,13,5],[13,6,14,6],[13,9,14,9],[13,10,14,10],[13,11,14,11],[72,3,72,27],[72,28,72,41],[73,3,73,6],[74,3,75,3],[73,7,75,7],[73,8,75,8],[73,9,73,27],[73,28,73,31],[74,28,75,28],[73,32,75,32],[74,20,75,20],[73,33,75,33],[73,34,73,41],[74,4,74,5],[74,6,75,6],[74,9,75,9],[74,10,75,10],[74,11,75,11],[74,12,75,12],[74,13,75,13],[74,14,75,14],[74,15,75,15],[74,16,75,16],[74,17,75,17],[74,18,75,18],[74,19,75,19],[74,36,75,36],[74,21,75,21],[74,22,75,22],[74,23,75,23],[74,24,75,24],[74,25,75,25],[74,26,75,26],[74,27,75,27],[74,29,74,30],[74,31,75,31],[74,34,75,34],[74,35,75,35],[74,37,75,37],[74,38,75,38],[74,39,75,39],[74,40,75,40],[74,41,75,41]]}
["Back to Index"]
[null,"Repricing cash flows (simplified for 'other' institutions)"]
[]
[]
[null,"J 06.00.a"]
[]
{"$rows_left_out":120}
{"sheet":"J_07.00","index":20,"n_rows":115,"n_cols":54,"rows_kept":115,"cut":false,"hidden":true,"merged":[[1,1,1,14],[4,1,4,11],[6,1,6,2],[9,3,10,41],[11,3,11,27],[11,28,11,41],[12,28,12,31],[13,28,14,28],[13,14,14,14],[13,15,14,15],[13,16,14,16],[13,12,14,12],[13,13,14,13],[12,3,12,6],[13,3,14,3],[12,7,14,7],[12,8,14,8],[12,9,12,27],[65,3,66,41],[13,31,14,31],[13,34,14,34],[13,35,14,35],[13,36,14,36],[13,37,14,37],[13,38,14,38],[13,23,14,23],[13,24,14,24],[13,25,14,25],[13,26,14,26],[13,27,14,27],[13,29,13,30],[13,17,14,17],[13,18,14,18],[13,19,14,19],[13,39,14,39],[13,40,14,40],[13,41,14,41],[60,1,60,11],[62,1,62,2],[13,20,14,20],[13,21,14,21],[13,22,14,22],[12,32,14,32],[12,33,14,33],[12,34,12,41],[13,4,13,5],[13,6,14,6],[13,9,14,9],[13,10,14,10],[13,11,14,11],[67,3,67,27],[67,28,67,41],[68,3,68,6],[69,3,70,3],[68,7,70,7],[68,8,70,8],[68,9,68,27],[68,28,68,31],[69,28,70,28],[68,32,70,32],[69,20,70,20],[68,33,70,33],[68,34,68,41],[69,4,69,5],[69,6,70,6],[69,9,70,9],[69,10,70,10],[69,11,70,11],[69,12,70,12],[69,13,70,13],[69,14,70,14],[69,15,70,15],[69,16,70,16],[69,17,70,17],[69,18,70,18],[69,19,70,19],[69,36,70,36],[69,21,70,21],[69,22,70,22],[69,23,70,23],[69,24,70,24],[69,25,70,25],[69,26,70,26],[69,27,70,27],[69,29,69,30],[69,31,70,31],[69,34,70,34],[69,35,70,35],[69,37,70,37],[69,38,70,38],[69,39,70,39],[69,40,70,40],[69,41,70,41]]}
["Back to Index"]
[null,"Repricing cash flows (simplified for SNCIS)"]
[]
[]
[null,"J 07.00.a"]
[]
{"$rows_left_out":110}
{"sheet":"J_02.00","index":21,"n_rows":84,"n_cols":28,"rows_kept":84,"cut":false,"hidden":true,"merged":[[12,17,14,17],[1,1,1,14],[4,1,4,11],[6,1,6,2],[9,3,10,17],[11,3,14,3],[11,4,14,4],[11,5,11,11],[11,12,11,14],[11,15,11,17],[12,5,12,11],[12,12,14,12],[12,13,14,13],[12,14,14,14],[12,15,14,15],[12,16,14,16],[13,11,14,11],[13,5,14,5],[13,6,14,6],[13,7,14,7],[13,8,14,8],[13,9,14,9],[13,10,14,10]]}
["Back to Index"]
[null,"Breakdown of sensitivity estimates"]
[]
[]
[null,"J 02.00"]
[]
{"$rows_left_out":79}
{"sheet":"J_03.00","index":22,"n_rows":55,"n_cols":28,"rows_kept":55,"cut":false,"hidden":true,"merged":[[1,1,1,14],[4,1,4,11],[6,1,6,2],[9,3,10,17],[11,3,13,3],[11,4,13,4],[11,5,11,17],[12,5,12,11],[12,12,12,14],[12,15,12,17]]}
["Back to Index"]
[null,"Breakdown of sensitivity estimates (simplified for 'other' institutions)"]
[]
[]
[null,"J 03.00"]
[]
{"$rows_left_out":50}
{"sheet":"J_04.00","index":23,"n_rows":31,"n_cols":28,"rows_kept":31,"cut":false,"hidden":true,"merged":[[1,1,1,14],[4,1,4,11],[6,1,6,2],[9,3,10,17],[11,3,13,3],[11,4,13,4],[11,5,11,17],[12,5,12,11],[12,12,12,14],[12,15,12,17]]}
["Back to Index"]
[null,"Breakdown of sensitivity estimates (simplified for SNCIS)"]
[]
[]
[null,"J 04.00"]
[]
{"$rows_left_out":26}
{"sheet":"J_01.00","index":24,"n_rows":45,"n_cols":10,"rows_kept":45,"cut":false,"hidden":true,"merged":[[1,1,1,14],[4,1,4,11],[6,1,6,2],[9,3,10,3],[11,3,13,3]]}
["Back to Index"]
[null,"Evaluation of the IRRBB: EVE/NII SOT and MV changes"]
[]
[]
[null,"J 01.00"]
[]
{"$rows_left_out":39}