{"text_format":"1","workbook":"xlsx","n_sheets":6,"sheets":["General data","XBRL Errors","Index","Show","Hierarchies","TG8023"],"not_rendered":{"charts":0,"images":3,"macros":1,"external_links":0,"defined_names":38,"comments":0,"pivot_tables":0},"unopened":[],"bounds":{"document_bytes":16777216,"sheet_cells":100000,"rows_first":2000,"rows_last":500,"rows_between":2000,"halvings":0,"cell_chars":16384,"cell_head_chars":4096},"cells_cut":0,"cells_raw":0,"read":"whole","date_system":"1900"}

{"sheet":"General data","index":0,"n_rows":247,"n_cols":23,"rows_kept":247,"cut":false,"hidden":false,"merged":[[0,6,2,6],[3,0,5,9]]}
[null,null,null,null,null,null,null,"Version:",null,"2.0.0.1",null,null,null,null,null,null,"Not applicable/All geographical areas","http://standards.iso.org/iso/17442","BIS consolidated banking statistics","BISCBS-KW","01","EUR","NL BIS CBS 2.0.0"]
[null,null,null,null,null,null,null,null,null,null,null,null,null,null,null,null,"AFGHANISTAN","http://standards.iso.org/iso/17442",null,null,"18","AED"]
[null,null,null,null,null,null,null," ",null,null,null,null,null,null,null,null,"ALBANIA","http://standards.iso.org/iso/17442",null,null,"19","AFN"]
[null,null,null,null,null,null,null,null,null,null,null,null,null,null,null,null,"ALGERIA","http://standards.iso.org/iso/17442",null,null,"20","ALL"]
[null,null,null,null,null,null,null,null,null,null,null,null,null,null,null,null,"AMERICAN SAMOA","http://standards.iso.org/iso/17442",null,null,"All","AMD"]
[null,null,null,null,null,null,null,null,null,null,null,null,null,null,null,null,"ANDORRA","http://standards.iso.org/iso/17442",null,null,"All","ANG"]
[null,null,null,null,null,null,null,null,null,null,null,null,null,null,null,null,"ANGOLA","http://standards.iso.org/iso/17442",null,null,null,"AOA"]
[null,"General Data",null,null,null,null,null,null,null,null,null,"/General data label{B}","/General data value{E}",null,null,null,"ANGUILLA","http://standards.iso.org/iso/17442",null,null,null,"ARS"]
[null,null,null,null,null,null,null,null,null,null,null,null,null,null,null,null,"ANTARCTICA","http://standards.iso.org/iso/17442",null,null,null,"AUD"]
["*","Identifier",":","LEGALIDENTIFIER20POS",{"$f":"\"\"&D10","v":"LEGALIDENTIFIER20POS"},{"$f":"IF(D10=\"\",1,0)","v":0},null,null,null,null,null,null,null,null,null,null,"ANTIGUA AND BARBUDA","http://standards.iso.org/iso/17442",null,null,null,"AWG"]
[null,null,null,null,null,null,null,null,null,null,null,null,null,null,null,null,"ARGENTINA","http://standards.iso.org/iso/17442",null,null,null,"AZN"]
["*","Period start date",":","2020-01-01",{"$f":"D12","v":"2020-01-01"},{"$f":"IF(D12=\"\",1,0)","v":0},null,null,null,null,null,null,null,null,null,null,"ARMENIA","http://standards.iso.org/iso/17442",null,null,null,"BAM"]
[null,null,null,null,null,null,null,null,null,null,null,null,null,null,null,null,"ARUBA","http://standards.iso.org/iso/17442",null,null,null,"BBD"]
["*","Period end date",":","2020-12-31",{"$f":"D14","v":"2020-12-31"},{"$f":"IF(D14=\"\",1,0)","v":0},null,null,null,null,null,null,null,null,null,null,"AUSTRALIA","http://standards.iso.org/iso/17442",null,null,null,"BDT"]
[null,null,null,null,null,null,null,null,null,null,null,null,null,null,null,null,"AUSTRIA","http://standards.iso.org/iso/17442",null,null,null,"BGN"]
[null,"Country",":","Not applicable/All geographical areas",null,null,null,null,null,null,null,null,null,null,null,null,"AZERBAIJAN","http://standards.iso.org/iso/17442",null,null,null,"BHD"]
[null,null,null,null,null,null,null,null,null,null,null,null,null,null,null,null,"BAHAMAS","http://standards.iso.org/iso/17442",null,null,null,"BIF"]
["*","Filing Currency",":","EUR",{"$f":"\"\"&D18","v":"EUR"},{"$f":"IF(D18=\"\",1,0)","v":0},null,null,null,null,null,null,null,null,null,null,"BAHRAIN","http://standards.iso.org/iso/17442",null,null,null,"BMD"]
[null,null,null,null,null,null,null,null,null,null,null,null,null,null,null,null,"BANGLADESH","http://standards.iso.org/iso/17442",null,null,null,"BND"]
["*","Taxonomy",":","NL BIS CBS 2.0.0",null,{"$f":"IF(D20=\"\",1,0)","v":0},null,null,null,null,null,null,null,null,null,null,"BARBADOS","http://standards.iso.org/iso/17442",null,null,null,"BOB"]
[null,null,null,null,null,null,null,null,null,null,null,null,null,null,null,null,"BELARUS","http://standards.iso.org/iso/17442",null,null,null,"BRL"]
["*","Module",":","BIS consolidated banking statistics",{"$f":"IFERROR(VLOOKUP(D22,S:T,2,FALSE),\"\")","v":"BISCBS-KW"},{"$f":"IF(D22=\"\",1,0)","v":0},null,null,null,null,null,null,null,null,null,null,"BELGIUM","http://www.swift.com",null,null,null,"BSD"]
[null,null,null,null,null,null,null,null,null,null,null,null,null,null,null,null,"BELIZE","http://standards.iso.org/iso/17442",null,null,null,"BTN"]
[null,null,null,null,null,null,null,null,null,null,null,null,null,null,null,null,"BENIN","http://standards.iso.org/iso/17442",null,null,null,"BWP"]
[null,"Advanced Requirements",null,null,null,null,null,null,null,null,null,null,null,null,null,null,"BERMUDA","http://standards.iso.org/iso/17442",null,null,null,"BYN"]
[null,null,null,null,null,null,null,null,null,null,null,null,null,null,null,null,"BHUTAN","http://standards.iso.org/iso/17442",null,null,null,"BZD"]
[null,"Identifier scheme",":",{"$f":"IFERROR(VLOOKUP(D16,Q:R,2,FALSE),R1)","v":"http://standards.iso.org/iso/17442"},{"$f":"D27","v":"http://standards.iso.org/iso/17442"},null,null,null,null,null,null,null,null,null,null,null,"BOLIVIA, PLURINATIONAL STATE OF","http://standards.iso.org/iso/17442",null,null,null,"CAD"]
[null,null,null,null,null,null,null,null,null,null,null,null,null,null,null,null,"BRAZIL","http://standards.iso.org/iso/17442",null,null,null,"COP"]
[null,"Monetary decimals",":",null,null,null,null,null,null,null,null,null,null,null,null,null,"BRITISH INDIAN OCEAN TERRITORY","http://standards.iso.org/iso/17442",null,null,null,"CRC"]
[null,null,null,null,null,null,null,null,null,null,null,null,null,null,null,null,"BRUNEI DARUSSALAM","http://standards.iso.org/iso/17442",null,null,null,"CUC"]
[null,"Monetary precision",":",-3,null,{"$f":" 0.5 * 10^(-1 * PP_MonetaryPrecision)","v":500},null,null,null,null,null,null,null,null,null,null,"BULGARIA","http://standards.iso.org/iso/17442",null,null,null,"CUP"]
[null,null,null,null,null,null,null,null,null,null,null,null,null,null,null,null,"BURKINA FASO","http://standards.iso.org/iso/17442",null,null,null,"CVE"]
[null,"Pure decimals",":",4,null,{"$f":" 0.5 * 10^(-1 * PP_DecimalPrecision)","v":5.0000000000000002E-5},null,null,null,null,null,null,null,null,null,null,"BURUNDI","http://standards.iso.org/iso/17442",null,null,null,"CZK"]
[null,null,null,null,null,null,null,null,null,null,null,null,null,null,null,null,"CAMBODIA","http://standards.iso.org/iso/17442",null,null,null,"DJF"]
[null,"Pure precision",":",4,null,null,null,"#XBRL made simple!",null,null,null,null,null,null,null,null,"CAMEROON","http://standards.iso.org/iso/17442",null,null,null,"DKK"]
[null,null,null,null,null,null,null,null,null,null,null,null,null,null,null,null,"CANADA","http://standards.iso.org/iso/17442",null,null,null,"DOP"]
[null,"Concatenate Errors",":",false,null,null,null,null,null,null,null,null,null,null,null,null,"CAPE VERDE","http://standards.iso.org/iso/17442",null,null,null,"DZD"]
[null,"Additional Requirements (Country specific)",null,null,null,null,null,null,null,null,null,null,null,null,null,null,"CAYMAN ISLANDS","http://standards.iso.org/iso/17442",null,null,null,"EGP"]
["BELGIUM",null,null,null,null,null,null,null,null,null,null,null,null,null,null,null,"CENTRAL AFRICAN REPUBLIC","http://standards.iso.org/iso/17442",null,null,null,"ERN"]
["BELGIUM","Post Parsing features",":",null,null,{"$f":"IF(AND(A40=PP_Country,D40=\"\"),1,0)","v":0},null,null,null,null,null,null,null,null,null,null,"CHAD","http://standards.iso.org/iso/17442",null,null,null,"ETB"]
["BELGIUM",null,null,null,null,null,null,null,null,null,null,null,null,null,null,null,"CHILE","http://standards.iso.org/iso/17442",null,null,null,"EUR"]
["BELGIUM","Reporter e-mail",":",null,null,null,null,null,null,null,null,null,null,null,null,null,"CHINA","http://standards.iso.org/iso/17442",null,null,null,"FJD"]
["BELGIUM",null,null,null,null,null,null,null,null,null,null,null,null,null,null,null,"CHRISTMAS ISLAND","http://standards.iso.org/iso/17442",null,null,null,"FKP"]
["BELGIUM","Declarer Type",":",null,{"$f":"\"\"&D44","v":""},{"$f":"IF(AND(A44=PP_Country,D44=\"\"),1,0)","v":0},null,null,null,null,null,null,null,null,null,null,"COCOS (KEELING) ISLANDS","http://standards.iso.org/iso/17442",null,null,null,"GBP"]
["BELGIUM",null,null,null,null,null,null,null,null,null,null,null,null,null,null,null,"COLOMBIA","http://standards.iso.org/iso/17442",null,null,null,"GEL"]
["BELGIUM","Domain",":",null,{"$f":"\"\"&D46","v":""},{"$f":"IF(AND(A46=PP_Country,D46=\"\"),1,0)","v":0},null,null,null,null,null,null,null,null,null,null,"COMOROS","http://standards.iso.org/iso/17442",null,null,null,"GGP"]
["BELGIUM",null,null,null,null,null,null,null,null,null,null,null,null,null,null,null,"CONGO","http://standards.iso.org/iso/17442",null,null,null,"GHS"]
[null,"ParsePort-specific parameters:",null,"SII_",null,null,null,null,null,null,null,null,null,null,null,null,"CONGO, THE DEMOCRATIC REPUBLIC OF THE","http://standards.iso.org/iso/17442",null,null,null,"GIP"]
[null,"Compress contexts",null,true,null,null,null,null,null,null,null,null,null,null,null,null,"COOK ISLANDS","http://standards.iso.org/iso/17442",null,null,null,"GMD"]
[null,"Language",null,"EN",null,null,null,null,null,null,null,null,null,null,null,null,"COSTA RICA","http://standards.iso.org/iso/17442",null,null,null,"GNF"]
[null,"Debug mode",null,false,null,null,null,null,null,null,null,null,null,null,null,null,"CÔTE D'IVOIRE","http://standards.iso.org/iso/17442",null,null,null,"GTQ"]
[null,"LookupValue fallback",null,false,null,null,null,null,null,null,null,null,null,null,null,null,"CROATIA","http://standards.iso.org/iso/17442",null,null,null,"GYD"]
[null,null,null,null,null,null,null,null,null,null,null,"//General data label{B}","//General data value{E}",null,null,null,"CUBA","http://standards.iso.org/iso/17442",null,null,null,"HKD"]
["BELGIUM",null,null,null,null,null,null,null,null,null,null,null,null,null,null,null,"CURAÇAO","http://standards.iso.org/iso/17442",null,null,null,"HNL"]
["BELGIUM",null,null,null,null,null,null,null,null,null,null,null,null,null,null,null,"CYPRUS","http://standards.iso.org/iso/17442",null,null,null,"HRK"]
[null,null,null,null,null,null,null,null,null,null,null,null,null,null,null,null,"CZECH REPUBLIC","http://standards.iso.org/iso/17442",null,null,null,"HTG"]
[null,null,null,null,null,null,null,null,null,null,null,null,null,null,null,null,"DENMARK","http://standards.iso.org/iso/17442",null,null,null,"HUF"]
[null,null,null,null,null,null,null,null,null,null,null,null,null,null,null,null,"DJIBOUTI","http://standards.iso.org/iso/17442",null,null,null,"IDR"]
[null,null,null,null,null,null,null,null,null,null,null,null,null,null,null,null,"DOMINICA","http://standards.iso.org/iso/17442",null,null,null,"ILS"]
[null,null,null,null,null,null,null,null,null,null,null,null,null,null,null,null,"DOMINICAN REPUBLIC","http://standards.iso.org/iso/17442",null,null,null,"IMP"]
[null,null,null,null,null,null,null,null,null,null,null,null,null,null,null,null,"ECUADOR","http://standards.iso.org/iso/17442",null,null,null,"INR"]
[null,null,null,null,null,null,null,null,null,null,null,null,null,null,null,null,"EGYPT","http://standards.iso.org/iso/17442",null,null,null,"IQD"]
[null,null,null,null,null,null,null,null,null,null,null,null,null,null,null,null,"EL SALVADOR","http://standards.iso.org/iso/17442",null,null,null,"IRR"]
[null,null,null,null,null,null,null,null,null,null,null,null,null,null,null,null,"EQUATORIAL GUINEA","http://standards.iso.org/iso/17442",null,null,null,"ISK"]
[null,null,null,null,null,null,null,null,null,null,null,null,null,null,null,null,"ERITREA","http://standards.iso.org/iso/17442",null,null,null,"JEP"]
[null,null,null,null,null,null,null,null,null,null,null,null,null,null,null,null,"ESTONIA","http://standards.iso.org/iso/17442",null,null,null,"JMD"]
[null,null,null,null,null,null,null,null,null,null,null,null,null,null,null,null,"ETHIOPIA","http://standards.iso.org/iso/17442",null,null,null,"JOD"]
[null,null,null,null,null,null,null,null,null,null,null,null,null,null,null,null,"FALKLAND ISLANDS (MALVINAS)","http://standards.iso.org/iso/17442",null,null,null,"JPY"]
[null,null,null,null,null,null,null,null,null,null,null,null,null,null,null,null,"FAROE ISLANDS","http://standards.iso.org/iso/17442",null,null,null,"KES"]
[null,null,null,null,null,null,null,null,null,null,null,null,null,null,null,null,"FIJI","http://standards.iso.org/iso/17442",null,null,null,"KGS"]
[null,null,null,null,null,null,null,null,null,null,null,null,null,null,null,null,"FINLAND","http://standards.iso.org/iso/17442",null,null,null,"KHR"]
[null,null,null,null,null,null,null,null,null,null,null,null,null,null,null,null,"FRANCE","http://standards.iso.org/iso/17442",null,null,null,"KMF"]
[null,null,null,null,null,null,null,null,null,null,null,null,null,null,null,null,"FRENCH GUIANA","http://standards.iso.org/iso/17442",null,null,null,"KPW"]
[null,null,null,null,null,null,null,null,null,null,null,null,null,null,null,null,"FRENCH POLYNESIA","http://standards.iso.org/iso/17442",null,null,null,"KRW"]
[null,null,null,null,null,null,null,null,null,null,null,null,null,null,null,null,"FRENCH SOUTHERN TERRITORIES","http://standards.iso.org/iso/17442",null,null,null,"KWD"]
[null,null,null,null,null,null,null,null,null,null,null,null,null,null,null,null,"GABON","http://standards.iso.org/iso/17442",null,null,null,"KYD"]
[null,null,null,null,null,null,null,null,null,null,null,null,null,null,null,null,"GAMBIA","http://standards.iso.org/iso/17442",null,null,null,"KZT"]
[null,null,null,null,null,null,null,null,null,null,null,null,null,null,null,null,"GEORGIA","http://standards.iso.org/iso/17442",null,null,null,"LAK"]
[null,null,null,null,null,null,null,null,null,null,null,null,null,null,null,null,"GERMANY","http://standards.iso.org/iso/17442",null,null,null,"LBP"]
[null,null,null,null,null,null,null,null,null,null,null,null,null,null,null,null,"GHANA","http://standards.iso.org/iso/17442",null,null,null,"LKR"]
{"$rows_left_out":168}
{"sheet":"XBRL Errors","index":1,"n_rows":1,"n_cols":2,"rows_kept":1,"cut":false,"hidden":false,"merged":[]}
["Timestamp","Error"]

{"sheet":"Index","index":2,"n_rows":6,"n_cols":5,"rows_kept":6,"cut":false,"hidden":false,"merged":[[2,1,2,14]]}
[]
[]
[null,"Index"]
[]
[null,"Template Code","Template Name","Reporting Status"]
[null,"TG8023","Tabel group info : BIS consolidated banking statistics",null,{"$f":"IF($D$6=\"Reported\",\"@ForceFilingCode:true\",IF($D$6=\"Not Reported\",\"@ForceFilingCode:false\",\"\"))","v":""}]

{"sheet":"Show","index":3,"n_rows":5,"n_cols":3,"rows_kept":5,"cut":false,"hidden":true,"merged":[]}
["Sheet","Prefix","BISCBS-KW"]
["TG8023",{"$f":"IF(HLOOKUP('General data'!$E$22,$C$1:$C$2,2,FALSE)=\"X\",\"/\",\"!\")","v":"/"},"X"]
[]
[{"$f":"IF(Index!D6=\"Not Reported\",Show!$B$2&\"Institution Rows{Z}@ForceFilingCode:false\",\"\")","v":""},{"$f":"IF(Index!D6=\"Not Reported\",Show!$B$2& Show!$B$2&\"Institution Rows{Z}@ForceFilingCode:false\",\"\")","v":""}]
[{"$f":"IF(Index!D6=\"Not Reported\",Show!$B$2&\"8023 Rows{Z}@ForceFilingCode:false\",\"\")","v":""},{"$f":"IF(Index!D6=\"Not Reported\",Show!$B$2& Show!$B$2&\"8023 Rows{Z}@ForceFilingCode:false\",\"\")","v":""}]

{"sheet":"Hierarchies","index":4,"n_rows":256,"n_cols":2,"rows_kept":256,"cut":false,"hidden":true,"merged":[]}
["hier_dom046_001","hier_dom030_001"]
["Domestically owned banks","Not applicable / All or Total"]
["Inside-area foreign banks consolidated by their parent","Afghanistan"]
["Inside-area foreign banks not consolidated by their parent","Albania"]
["Outside-area foreign banks","Algeria"]
[null,"American Samoa (East)"]
[null,"Andorra"]
[null,"Angola"]
[null,"Anguilla"]
[null,"Antarctica"]
[null,"Antigua and Barbuda"]
[null,"Argentina"]
[null,"Armenia"]
[null,"Aruba"]
[null,"Australia"]
[null,"Austria"]
[null,"Azerbaijan"]
[null,"Bahamas"]
[null,"Bahrain"]
[null,"Bangladesh"]
[null,"Barbados"]
[null,"Belarus"]
[null,"Belgium"]
[null,"Belize"]
[null,"Benin"]
[null,"Bermuda"]
[null,"BES-islands"]
[null,"Bhutan"]
[null,"Bolivia"]
[null,"Bosnia Herzegovina"]
[null,"Botswana"]
[null,"Bouvet Island (Bouvetoya)"]
[null,"Brazil"]
[null,"British Indian Ocean territory"]
[null,"Brunei"]
[null,"Bulgaria"]
[null,"Burkina Faso (formerly Upper Volta)"]
[null,"Burundi"]
[null,"Cambodia"]
[null,"Cameroon"]
[null,"Canada"]
[null,"Cape Verde"]
[null,"Cayman Islands"]
[null,"Central African Republic"]
[null,"Chad"]
[null,"Chile"]
[null,"China"]
[null,"Christmas Island (Australian)"]
[null,"Cocos (Keeling) Islands"]
[null,"Colombia"]
[null,"Comoros"]
[null,"Congo, The Democratic Republic of"]
[null,"Congo-Brazzaville"]
[null,"Cook Islands"]
[null,"Costa Rica"]
[null,"Cote d'Ivoire"]
[null,"Croatia"]
[null,"Cuba"]
[null,"Curaçao"]
[null,"Cyprus"]
[null,"Czech Republic"]
[null,"Denmark"]
[null,"Djibouti"]
[null,"Dominica"]
[null,"Dominican Republic"]
[null,"East Timor"]
[null,"Ecuador"]
[null,"Egypt"]
[null,"El Salvador"]
[null,"Equatorial Guinea"]
[null,"Eritrea"]
[null,"Estonia"]
[null,"Ethiopia"]
[null,"European Investment Bank"]
[null,"European Stability Mechanism (ESM)"]
[null,"Falkland Islands (Malvinas)"]
[null,"Faroe Islands"]
[null,"Fiji"]
[null,"Finland"]
[null,"France"]
{"$rows_left_out":177}
{"sheet":"TG8023","index":5,"n_rows":33,"n_cols":91,"rows_kept":33,"cut":false,"hidden":false,"merged":[[27,48,29,48],[28,4,29,4],[28,5,28,7],[28,15,29,15],[28,16,28,18],[28,28,29,28],[28,29,29,29],[28,30,28,35],[28,44,29,44],[28,45,28,47],[27,26,29,26],[27,27,29,27],[27,28,27,35],[27,36,29,36],[27,37,29,37],[27,42,29,42],[27,20,29,20],[27,21,29,21],[27,22,29,22],[27,23,29,23],[27,24,29,24],[27,25,29,25],[27,11,29,11],[27,12,29,12],[27,13,29,13],[27,14,29,14],[27,15,27,18],[27,19,29,19],[27,2,29,2],[27,3,29,3],[27,4,27,7],[27,8,29,8],[27,9,29,9],[27,10,29,10],[26,2,26,8],[26,9,26,12],[26,13,26,19],[26,20,26,23],[26,24,26,37],[26,42,26,48],[25,41,29,41],[25,42,25,48],[25,49,25,50],[25,51,29,51],[25,52,29,52],[25,53,29,53],[26,49,29,49],[26,50,29,50],[27,43,29,43],[27,44,27,47],[24,38,24,39],[24,40,24,41],[24,42,24,50],[24,51,24,53],[25,2,25,12],[25,13,25,23],[25,24,25,37],[25,38,29,38],[25,39,29,39],[25,40,29,40],[1,1,1,14],[4,1,4,11],[8,3,9,3],[17,1,17,11],[21,1,29,1],[21,2,22,53],[23,2,23,39],[23,40,23,41],[23,42,23,53],[24,2,24,37]]}
["Back to Index"]
[null,"Tabel group info : BIS consolidated banking statistics"]
[]
[]
[null,"Institution – BIS consolidated banking statistics"]
[]
[]
[]
[null,null,null,"x-axis"]
[]
[null,null,null,"Value"]
[null,null,null,"010",null,null,null,null,null,null,null,null,null,null,null,null,null,null,null,null,null,null,null,null,null,null,null,null,null,null,null,null,null,null,null,null,null,null,null,null,null,null,null,null,null,null,null,null,null,null,null,null,null,null,null,null,null,null,null,null,null,null,null,null,null,null,null,null,null,null,null,null,null,null,null,null,null,null,null,null,null,null,null,null,null,null,null,null,null,{"$f":"Show!$B$2&\"Institution Rows {\"&COLUMN($C$1)&\"}\"&Index!$E$6","v":"/Institution Rows {3}"},{"$f":"Show!$B$2&\"Institution Columns {\"&COLUMN($D$1)&\"}\"","v":"/Institution Columns {4}"}]
[null,"y-axis",""]
[null,"Reporting institution type","010"]
[null,"Country of parent","020"]
[null,null,null,null,null,null,null,null,null,null,null,null,null,null,null,null,null,null,null,null,null,null,null,null,null,null,null,null,null,null,null,null,null,null,null,null,null,null,null,null,null,null,null,null,null,null,null,null,null,null,null,null,null,null,null,null,null,null,null,null,null,null,null,null,null,null,null,null,null,null,null,null,null,null,null,null,null,null,null,null,null,null,null,null,null,null,null,null,null,{"$f":"Show!$B$2&Show!$B$2&\"Institution Rows {\"&COLUMN($C$1)&\"}\"","v":"//Institution Rows {3}"},{"$f":"Show!$B$2&Show!$B$2&\"Institution Columns {\"&COLUMN($D$1)&\"}\"","v":"//Institution Columns {4}"}]
[]
[null,"8023 - BIS consolidated banking statistics"]
[]
[]
[]
[null,"Vis-à-vis country","x-axis"]
[]
[null,null,"Claims on an immediate counterparty basis",null,null,null,null,null,null,null,null,null,null,null,null,null,null,null,null,null,null,null,null,null,null,null,null,null,null,null,null,null,null,null,null,null,null,null,null,null,"Risk transfer",null,"Claims on a guarantor basis"]
[null,null,"Claims",null,null,null,null,null,null,null,null,null,null,null,null,null,null,null,null,null,null,null,null,null,null,null,null,null,null,null,null,null,null,null,null,null,null,null,"Liabilities",null,"Claims",null,"Claims",null,null,null,null,null,null,null,null,"Other items"]
[null,null,"International claims: cross-border claims in all currencies",null,null,null,null,null,null,null,null,null,null,"International claims: local claims in foreign currency",null,null,null,null,null,null,null,null,null,null,"Local claims in local currencies",null,null,null,null,null,null,null,null,null,null,null,null,null,"Local liabilities in local currencies","Of which: Local liabilities in local currencies - loans/deposits","Outward risk transfer","Inward risk transfer","Total claims",null,null,null,null,null,null,"Of which:",null,"Derivatives contracts","Guarantees extended","Credit commitments"]
[null,null,"Sector",null,null,null,null,null,null,"Remaining maturity",null,null,null,"Sector",null,null,null,null,null,null,"Remaining maturity",null,null,null,"Sector",null,null,null,null,null,null,null,null,null,null,null,null,null,null,null,null,null,"Sector",null,null,null,null,null,null,"Cross-border claims","Local claims"]
[null,null,"Banks","Official sector","Private sector",null,null,null,"Unallocated","≤ 1 year","> 1 - ≤ 2 years","> 2 years","Unallocated by maturity","Banks","Official sector","Private sector",null,null,null,"Unallocated","≤ 1 year","> 1 - ≤ 2 years","> 2 years","Unallocated by maturity","Banks","Of which: loans/deposits","Official sector","Of which: loans/deposits","Private sector",null,null,null,null,null,null,null,"Unallocated","Of which: loans/deposits",null,null,null,null,"Banks","Official sector","Private sector",null,null,null,"Unallocated"]
[null,null,null,null,"Non-bank financial institutions","Private non-financial sector",null,null,null,null,null,null,null,null,null,"Non-bank financial institutions","Private non-financial sector",null,null,null,null,null,null,null,null,null,null,null,"Non-bank financial institutions","Of which: loans/deposits","Private non-financial sector",null,null,null,null,null,null,null,null,null,null,null,null,null,"Non-bank financial institutions","Private non-financial sector"]
[null,null,null,null,null,"Non-financial corporations","Households","Unallocated",null,null,null,null,null,null,null,null,"Non-financial corporations","Households","Unallocated",null,null,null,null,null,null,null,null,null,null,null,"Non-financial corporations","Of which: loans/deposits","Households","Of which: loans/deposits","Unallocated","Of which: loans/deposits",null,null,null,null,null,null,null,null,null,"Non-financial corporations","Households","Unallocated"]
[null,"Y001","021","031","051","071","081","091","101","111","121","131","141","022","032","052","072","082","092","102","112","122","132","142","170","171","180","181","200","201","220","221","230","231","240","241","250","251","260","261","270","280","310","320","340","360","370","380","390","400","410","420","430","440",null,null,null,null,null,null,null,null,null,null,null,null,null,null,null,null,null,null,null,null,null,null,null,null,null,null,null,null,null,null,null,null,null,null,null,{"$f":"Show!$B$2&\"8023 Rows {\"&COLUMN($B$1)&\"}\"&Index!$E$6","v":"/8023 Rows {2}"},{"$f":"Show!$B$2&\"8023 Columns {\"&COLUMN($B$1)&\"}\"","v":"/8023 Columns {2}"}]
[]
[null,null,null,null,null,null,null,null,null,null,null,null,null,null,null,null,null,null,null,null,null,null,null,null,null,null,null,null,null,null,null,null,null,null,null,null,null,null,null,null,null,null,null,null,null,null,null,null,null,null,null,null,null,null,null,null,null,null,null,null,null,null,null,null,null,null,null,null,null,null,null,null,null,null,null,null,null,null,null,null,null,null,null,null,null,null,null,null,null,{"$f":"Show!$B$2&Show!$B$2&\"8023 Rows {\"&COLUMN($B$1)&\"}\"","v":"//8023 Rows {2}"},{"$f":"Show!$B$2&Show!$B$2&\"8023 Columns {\"&COLUMN($BB$1)&\"}\"","v":"//8023 Columns {54}"}]