{"text_format":"1","workbook":"xlsx","n_sheets":6,"sheets":["General data","XBRL Errors","Index","Show","Hierarchies","TG001"],"not_rendered":{"charts":0,"images":3,"macros":1,"external_links":0,"defined_names":35,"comments":0,"pivot_tables":0},"unopened":[],"bounds":{"document_bytes":16777216,"sheet_cells":100000,"rows_first":2000,"rows_last":500,"rows_between":2000,"halvings":0,"cell_chars":16384,"cell_head_chars":4096},"cells_cut":0,"cells_raw":0,"read":"whole","date_system":"1900"}

{"sheet":"General data","index":0,"n_rows":252,"n_cols":23,"rows_kept":252,"cut":false,"hidden":false,"merged":[[0,6,2,6],[3,0,5,9]]}
[null,null,null,null,null,null,null,"Version:",null,"1.0.0.1",null,null,null,null,null,null,"Not applicable/All geographical areas","http://standards.iso.org/iso/17442","Interest Rate Risk reporting [local]","IRR","01","EUR","NL IRR 1.0"]
[null,null,null,null,null,null,null,null,null,null,null,null,null,null,null,null,"AFGHANISTAN","http://standards.iso.org/iso/17442",null,null,"18","AED"]
[null,null,null,null,null,null,null," ",null,null,null,null,null,null,null,null,"ALBANIA","http://standards.iso.org/iso/17442",null,null,"19","AFN"]
[null,null,null,null,null,null,null,null,null,null,null,null,null,null,null,null,"ALGERIA","http://standards.iso.org/iso/17442",null,null,"20","ALL"]
[null,null,null,null,null,null,null,null,null,null,null,null,null,null,null,null,"AMERICAN SAMOA","http://standards.iso.org/iso/17442",null,null,"All","AMD"]
[null,null,null,null,null,null,null,null,null,null,null,null,null,null,null,null,"ANDORRA","http://standards.iso.org/iso/17442",null,null,"All","ANG"]
[null,null,null,null,null,null,null,null,null,null,null,null,null,null,null,null,"ANGOLA","http://standards.iso.org/iso/17442",null,null,null,"AOA"]
[null,"General Data",null,null,null,null,null,null,null,null,null,"/General data label{B}","/General data value{E}",null,null,null,"ANGUILLA","http://standards.iso.org/iso/17442",null,null,null,"ARS"]
[null,null,null,null,null,null,null,null,null,null,null,null,null,null,null,null,"ANTARCTICA","http://standards.iso.org/iso/17442",null,null,null,"AUD"]
["*","Identifier",":","LEGALIDENTIFIER20POS",{"$f":"\"\"&D10","v":"LEGALIDENTIFIER20POS"},{"$f":"IF(D10=\"\",1,0)","v":0},null,null,null,null,null,null,null,null,null,null,"ANTIGUA AND BARBUDA","http://standards.iso.org/iso/17442",null,null,null,"AWG"]
[null,null,null,null,null,null,null,null,null,null,null,null,null,null,null,null,"ARGENTINA","http://standards.iso.org/iso/17442",null,null,null,"AZN"]
["*","Period start date",":","2018-10-01",{"$f":"D12","v":"2018-10-01"},{"$f":"IF(D12=\"\",1,0)","v":0},null,null,null,null,null,null,null,null,null,null,"ARMENIA","http://standards.iso.org/iso/17442",null,null,null,"BAM"]
[null,null,null,null,null,null,null,null,null,null,null,null,null,null,null,null,"ARUBA","http://standards.iso.org/iso/17442",null,null,null,"BBD"]
["*","Period end date",":","2018-12-31",{"$f":"D14","v":"2018-12-31"},{"$f":"IF(D14=\"\",1,0)","v":0},null,null,null,null,null,null,null,null,null,null,"AUSTRALIA","http://standards.iso.org/iso/17442",null,null,null,"BDT"]
[null,null,null,null,null,null,null,null,null,null,null,null,null,null,null,null,"AUSTRIA","http://standards.iso.org/iso/17442",null,null,null,"BGN"]
[null,"Country",":","NETHERLANDS",null,null,null,null,null,null,null,null,null,null,null,null,"AZERBAIJAN","http://standards.iso.org/iso/17442",null,null,null,"BHD"]
[null,null,null,null,null,null,null,null,null,null,null,null,null,null,null,null,"BAHAMAS","http://standards.iso.org/iso/17442",null,null,null,"BIF"]
["*","Filing Currency",":","EUR",{"$f":"\"\"&D18","v":"EUR"},{"$f":"IF(D18=\"\",1,0)","v":0},null,null,null,null,null,null,null,null,null,null,"BAHRAIN","http://standards.iso.org/iso/17442",null,null,null,"BMD"]
[null,null,null,null,null,null,null,null,null,null,null,null,null,null,null,null,"BANGLADESH","http://standards.iso.org/iso/17442",null,null,null,"BND"]
["*","Taxonomy",":","NL IRR 1.0",null,{"$f":"IF(D20=\"\",1,0)","v":0},null,null,null,null,null,null,null,null,null,null,"BARBADOS","http://standards.iso.org/iso/17442",null,null,null,"BOB"]
[null,null,null,null,null,null,null,null,null,null,null,null,null,null,null,null,"BELARUS","http://standards.iso.org/iso/17442",null,null,null,"BRL"]
["*","Module",":","Interest Rate Risk reporting [local]",{"$f":"IFERROR(VLOOKUP(D22,S:T,2,FALSE),\"\")","v":"IRR"},{"$f":"IF(D22=\"\",1,0)","v":0},null,null,null,null,null,null,null,null,null,null,"BELGIUM","http://www.swift.com",null,null,null,"BSD"]
[null,null,null,null,null,null,null,null,null,null,null,null,null,null,null,null,"BELIZE","http://standards.iso.org/iso/17442",null,null,null,"BTN"]
[null,null,null,null,null,null,null,null,null,null,null,null,null,null,null,null,"BENIN","http://standards.iso.org/iso/17442",null,null,null,"BWP"]
[null,"Advanced Requirements",null,null,null,null,null,null,null,null,null,null,null,null,null,null,"BERMUDA","http://standards.iso.org/iso/17442",null,null,null,"BYN"]
[null,null,null,null,null,null,null,null,null,null,null,null,null,null,null,null,"BHUTAN","http://standards.iso.org/iso/17442",null,null,null,"BZD"]
[null,"Identifier scheme",":",{"$f":"IFERROR(VLOOKUP(D16,Q:R,2,FALSE),R1)","v":"http://standards.iso.org/iso/17442"},{"$f":"D27","v":"http://standards.iso.org/iso/17442"},null,null,null,null,null,null,null,null,null,null,null,"BOLIVIA, PLURINATIONAL STATE OF","http://standards.iso.org/iso/17442",null,null,null,"CAD"]
[]
[null,"Monetary decimals",":"]
[]
[null,"Monetary precision",":",-3,null,{"$f":" 0.5 * 10^(-1 * PP_MonetaryPrecision)","v":500}]
[null,null,null,null,null,null,null,null,null,null,null,null,null,null,null,null,"BRAZIL","http://standards.iso.org/iso/17442",null,null,null,"COP"]
[null,"Pure decimals",":",4,null,{"$f":" 0.5 * 10^(-1 * PP_DecimalPrecision)","v":5.0000000000000002E-5},null,null,null,null,null,null,null,null,null,null,"BRITISH INDIAN OCEAN TERRITORY","http://standards.iso.org/iso/17442",null,null,null,"CRC"]
[null,null,null,null,null,null,null,null,null,null,null,null,null,null,null,null,"BRUNEI DARUSSALAM","http://standards.iso.org/iso/17442",null,null,null,"CUC"]
[null,"Pure precision",":",4,null,null,null,"#XBRL made simple!",null,null,null,null,null,null,null,null,"BULGARIA","http://standards.iso.org/iso/17442",null,null,null,"CUP"]
[null,null,null,null,null,null,null,null,null,null,null,null,null,null,null,null,"BURKINA FASO","http://standards.iso.org/iso/17442",null,null,null,"CVE"]
[null,"Concatenate Errors",":",false,null,null,null,null,null,null,null,null,null,null,null,null,"BURUNDI","http://standards.iso.org/iso/17442",null,null,null,"CZK"]
[null,"Additional Requirements (Country specific)",null,null,null,null,null,null,null,null,null,null,null,null,null,null,"CAMBODIA","http://standards.iso.org/iso/17442",null,null,null,"DJF"]
["BELGIUM",null,null,null,null,null,null,null,null,null,null,null,null,null,null,null,"CAMEROON","http://standards.iso.org/iso/17442",null,null,null,"DKK"]
["BELGIUM","Post Parsing features",":",null,null,{"$f":"IF(AND(A40=PP_Country,D40=\"\"),1,0)","v":0},null,null,null,null,null,null,null,null,null,null,"CANADA","http://standards.iso.org/iso/17442",null,null,null,"DOP"]
["BELGIUM",null,null,null,null,null,null,null,null,null,null,null,null,null,null,null,"CAPE VERDE","http://standards.iso.org/iso/17442",null,null,null,"DZD"]
["BELGIUM","Reporter e-mail",":",null,null,null,null,null,null,null,null,null,null,null,null,null,"CAYMAN ISLANDS","http://standards.iso.org/iso/17442",null,null,null,"EGP"]
["BELGIUM",null,null,null,null,null,null,null,null,null,null,null,null,null,null,null,"CENTRAL AFRICAN REPUBLIC","http://standards.iso.org/iso/17442",null,null,null,"ERN"]
["BELGIUM","Declarer Type",":",null,{"$f":"\"\"&D44","v":""},{"$f":"IF(AND(A44=PP_Country,D44=\"\"),1,0)","v":0},null,null,null,null,null,null,null,null,null,null,"CHAD","http://standards.iso.org/iso/17442",null,null,null,"ETB"]
["BELGIUM",null,null,null,null,null,null,null,null,null,null,null,null,null,null,null,"CHILE","http://standards.iso.org/iso/17442",null,null,null,"EUR"]
["BELGIUM","Domain",":",null,{"$f":"\"\"&D46","v":""},{"$f":"IF(AND(A46=PP_Country,D46=\"\"),1,0)","v":0},null,null,null,null,null,null,null,null,null,null,"CHINA","http://standards.iso.org/iso/17442",null,null,null,"FJD"]
["BELGIUM",null,null,null,null,null,null,null,null,null,null,null,null,null,null,null,"CHRISTMAS ISLAND","http://standards.iso.org/iso/17442",null,null,null,"FKP"]
[null,"ParsePort-specific parameters:",null,null,null,null,null,null,null,null,null,null,null,null,null,null,"COCOS (KEELING) ISLANDS","http://standards.iso.org/iso/17442",null,null,null,"GBP"]
[null,"Compress contexts",null,true]
[null,"Language",null,"EN",null,null,null,null,null,null,null,null,null,null,null,null,"COLOMBIA","http://standards.iso.org/iso/17442",null,null,null,"GEL"]
[null,"Debug mode",null,false,null,null,null,null,null,null,null,null,null,null,null,null,"COMOROS","http://standards.iso.org/iso/17442",null,null,null,"GGP"]
[null,"LookupValue fallback",null,false,null,null,null,null,null,null,null,null,null,null,null,null,"CONGO","http://standards.iso.org/iso/17442",null,null,null,"GHS"]
[null,null,null,null,null,null,null,null,null,null,null,"//General data label{B}","//General data value{E}",null,null,null,"CONGO, THE DEMOCRATIC REPUBLIC OF THE","http://standards.iso.org/iso/17442",null,null,null,"GIP"]
["BELGIUM",null,null,null,null,null,null,null,null,null,null,null,null,null,null,null,"COOK ISLANDS","http://standards.iso.org/iso/17442",null,null,null,"GMD"]
["BELGIUM",null,null,null,null,null,null,null,null,null,null,null,null,null,null,null,"COSTA RICA","http://standards.iso.org/iso/17442",null,null,null,"GNF"]
[null,null,null,null,null,null,null,null,null,null,null,null,null,null,null,null,"CÔTE D'IVOIRE","http://standards.iso.org/iso/17442",null,null,null,"GTQ"]
[null,null,null,null,null,null,null,null,null,null,null,null,null,null,null,null,"CROATIA","http://standards.iso.org/iso/17442",null,null,null,"GYD"]
[null,null,null,null,null,null,null,null,null,null,null,null,null,null,null,null,"CUBA","http://standards.iso.org/iso/17442",null,null,null,"HKD"]
[null,null,null,null,null,null,null,null,null,null,null,null,null,null,null,null,"CURAÇAO","http://standards.iso.org/iso/17442",null,null,null,"HNL"]
[null,null,null,null,null,null,null,null,null,null,null,null,null,null,null,null,"CYPRUS","http://standards.iso.org/iso/17442",null,null,null,"HRK"]
[null,null,null,null,null,null,null,null,null,null,null,null,null,null,null,null,"CZECH REPUBLIC","http://standards.iso.org/iso/17442",null,null,null,"HTG"]
[null,null,null,null,null,null,null,null,null,null,null,null,null,null,null,null,"DENMARK","http://standards.iso.org/iso/17442",null,null,null,"HUF"]
[null,null,null,null,null,null,null,null,null,null,null,null,null,null,null,null,"DJIBOUTI","http://standards.iso.org/iso/17442",null,null,null,"IDR"]
[null,null,null,null,null,null,null,null,null,null,null,null,null,null,null,null,"DOMINICA","http://standards.iso.org/iso/17442",null,null,null,"ILS"]
[null,null,null,null,null,null,null,null,null,null,null,null,null,null,null,null,"DOMINICAN REPUBLIC","http://standards.iso.org/iso/17442",null,null,null,"IMP"]
[null,null,null,null,null,null,null,null,null,null,null,null,null,null,null,null,"ECUADOR","http://standards.iso.org/iso/17442",null,null,null,"INR"]
[null,null,null,null,null,null,null,null,null,null,null,null,null,null,null,null,"EGYPT","http://standards.iso.org/iso/17442",null,null,null,"IQD"]
[null,null,null,null,null,null,null,null,null,null,null,null,null,null,null,null,"EL SALVADOR","http://standards.iso.org/iso/17442",null,null,null,"IRR"]
[null,null,null,null,null,null,null,null,null,null,null,null,null,null,null,null,"EQUATORIAL GUINEA","http://standards.iso.org/iso/17442",null,null,null,"ISK"]
[null,null,null,null,null,null,null,null,null,null,null,null,null,null,null,null,"ERITREA","http://standards.iso.org/iso/17442",null,null,null,"JEP"]
[null,null,null,null,null,null,null,null,null,null,null,null,null,null,null,null,"ESTONIA","http://standards.iso.org/iso/17442",null,null,null,"JMD"]
[null,null,null,null,null,null,null,null,null,null,null,null,null,null,null,null,"ETHIOPIA","http://standards.iso.org/iso/17442",null,null,null,"JOD"]
[null,null,null,null,null,null,null,null,null,null,null,null,null,null,null,null,"FALKLAND ISLANDS (MALVINAS)","http://standards.iso.org/iso/17442",null,null,null,"JPY"]
[null,null,null,null,null,null,null,null,null,null,null,null,null,null,null,null,"FAROE ISLANDS","http://standards.iso.org/iso/17442",null,null,null,"KES"]
[null,null,null,null,null,null,null,null,null,null,null,null,null,null,null,null,"FIJI","http://standards.iso.org/iso/17442",null,null,null,"KGS"]
[null,null,null,null,null,null,null,null,null,null,null,null,null,null,null,null,"FINLAND","http://standards.iso.org/iso/17442",null,null,null,"KHR"]
[null,null,null,null,null,null,null,null,null,null,null,null,null,null,null,null,"FRANCE","http://standards.iso.org/iso/17442",null,null,null,"KMF"]
[null,null,null,null,null,null,null,null,null,null,null,null,null,null,null,null,"FRENCH GUIANA","http://standards.iso.org/iso/17442",null,null,null,"KPW"]
[null,null,null,null,null,null,null,null,null,null,null,null,null,null,null,null,"FRENCH POLYNESIA","http://standards.iso.org/iso/17442",null,null,null,"KRW"]
[null,null,null,null,null,null,null,null,null,null,null,null,null,null,null,null,"FRENCH SOUTHERN TERRITORIES","http://standards.iso.org/iso/17442",null,null,null,"KWD"]
{"$rows_left_out":173}
{"sheet":"XBRL Errors","index":1,"n_rows":1,"n_cols":2,"rows_kept":1,"cut":false,"hidden":false,"merged":[]}
["Timestamp","Error"]

{"sheet":"Index","index":2,"n_rows":6,"n_cols":5,"rows_kept":6,"cut":false,"hidden":false,"merged":[[2,1,2,14]]}
[]
[]
[null,"Index"]
[]
[null,"Template Code","Template Name","Reporting Status"]
[null,"TG001","Table group 001 : Interest Rate Risk tables [local]",null,{"$f":"IF($D$6=\"Reported\",\"@ForceFilingCode:true\",IF($D$6=\"Not Reported\",\"@ForceFilingCode:false\",\"\"))","v":""}]

{"sheet":"Show","index":3,"n_rows":5,"n_cols":3,"rows_kept":5,"cut":false,"hidden":true,"merged":[]}
["Sheet","Prefix","IRR"]
["TG001",{"$f":"IF(HLOOKUP('General data'!$E$22,$C$1:$C$2,2,FALSE)=\"X\",\"/\",\"!\")","v":"/"},"X"]
[]
[{"$f":"IF(Index!D6=\"Not Reported\",\"/T01.01 Rows{Z}@ForceFilingCode:false\",\"\")","v":""},{"$f":"IF(Index!D6=\"Not Reported\",\"//T01.01 Rows{Z}@ForceFilingCode:false\",\"\")","v":""}]
[{"$f":"IF(Index!D6=\"Not Reported\",\"/T02.01 Rows{Z}@ForceFilingCode:false\",\"\")","v":""},{"$f":"IF(Index!D6=\"Not Reported\",\"//T02.01 Rows{Z}@ForceFilingCode:false\",\"\")","v":""}]

{"sheet":"Hierarchies","index":4,"n_rows":153,"n_cols":3,"rows_kept":153,"cut":false,"hidden":true,"merged":[]}
["hier_dom001_001","hier_dom003_002","hier_dom003_002"]
["Yes","Not applicable / All or Total","Not applicable / All or Total"]
["No","Afghan afghani","Afghan afghani"]
[null,"Albanian lek","Albanian lek"]
[null,"Algerian dinar","Algerian dinar"]
[null,"Angolan kwanza","Angolan kwanza"]
[null,"Argentine peso","Argentine peso"]
[null,"Armenian dram","Armenian dram"]
[null,"Aruban florin","Aruban florin"]
[null,"Azerbaijan manat","Azerbaijan manat"]
[null,"Bahamian dollar","Bahamian dollar"]
[null,"Bahraini dinar","Bahraini dinar"]
[null,"Barbados dollar","Barbados dollar"]
[null,"Belize dollar","Belize dollar"]
[null,"Bangladeshi taka","Bangladeshi taka"]
[null,"Bermudian dollar","Bermudian dollar"]
[null,"Bhutanese ngultrum","Bhutanese ngultrum"]
[null,"Boliviano","Boliviano"]
[null,"Bosnia and Herzegovina convertible mark","Bosnia and Herzegovina convertible mark"]
[null,"Botswana pula","Botswana pula"]
[null,"Brazilian real","Brazilian real"]
[null,"Brunei dollar","Brunei dollar"]
[null,"Bulgarian lev","Bulgarian lev"]
[null,"Burundi Franc","Burundi Franc"]
[null,"Cambodian riel","Cambodian riel"]
[null,"Canadian Dollar","Canadian Dollar"]
[null,"Chilean peso","Chilean peso"]
[null,"Renminbi (Chinese) yuan","Renminbi (Chinese) yuan"]
[null,"Colombian peso","Colombian peso"]
[null,"Comorian franc ","Comorian franc "]
[null,"Congolese franc","Congolese franc"]
[null,"Costa Rican colon","Costa Rican colon"]
[null,"Cuban peso","Cuban peso"]
[null,"Danish krone","Danish krone"]
[null,"United Arab Emirates dirham","United Arab Emirates dirham"]
[null,"Djibouti Franc","Djibouti Franc"]
[null,"Dominican peso","Dominican peso"]
[null,"Egyptian pound","Egyptian pound"]
[null,"Eritrean nakfa","Eritrean nakfa"]
[null,"Ethiopian birr","Ethiopian birr"]
[null,"Falkland Islands pound","Falkland Islands pound"]
[null,"Fiji dollar","Fiji dollar"]
[null,"Philippine peso","Philippine peso"]
[null,"Gambian dalasi","Gambian dalasi"]
[null,"Georgian lari","Georgian lari"]
[null,"Ghana Cedi","Ghana Cedi"]
[null,"Gibraltar pound","Gibraltar pound"]
[null,"Guatemalan quetzal","Guatemalan quetzal"]
[null,"Guinean franc","Guinean franc"]
[null,"Guyana Dollar","Guyana Dollar"]
[null,"Haitian gourde","Haitian gourde"]
[null,"Honduran lempira","Honduran lempira"]
[null,"Hungarian forint","Hungarian forint"]
[null,"Hong Kong dollar","Hong Kong dollar"]
[null,"Iceland krona","Iceland krona"]
[null,"Indian rupee","Indian rupee"]
[null,"Indonesian rupiah","Indonesian rupiah"]
[null,"Iraqi dinar","Iraqi dinar"]
[null,"Iranian rial","Iranian rial"]
[null,"Jamaican dollar","Jamaican dollar"]
[null,"Japanese Yen","Japanese Yen"]
[null,"Yemeni rial","Yemeni rial"]
[null,"Jordanian dinar","Jordanian dinar"]
[null,"Cayman Islands dollar","Cayman Islands dollar"]
[null,"Cape Verde escudo","Cape Verde escudo"]
[null,"Kazakhstani tenge","Kazakhstani tenge"]
[null,"Kenyan shilling","Kenyan shilling"]
[null,"Kyrgyzstani som","Kyrgyzstani som"]
[null,"Kuwaiti dinar","Kuwaiti dinar"]
[null,"Croatian kuna","Croatian kuna"]
[null,"Lao kip","Lao kip"]
[null,"Lesotho loti","Lesotho loti"]
[null,"Lebanese pound","Lebanese pound"]
[null,"Liberian dollar","Liberian dollar"]
[null,"Libyan dinar","Libyan dinar"]
[null,"Macanese pataca","Macanese pataca"]
[null,"Macedonian denar","Macedonian denar"]
[null,"Malagasy ariary","Malagasy ariary"]
[null,"Malawi kwacha","Malawi kwacha"]
[null,"Maldivian rufiyaa","Maldivian rufiyaa"]
{"$rows_left_out":74}
{"sheet":"TG001","index":5,"n_rows":33,"n_cols":16,"rows_kept":33,"cut":false,"hidden":false,"merged":[[28,2,28,3],[28,4,29,4],[28,5,28,6],[28,7,28,8],[28,9,29,9],[28,10,29,10],[1,1,1,14],[4,1,4,11],[8,3,9,3],[10,3,11,3],[21,1,21,11],[25,1,29,1],[25,2,26,10],[27,2,27,4],[27,5,27,8],[27,9,27,10]]}
["Back to Index"]
[null,"Table group 001 : Interest Rate Risk tables [local]"]
[]
[]
[null,"T01.01 Rapportage Renterisico [local]"]
[]
[]
[]
[null,null,null,"x-axis"]
[]
[null,null,null,"Waarde [local]"]
[]
[null,null,null,"010",null,null,null,{"$f":"Show!$B$2&\"T01.01 Rapportage Renterisico [local] Rows {\"&COLUMN($C$1)&\"}\"&Index!$E$6","v":"/T01.01 Rapportage Renterisico [local] Rows {3}"},{"$f":"Show!$B$2&\"T01.01 Rapportage Renterisico [local] Columns {\"&COLUMN($D$1)&\"}\"","v":"/T01.01 Rapportage Renterisico [local] Columns {4}"}]
[null,"y-axis",""]
[null,"Duration Eigen Vermogen [local]",""]
[null,"Price Value of 1 basispunt (PV01) [local]","010"]
[null,"Eigen vermogen (artikel 72 CRR) [local]","020"]
[null,"Zijn de beginselen uit paragraaf 115 van de renterisico richtsnoeren correct toegepast in de berekening van ∆EVE? [local]","030"]
[null,"Is in de afgelopen drie maanden een daling van EVE onder de zes additionele renteschokscenario's groter dan 15% van het tier 1 kapitaal waargenomen? [local]","040"]
[null,null,null,null,null,null,null,{"$f":"Show!$B$2&Show!$B$2&\"T01.01 Rapportage Renterisico [local] Rows {\"&COLUMN($C$1)&\"}\"","v":"//T01.01 Rapportage Renterisico [local] Rows {3}"},{"$f":"Show!$B$2&Show!$B$2&\"T01.01 Rapportage Renterisico [local] Columns {\"&COLUMN($D$1)&\"}\"","v":"//T01.01 Rapportage Renterisico [local] Columns {4}"}]
[]
[null,"T02.01 Rapportage Renterisico: Significante valuta [local]"]
[]
[]
[]
[null,"Valuta [local]","x-axis"]
[]
[null,null,"Geprognosticeerde netto rente-inkomsten en eigen vermogen onder het basis rentescenario [local]",null,null,"Geleidelijke parallelle verschuiving yieldcurve (mutatie NII) [local]",null,null,null,"Plotselinge parallelle verschuiving yieldcurve (mutatie EVE) [local]"]
[null,null,"Netto rente-inkomsten (NII) [local]",null,"Economische waarde van het eigen vermogen (EVE) [local]","200 bp omhoog [local]",null,"200 bp omlaag [local]",null,"200 bp omhoog [local]","200 bp omlaag [local]"]
[null,null,"1 jaar [local]","2 jaar [local]",null,"Mutatie NII 1 jaar absoluut [local]","Mutatie NII 2 jaar absoluut [local]","Mutatie NII 1 jaar absoluut [local]","Mutatie NII 2 jaar absoluut [local]"]
[null,"D01","010","020","030","040","050","060","070","080","090",null,null,null,{"$f":"Show!$B$2&\"T02.01 Rapportage Renterisico: Significante valuta [local] Rows {\"&COLUMN($B$1)&\"}\"&Index!$E$6","v":"/T02.01 Rapportage Renterisico: Significante valuta [local] Rows {2}"},{"$f":"Show!$B$2&\"T02.01 Rapportage Renterisico: Significante valuta [local] Columns {\"&COLUMN($B$1)&\"}\"","v":"/T02.01 Rapportage Renterisico: Significante valuta [local] Columns {2}"}]
[]
[null,null,null,null,null,null,null,null,null,null,null,null,null,null,{"$f":"Show!$B$2&Show!$B$2&\"T02.01 Rapportage Renterisico: Significante valuta [local] Rows {\"&COLUMN($B$1)&\"}\"","v":"//T02.01 Rapportage Renterisico: Significante valuta [local] Rows {2}"},{"$f":"Show!$B$2&Show!$B$2&\"T02.01 Rapportage Renterisico: Significante valuta [local] Columns {\"&COLUMN($K$1)&\"}\"","v":"//T02.01 Rapportage Renterisico: Significante valuta [local] Columns {11}"}]