{"text_format":"1","workbook":"xlsx","n_sheets":31,"sheets":["General data","XBRL Errors","Index","Show","Hierarchies","TG0001","TG0101","TG0102","TG0103","TG0201","TG0202","TG0301","TG0302","TG0303","TG0401","TG0402","TG0404","TG0501","TG0502","TG0503","TG0504","TG0601","TG0602","TG0603","TG0604","TG0605","TG0606","TG0701","TG0702","TG0703","TG0704"],"not_rendered":{"charts":0,"images":3,"macros":1,"external_links":0,"defined_names":89,"comments":0,"pivot_tables":0},"unopened":[],"bounds":{"document_bytes":16777216,"sheet_cells":100000,"rows_first":2000,"rows_last":500,"rows_between":2000,"halvings":0,"cell_chars":16384,"cell_head_chars":4096},"cells_cut":0,"cells_raw":0,"read":"whole","date_system":"1900"}

{"sheet":"General data","index":0,"n_rows":247,"n_cols":23,"rows_kept":247,"cut":false,"hidden":false,"merged":[[0,6,2,6],[3,0,5,9]]}
[null,null,null,null,null,null,null,"Version:",null,"2.0.0.1",null,null,null,null,null,null,"Not applicable/All geographical areas","http://standards.iso.org/iso/17442","Module with all tables","MSR-ALL","01","EUR","NL MSR 2.0.0"]
[null,null,null,null,null,null,null,null,null,null,null,null,null,null,null,null,"AFGHANISTAN","http://standards.iso.org/iso/17442","MSR Monthly Securities Reporting - Securities holdings and securities issued","MSR-SHSI","14","AED"]
[null,null,null,null,null,null,null," ",null,null,null,null,null,null,null,null,"ALBANIA","http://standards.iso.org/iso/17442","MSR Monthly Securities Reporting - Holdings","MSR-HOLD","15","AFN"]
[null,null,null,null,null,null,null,null,null,null,null,null,null,null,null,null,"ALGERIA","http://standards.iso.org/iso/17442","MSR Monthly Securities Reporting - Securitization Vehicles","MSR-SV","16","ALL"]
[null,null,null,null,null,null,null,null,null,null,null,null,null,null,null,null,"AMERICAN SAMOA","http://standards.iso.org/iso/17442","MSR Monthly Securities Reporting - Custodians","MSR-CUST","17","AMD"]
[null,null,null,null,null,null,null,null,null,null,null,null,null,null,null,null,"ANDORRA","http://standards.iso.org/iso/17442",null,null,"18","ANG"]
[null,null,null,null,null,null,null,null,null,null,null,null,null,null,null,null,"ANGOLA","http://standards.iso.org/iso/17442",null,null,"19","AOA"]
[null,"General Data",null,null,null,null,null,null,null,null,null,"/General data label{B}","/General data value{E}",null,null,null,"ANGUILLA","http://standards.iso.org/iso/17442",null,null,"20","ARS"]
[null,null,null,null,null,null,null,null,null,null,null,null,null,null,null,null,"ANTARCTICA","http://standards.iso.org/iso/17442",null,null,"All","AUD"]
["*","Identifier",":","LEGALIDENTIFIER20POS",{"$f":"\"\"&D10","v":"LEGALIDENTIFIER20POS"},{"$f":"IF(D10=\"\",1,0)","v":0},null,null,null,null,null,null,null,null,null,null,"ANTIGUA AND BARBUDA","http://standards.iso.org/iso/17442",null,null,"All","AWG"]
{"$rows_left_out":238}
{"sheet":"XBRL Errors","index":1,"n_rows":1,"n_cols":2,"rows_kept":1,"cut":false,"hidden":false,"merged":[]}
["Timestamp","Error"]

{"sheet":"Index","index":2,"n_rows":31,"n_cols":5,"rows_kept":31,"cut":false,"hidden":false,"merged":[[2,1,2,14]]}
[]
[]
[null,"Index"]
[]
[null,"Template Code","Template Name","Reporting Status"]
[null,"TG0001","Information - General information",null,{"$f":"IF($D$6=\"Reported\",\"@ForceFilingCode:true\",IF($D$6=\"Not Reported\",\"@ForceFilingCode:false\",\"\"))","v":""}]
[null,"TG0101","Holdings ISIN - Holdings in listed shares, investment fund shares or units (ISIN)",null,{"$f":"IF($D$7=\"Reported\",\"@ForceFilingCode:true\",IF($D$7=\"Not Reported\",\"@ForceFilingCode:false\",\"\"))","v":""}]
[null,"TG0102","Holdings ISIN - Holdings in debt securities (ISIN)",null,{"$f":"IF($D$8=\"Reported\",\"@ForceFilingCode:true\",IF($D$8=\"Not Reported\",\"@ForceFilingCode:false\",\"\"))","v":""}]
[null,"TG0103","Holdings ISIN - Holdings in securities denominated in units but paying interest (ISIN)",null,{"$f":"IF($D$9=\"Reported\",\"@ForceFilingCode:true\",IF($D$9=\"Not Reported\",\"@ForceFilingCode:false\",\"\"))","v":""}]
[null,"TG0201","Holdings NON ISIN - Holdings in debt securities (NON ISIN)",null,{"$f":"IF($D$10=\"Reported\",\"@ForceFilingCode:true\",IF($D$10=\"Not Reported\",\"@ForceFilingCode:false\",\"\"))","v":""}]
{"$rows_left_out":22}
{"sheet":"Show","index":3,"n_rows":54,"n_cols":7,"rows_kept":54,"cut":false,"hidden":true,"merged":[]}
["Sheet","Prefix","MSR-ALL","MSR-SHSI","MSR-HOLD","MSR-SV","MSR-CUST"]
["TG0001",{"$f":"IF(AND(HLOOKUP('General data'!$E$22,$C$1:$H$2,2,FALSE)=\"X\",Index!D6=\"Reported\"),\"/\",\"!\")","v":"!"},"X","X","X","X","X"]
["TG0101",{"$f":"IF(AND(HLOOKUP('General data'!$E$22,$C$1:$H$3,3,FALSE)=\"X\",Index!D7=\"Reported\"),\"/\",\"!\")","v":"!"},"X","X","X","X"]
["TG0102",{"$f":"IF(AND(HLOOKUP('General data'!$E$22,$C$1:$H$4,4,FALSE)=\"X\",Index!D8=\"Reported\"),\"/\",\"!\")","v":"!"},"X","X","X","X"]
["TG0103",{"$f":"IF(AND(HLOOKUP('General data'!$E$22,$C$1:$H$5,5,FALSE)=\"X\",Index!D9=\"Reported\"),\"/\",\"!\")","v":"!"},"X","X","X","X"]
["TG0201",{"$f":"IF(AND(HLOOKUP('General data'!$E$22,$C$1:$H$6,6,FALSE)=\"X\",Index!D10=\"Reported\"),\"/\",\"!\")","v":"!"},"X","X","X","X"]
["TG0202",{"$f":"IF(AND(HLOOKUP('General data'!$E$22,$C$1:$H$7,7,FALSE)=\"X\",Index!D11=\"Reported\"),\"/\",\"!\")","v":"!"},"X","X","X","X"]
["TG0301",{"$f":"IF(AND(HLOOKUP('General data'!$E$22,$C$1:$H$8,8,FALSE)=\"X\",Index!D12=\"Reported\"),\"/\",\"!\")","v":"!"},"X","X"]
["TG0302",{"$f":"IF(AND(HLOOKUP('General data'!$E$22,$C$1:$H$9,9,FALSE)=\"X\",Index!D13=\"Reported\"),\"/\",\"!\")","v":"!"},"X","X"]
["TG0303",{"$f":"IF(AND(HLOOKUP('General data'!$E$22,$C$1:$H$10,10,FALSE)=\"X\",Index!D14=\"Reported\"),\"/\",\"!\")","v":"!"},"X",null,null,"X"]
{"$rows_left_out":45}
{"sheet":"Hierarchies","index":4,"n_rows":263,"n_cols":18,"rows_kept":263,"cut":false,"hidden":true,"merged":[]}
["hier_dom057_001","hier_dom057_001","hier_dom050_043","hier_dom030_008","hier_dom008_003","hier_dom057_002","hier_dom057_002","hier_dom050_042","hier_dom059_001","hier_dom060_001","hier_dom013_001","hier_dom003_001","hier_dom030_006","hier_dom030_006","hier_dom052_006","hier_dom052_006","hier_dom052_005","hier_dom052_005"]
["Not applicable / All or Total","Not applicable / All or Total","Short-term debt securities (original maturity < 1 yr)","Afghanistan","Not applicable / All or Total","Not applicable / All or Total","Not applicable / All or Total","Money market fund shares/units","Equities","Floater","Monthly","US Dollar","Not applicable / All or Total","Not applicable / All or Total","Not applicable / All or Total","Not applicable / All or Total","Not applicable / All or Total","Not applicable / All or Total"]
["CUSIP","CUSIP","Long-term debt securities (original maturity >= 1 yr)","Albania","Non-financial corporations","CUSIP","CUSIP","Non-MMF investment fund shares/units","Debt","Fixed","Quarterly","Pound Sterling","Afghanistan","Afghanistan","Parent company","Parent company","Parent company","Parent company"]
["SEDOL","SEDOL",null,"Algeria","Central bank","SEDOL","SEDOL",null,"Mixed","Zero coupon","Semi annual","Japanese Yen","Albania","Albania","Fellow enterprise","Fellow enterprise","Fellow enterprise","Fellow enterprise"]
["WKN","WKN",null,"American Samoa (East)","Deposit taking corporations","WKN","WKN",null,"Real estate","Other","Annual","Swiss Franc","Algeria","Algeria","Subsidiary","Subsidiary","Subsidiary","Subsidiary"]
["BT","BT",null,"Andorra","Money market funds","BT","BT",null,"Hedge",null,"Other","Renminbi (Chinese) yuan","American Samoa (East)","American Samoa (East)","Own holdership","Own holdership"]
["BBGID","BBGID",null,"Angola","Non MMF investment funds","BBGID","BBGID",null,"Other",null,null,"ADB Unit of Account","Andorra","Andorra"]
["RIC","RIC",null,"Anguilla","Financial vehicle corporations engaged in securitisation","RIC","RIC",null,null,null,null,"Afghan afghani","Angola","Angola"]
["FIGI","FIGI",null,"Antarctica","Other financial corporations excluding financial vehicle corporations","FIGI","FIGI",null,null,null,null,"Albanian lek","Anguilla","Anguilla"]
["Other","Other",null,"Antigua and Barbuda","Financial auxiliaries","RIAD","RIAD",null,null,null,null,"Algerian dinar","Antarctica","Antarctica"]
{"$rows_left_out":254}
{"sheet":"TG0001","index":5,"n_rows":19,"n_cols":10,"rows_kept":19,"cut":false,"hidden":true,"merged":[[1,1,1,14],[4,1,4,11],[8,3,9,3],[10,3,11,3]]}
["Back to Index"]
[null,"Information - General information"]
[]
[]
[null,"T00.01 - General information"]
[]
[]
[]
[null,null,null,"x-axis"]
[]
{"$rows_left_out":10}
{"sheet":"TG0101","index":6,"n_rows":17,"n_cols":23,"rows_kept":17,"cut":false,"hidden":true,"merged":[[12,3,12,4],[12,5,13,5],[12,6,13,6],[1,1,1,14],[4,1,4,11],[8,1,13,1],[8,2,9,9],[10,2,10,8],[11,2,13,2],[11,3,11,6],[11,7,13,7],[11,8,13,8],[11,9,13,9]]}
["Back to Index"]
[null,"Holdings ISIN - Holdings in listed shares, investment fund shares or units (ISIN)"]
[]
[]
[null,"T01.01 - Holdings in listed shares, investment fund shares or units (ISIN)"]
[]
[]
[]
[null,"ISIN-code","x-axis"]
[]
{"$rows_left_out":8}
{"sheet":"TG0102","index":7,"n_rows":17,"n_cols":25,"rows_kept":17,"cut":false,"hidden":true,"merged":[[11,9,13,9],[11,10,13,10],[11,11,13,11],[12,3,12,4],[12,5,13,5],[12,6,13,6],[1,1,1,14],[4,1,4,11],[8,1,13,1],[8,2,9,11],[10,2,10,8],[10,9,10,11],[11,2,13,2],[11,3,11,6],[11,7,13,7],[11,8,13,8]]}
["Back to Index"]
[null,"Holdings ISIN - Holdings in debt securities (ISIN)"]
[]
[]
[null,"T01.02 - Holdings in debt securities (ISIN)"]
[]
[]
[]
[null,"ISIN-code","x-axis"]
[]
{"$rows_left_out":8}
{"sheet":"TG0103","index":8,"n_rows":17,"n_cols":25,"rows_kept":17,"cut":false,"hidden":true,"merged":[[11,9,13,9],[11,10,13,10],[11,11,13,11],[12,3,12,4],[12,5,13,5],[12,6,13,6],[1,1,1,14],[4,1,4,11],[8,1,13,1],[8,2,9,11],[10,2,10,8],[10,9,10,11],[11,2,13,2],[11,3,11,6],[11,7,13,7],[11,8,13,8]]}
["Back to Index"]
[null,"Holdings ISIN - Holdings in securities denominated in units but paying interest (ISIN)"]
[]
[]
[null,"T01.03 - Holdings in securities denominated in units but paying interest (ISIN)"]
[]
[]
[]
[null,"ISIN-code","x-axis"]
[]
{"$rows_left_out":8}
{"sheet":"TG0201","index":9,"n_rows":17,"n_cols":37,"rows_kept":17,"cut":false,"hidden":true,"merged":[[12,12,13,12],[12,15,13,15],[12,16,13,16],[12,17,13,17],[12,18,13,18],[12,19,13,19],[10,8,10,13],[10,14,10,20],[11,8,13,8],[11,9,11,12],[11,13,13,13],[11,14,13,14],[11,15,11,19],[11,20,13,20],[12,9,12,10],[12,11,13,11],[1,1,1,14],[4,1,4,11],[8,1,13,1],[8,2,13,2],[8,3,9,20],[10,3,13,3],[10,4,13,4],[10,5,13,5],[10,6,13,6],[10,7,13,7]]}
["Back to Index"]
[null,"Holdings NON ISIN - Holdings in debt securities (NON ISIN)"]
[]
[]
[null,"T02.01 - Holdings in debt securities (NON ISIN)"]
[]
[]
[]
[null,"Type of security identifier","Security identifier","x-axis"]
[]
{"$rows_left_out":8}
{"sheet":"TG0202","index":10,"n_rows":17,"n_cols":34,"rows_kept":17,"cut":false,"hidden":true,"merged":[[10,8,13,8],[10,9,10,16],[11,9,13,9],[11,10,11,15],[11,16,13,16],[11,17,13,17],[12,10,12,11],[12,12,12,13],[12,14,13,14],[12,15,13,15],[1,1,1,14],[4,1,4,11],[8,1,13,1],[8,2,13,2],[8,3,9,17],[10,3,13,3],[10,4,13,4],[10,5,13,5],[10,6,13,6],[10,7,13,7]]}
["Back to Index"]
[null,"Holdings NON ISIN - Holdings in investment fund shares or units (NON ISIN)"]
[]
[]
[null,"T02.02 - Holdings in investment fund shares or units (NON ISIN)"]
[]
[]
[]
[null,"Type of security identifier","Security identifier","x-axis"]
[]
{"$rows_left_out":8}
{"sheet":"TG0301","index":11,"n_rows":17,"n_cols":23,"rows_kept":17,"cut":false,"hidden":true,"merged":[[12,3,12,4],[12,5,13,5],[12,6,13,6],[1,1,1,14],[4,1,4,11],[8,1,13,1],[8,2,9,9],[10,2,10,8],[11,2,13,2],[11,3,11,6],[11,7,13,7],[11,8,13,8],[11,9,13,9]]}
["Back to Index"]
[null,"Issuances ISIN - Issued listed shares and investment fund shares or units (ISIN)"]
[]
[]
[null,"T03.01 - Issued listed shares and investment fund shares or units (ISIN)"]
[]
[]
[]
[null,"ISIN-code","x-axis"]
[]
{"$rows_left_out":8}
{"sheet":"TG0302","index":12,"n_rows":17,"n_cols":40,"rows_kept":17,"cut":false,"hidden":true,"merged":[[11,23,13,23],[12,3,12,7],[12,8,12,9],[12,10,13,10],[12,11,13,11],[12,15,13,15],[12,16,13,16],[12,17,13,17],[12,18,13,18],[12,19,13,19],[11,13,13,13],[11,14,13,14],[11,15,11,19],[11,20,13,20],[11,21,13,21],[11,22,13,22],[1,1,1,14],[4,1,4,11],[8,1,13,1],[8,2,9,23],[10,2,10,13],[10,14,10,20],[10,21,10,23],[11,2,13,2],[11,3,11,11],[11,12,13,12]]}
["Back to Index"]
[null,"Issuances ISIN - Issued debt securities (ISIN)"]
[]
[]
[null,"T03.02 - Issued debt securities (ISIN)"]
[]
[]
[]
[null,"ISIN-code","x-axis"]
[]
{"$rows_left_out":8}
{"sheet":"TG0303","index":13,"n_rows":17,"n_cols":43,"rows_kept":17,"cut":false,"hidden":true,"merged":[[11,26,13,26],[12,6,12,10],[12,11,13,11],[12,12,13,12],[12,16,13,16],[12,17,13,17],[12,18,13,18],[12,19,13,19],[12,20,13,20],[11,16,11,20],[11,21,13,21],[11,22,13,22],[11,23,13,23],[11,24,13,24],[11,25,13,25],[11,4,13,4],[11,5,13,5],[11,6,11,12],[11,13,13,13],[11,14,13,14],[11,15,13,15],[1,1,1,14],[4,1,4,11],[8,1,13,1],[8,2,9,26],[10,2,10,4],[10,5,10,14],[10,15,10,21],[10,22,10,26],[11,2,13,2],[11,3,13,3]]}
["Back to Index"]
[null,"Issuances ISIN - Issued securities by securitisation vehicles (ISIN)"]
[]
[]
[null,"T03.03 - Issued securities by securitisation vehicles (ISIN)"]
[]
[]
[]
[null,"ISIN-code","x-axis"]
[]
{"$rows_left_out":8}
{"sheet":"TG0401","index":14,"n_rows":17,"n_cols":47,"rows_kept":17,"cut":false,"hidden":true,"merged":[[12,17,13,17],[12,18,13,18],[12,19,13,19],[12,20,13,20],[12,21,13,21],[11,23,13,23],[11,24,13,24],[11,25,13,25],[11,26,13,26],[11,27,13,27],[11,28,13,28],[11,5,11,13],[11,14,13,14],[11,15,13,15],[11,16,13,16],[11,17,11,21],[11,22,13,22],[12,5,12,9],[12,10,12,11],[12,12,13,12],[12,13,13,13],[1,1,1,14],[4,1,4,11],[8,1,13,1],[8,2,13,2],[8,3,9,28],[10,3,13,3],[10,4,10,15],[10,16,10,22],[10,23,10,28],[11,4,13,4]]}
["Back to Index"]
[null,"Issuances NON ISIN - Issued debt securities (NON ISIN)"]
[]
[]
[null,"T04.01 - Issued debt securities (NON ISIN)"]
[]
[]
[]
[null,"Type of security identifier","Security identifier","x-axis"]
[]
{"$rows_left_out":8}
{"sheet":"TG0402","index":15,"n_rows":17,"n_cols":48,"rows_kept":17,"cut":false,"hidden":true,"merged":[[11,26,13,26],[11,27,13,27],[11,28,13,28],[11,29,13,29],[12,8,12,12],[12,13,13,13],[12,14,13,14],[12,18,13,18],[12,19,13,19],[12,20,13,20],[11,16,13,16],[11,17,13,17],[11,18,11,22],[11,23,13,23],[11,24,13,24],[11,25,13,25],[12,21,13,21],[12,22,13,22],[11,4,13,4],[11,5,13,5],[11,6,13,6],[11,7,13,7],[11,8,11,14],[11,15,13,15],[1,1,1,14],[4,1,4,11],[8,1,13,1],[8,2,13,2],[8,3,9,29],[10,3,13,3],[10,4,10,6],[10,7,10,16],[10,17,10,23],[10,24,10,29]]}
["Back to Index"]
[null,"Issuances NON ISIN - Issued securities by securitisation vehicles (NON ISIN)"]
[]
[]
[null,"T04.02 - Issued securities by securitisation vehicles (NON ISIN)"]
[]
[]
[]
[null,"Type of security identifier","Security identifier","x-axis"]
[]
{"$rows_left_out":8}
{"sheet":"TG0404","index":16,"n_rows":17,"n_cols":31,"rows_kept":17,"cut":false,"hidden":true,"merged":[[11,12,13,12],[12,5,12,6],[12,7,12,8],[12,9,13,9],[12,10,13,10],[1,1,1,14],[4,1,4,11],[8,1,13,1],[8,2,13,2],[8,3,13,3],[8,4,9,12],[10,4,10,11],[11,4,13,4],[11,5,11,10],[11,11,13,11]]}
["Back to Index"]
[null,"Issuances NON ISIN - Issued Investment Fund shares or units (NON ISIN) no LEI"]
[]
[]
[null,"T04.04 - Issued Investment Fund shares or units (NON ISIN) no LEI"]
[]
[]
[]
[null,"Holder country","Holder sector","Name of holder of participations","x-axis"]
[]
{"$rows_left_out":8}
{"sheet":"TG0501","index":17,"n_rows":17,"n_cols":26,"rows_kept":17,"cut":false,"hidden":true,"merged":[[11,10,13,10],[12,4,12,5],[12,6,13,6],[12,7,13,7],[1,1,1,14],[4,1,4,11],[8,1,13,1],[8,2,13,2],[8,3,9,10],[10,3,10,9],[11,3,13,3],[11,4,11,7],[11,8,13,8],[11,9,13,9]]}
["Back to Index"]
[null,"Direct investments - Direct investment and own holdership equities (ISIN, assets)"]
[]
[]
[null,"T05.01 - Direct investment and own holdership equities (ISIN, assets)"]
[]
[]
[]
[null,"Group relationship","ISIN-code","x-axis"]
[]
{"$rows_left_out":8}
{"sheet":"TG0502","index":18,"n_rows":17,"n_cols":28,"rows_kept":17,"cut":false,"hidden":true,"merged":[[11,9,13,9],[11,10,13,10],[11,11,13,11],[11,12,13,12],[12,4,12,5],[12,6,13,6],[12,7,13,7],[1,1,1,14],[4,1,4,11],[8,1,13,1],[8,2,13,2],[8,3,9,12],[10,3,10,9],[10,10,10,12],[11,3,13,3],[11,4,11,7],[11,8,13,8]]}
["Back to Index"]
[null,"Direct investments - Direct investment and own holdership debt securities (ISIN, assets)"]
[]
[]
[null,"T05.02 - Direct investment and own holdership debt securities (ISIN, assets)"]
[]
[]
[]
[null,"Group relationship","ISIN-code","x-axis"]
[]
{"$rows_left_out":8}
{"sheet":"TG0503","index":19,"n_rows":17,"n_cols":29,"rows_kept":17,"cut":false,"hidden":true,"merged":[[11,10,13,10],[11,11,13,11],[12,5,12,6],[12,7,13,7],[12,8,13,8],[1,1,1,14],[4,1,4,11],[8,1,13,1],[8,2,13,2],[8,3,13,3],[8,4,9,11],[10,4,10,10],[11,4,13,4],[11,5,11,8],[11,9,13,9]]}
["Back to Index"]
[null,"Direct investments - Direct investment Equities (ISIN, liabilities)"]
[]
[]
[null,"T05.03 - Direct investment Equities (ISIN, liabilities)"]
[]
[]
[]
[null,"Group relationship","ISIN-code","Country of investor","x-axis"]
[]
{"$rows_left_out":8}
{"sheet":"TG0504","index":20,"n_rows":17,"n_cols":31,"rows_kept":17,"cut":false,"hidden":true,"merged":[[11,9,13,9],[11,10,13,10],[11,11,13,11],[11,12,13,12],[11,13,13,13],[12,5,12,6],[12,7,13,7],[12,8,13,8],[1,1,1,14],[4,1,4,11],[8,1,13,1],[8,2,13,2],[8,3,13,3],[8,4,9,13],[10,4,10,10],[10,11,10,13],[11,4,13,4],[11,5,11,8]]}
["Back to Index"]
[null,"Direct investments - Direct investment debt securities (ISIN, liabilities)"]
[]
[]
[null,"T05.04 - Direct investment debt securities (ISIN, liabilities)"]
[]
[]
[]
[null,"Group relationship","ISIN-code","Country of investor","x-axis"]
[]
{"$rows_left_out":8}
{"sheet":"TG0601","index":21,"n_rows":17,"n_cols":29,"rows_kept":17,"cut":false,"hidden":true,"merged":[[11,10,13,10],[11,11,13,11],[12,5,12,6],[12,7,13,7],[12,8,13,8],[1,1,1,14],[4,1,4,11],[8,1,13,1],[8,2,13,2],[8,3,13,3],[8,4,9,11],[10,4,10,10],[11,4,13,4],[11,5,11,8],[11,9,13,9]]}
["Back to Index"]
[null,"Custodian holdings - Custodian holdings in listed shares, money market funds and investment funds (ISIN)"]
[]
[]
[null,"T06.01 - Custodian holdings in listed shares, money market funds and investment funds (ISIN)"]
[]
[]
[]
[null,"ISIN-code","Holder country","Holder sector","x-axis"]
[]
{"$rows_left_out":8}
{"sheet":"TG0602","index":22,"n_rows":17,"n_cols":31,"rows_kept":17,"cut":false,"hidden":true,"merged":[[11,9,13,9],[11,10,13,10],[11,11,13,11],[11,12,13,12],[11,13,13,13],[12,5,12,6],[12,7,13,7],[12,8,13,8],[1,1,1,14],[4,1,4,11],[8,1,13,1],[8,2,13,2],[8,3,13,3],[8,4,9,13],[10,4,10,10],[10,11,10,13],[11,4,13,4],[11,5,11,8]]}
["Back to Index"]
[null,"Custodian holdings - Custodian holdings in debt securities (ISIN)"]
[]
[]
[null,"T06.02 - Custodian holdings in debt securities (ISIN)"]
[]
[]
[]
[null,"ISIN-code","Holder country","Holder sector","x-axis"]
[]
{"$rows_left_out":8}
{"sheet":"TG0603","index":23,"n_rows":14,"n_cols":15,"rows_kept":14,"cut":false,"hidden":true,"merged":[[1,1,1,14],[4,1,4,11],[8,1,10,1],[8,2,10,2],[8,3,9,3]]}
["Back to Index"]
[null,"Custodian holdings - Custodian emigrants holdings in listed shares and investment fund shares or units (ISIN)"]
[]
[]
[null,"T06.03 - Custodian emigrants holdings in listed shares and investment fund shares or units (ISIN)"]
[]
[]
[]
[null,"ISIN-code","Country of destination","x-axis"]
[]
{"$rows_left_out":5}
{"sheet":"TG0604","index":24,"n_rows":14,"n_cols":15,"rows_kept":14,"cut":false,"hidden":true,"merged":[[1,1,1,14],[4,1,4,11],[8,1,10,1],[8,2,10,2],[8,3,9,3]]}
["Back to Index"]
[null,"Custodian holdings - Custodian emigrants holdings in debt securities (ISIN)"]
[]
[]
[null,"T06.04 - Custodian emigrants holdings in debt securities (ISIN)"]
[]
[]
[]
[null,"ISIN-code","Country of destination","x-axis"]
[]
{"$rows_left_out":5}
{"sheet":"TG0605","index":25,"n_rows":14,"n_cols":15,"rows_kept":14,"cut":false,"hidden":true,"merged":[[1,1,1,14],[4,1,4,11],[8,1,10,1],[8,2,10,2],[8,3,9,3]]}
["Back to Index"]
[null,"Custodian holdings - Custodian immigrants holdings in listed shares and investment fund shares or units (ISIN)"]
[]
[]
[null,"T06.05 - Custodian immigrants holdings in listed shares and investment fund shares or units (ISIN)"]
[]
[]
[]
[null,"ISIN-code","Country of origin","x-axis"]
[]
{"$rows_left_out":5}
{"sheet":"TG0606","index":26,"n_rows":14,"n_cols":15,"rows_kept":14,"cut":false,"hidden":true,"merged":[[1,1,1,14],[4,1,4,11],[8,1,10,1],[8,2,10,2],[8,3,9,3]]}
["Back to Index"]
[null,"Custodian holdings - Custodian immigrants holdings in debt securities (ISIN)"]
[]
[]
[null,"T06.06 - Custodian immigrants holdings in debt securities (ISIN)"]
[]
[]
[]
[null,"ISIN-code","Country of origin","x-axis"]
[]
{"$rows_left_out":5}
{"sheet":"TG0701","index":27,"n_rows":28,"n_cols":12,"rows_kept":28,"cut":false,"hidden":true,"merged":[[1,1,1,14],[4,1,4,11],[8,3,9,5]]}
["Back to Index"]
[null,"Totals - Totals SHSI"]
[]
[]
[null,"T07.01 - Totals SHSI"]
[]
[]
[]
[null,null,null,"x-axis"]
[]
{"$rows_left_out":19}
{"sheet":"TG0702","index":28,"n_rows":22,"n_cols":12,"rows_kept":22,"cut":false,"hidden":true,"merged":[[1,1,1,14],[4,1,4,11],[8,3,9,5]]}
["Back to Index"]
[null,"Totals - Totals HOLD"]
[]
[]
[null,"T07.02 - Totals HOLD"]
[]
[]
[]
[null,null,null,"x-axis"]
[]
{"$rows_left_out":13}
{"sheet":"TG0703","index":29,"n_rows":22,"n_cols":12,"rows_kept":22,"cut":false,"hidden":true,"merged":[[1,1,1,14],[4,1,4,11],[8,3,9,5]]}
["Back to Index"]
[null,"Totals - Totals SV"]
[]
[]
[null,"T07.03 - Totals SV"]
[]
[]
[]
[null,null,null,"x-axis"]
[]
{"$rows_left_out":13}
{"sheet":"TG0704","index":30,"n_rows":21,"n_cols":11,"rows_kept":21,"cut":false,"hidden":true,"merged":[[1,1,1,14],[4,1,4,11],[8,3,9,4]]}
["Back to Index"]
[null,"Totals - Totals CUST"]
[]
[]
[null,"T07.04 - Totals CUST"]
[]
[]
[]
[null,null,null,"x-axis"]
[]
{"$rows_left_out":11}