{"text_format":"1","workbook":"xlsx","n_sheets":8,"sheets":["General data","XBRL Errors","Index","Show","Hierarchies","T00.01","T01.01","T01.02"],"not_rendered":{"charts":0,"images":3,"macros":1,"external_links":0,"defined_names":32,"comments":0,"pivot_tables":0},"unopened":[],"bounds":{"document_bytes":16777216,"sheet_cells":100000,"rows_first":2000,"rows_last":500,"rows_between":2000,"halvings":0,"cell_chars":16384,"cell_head_chars":4096},"cells_cut":0,"cells_raw":0,"read":"whole","date_system":"1900"}

{"sheet":"General data","index":0,"n_rows":252,"n_cols":23,"rows_kept":252,"cut":false,"hidden":false,"merged":[[0,6,2,6],[3,0,5,9]]}
[null,null,null,null,null,null,null,"Version:",null,"1.0.1.1",null,null,null,null,null,null,"Not applicable/All geographical areas","http://standards.iso.org/iso/17442","Profit and loss accounts quarterly reporting","PLA-Q","01","EUR","NL PLA 1.0.1"]
[null,null,null,null,null,null,null,null,null,null,null,null,null,null,null,null,"AFGHANISTAN","http://standards.iso.org/iso/17442",null,null,"18","AED"]
[null,null,null,null,null,null,null," ",null,null,null,null,null,null,null,null,"ALBANIA","http://standards.iso.org/iso/17442",null,null,"19","AFN"]
[null,null,null,null,null,null,null,null,null,null,null,null,null,null,null,null,"ALGERIA","http://standards.iso.org/iso/17442",null,null,"20","ALL"]
[null,null,null,null,null,null,null,null,null,null,null,null,null,null,null,null,"AMERICAN SAMOA","http://standards.iso.org/iso/17442",null,null,"All","AMD"]
[null,null,null,null,null,null,null,null,null,null,null,null,null,null,null,null,"ANDORRA","http://standards.iso.org/iso/17442",null,null,"All","ANG"]
[null,null,null,null,null,null,null,null,null,null,null,null,null,null,null,null,"ANGOLA","http://standards.iso.org/iso/17442",null,null,null,"AOA"]
[null,"General Data",null,null,null,null,null,null,null,null,null,"/General data label{B}","/General data value{E}",null,null,null,"ANGUILLA","http://standards.iso.org/iso/17442",null,null,null,"ARS"]
[null,null,null,null,null,null,null,null,null,null,null,null,null,null,null,null,"ANTARCTICA","http://standards.iso.org/iso/17442",null,null,null,"AUD"]
["*","Identifier",":","LEGALIDENTIFIER20POS",{"$f":"\"\"&D10","v":"LEGALIDENTIFIER20POS"},{"$f":"IF(D10=\"\",1,0)","v":0},null,null,null,null,null,null,null,null,null,null,"ANTIGUA AND BARBUDA","http://standards.iso.org/iso/17442",null,null,null,"AWG"]
[null,null,null,null,null,null,null,null,null,null,null,null,null,null,null,null,"ARGENTINA","http://standards.iso.org/iso/17442",null,null,null,"AZN"]
["*","Period start date",":","2018-10-01",{"$f":"D12","v":"2018-10-01"},{"$f":"IF(D12=\"\",1,0)","v":0},null,null,null,null,null,null,null,null,null,null,"ARMENIA","http://standards.iso.org/iso/17442",null,null,null,"BAM"]
[null,null,null,null,null,null,null,null,null,null,null,null,null,null,null,null,"ARUBA","http://standards.iso.org/iso/17442",null,null,null,"BBD"]
["*","Period end date",":","2018-12-31",{"$f":"D14","v":"2018-12-31"},{"$f":"IF(D14=\"\",1,0)","v":0},null,null,null,null,null,null,null,null,null,null,"AUSTRALIA","http://standards.iso.org/iso/17442",null,null,null,"BDT"]
[null,null,null,null,null,null,null,null,null,null,null,null,null,null,null,null,"AUSTRIA","http://standards.iso.org/iso/17442",null,null,null,"BGN"]
[null,"Country",":","NETHERLANDS",null,null,null,null,null,null,null,null,null,null,null,null,"AZERBAIJAN","http://standards.iso.org/iso/17442",null,null,null,"BHD"]
[null,null,null,null,null,null,null,null,null,null,null,null,null,null,null,null,"BAHAMAS","http://standards.iso.org/iso/17442",null,null,null,"BIF"]
["*","Filing Currency",":","EUR",{"$f":"\"\"&D18","v":"EUR"},{"$f":"IF(D18=\"\",1,0)","v":0},null,null,null,null,null,null,null,null,null,null,"BAHRAIN","http://standards.iso.org/iso/17442",null,null,null,"BMD"]
[null,null,null,null,null,null,null,null,null,null,null,null,null,null,null,null,"BANGLADESH","http://standards.iso.org/iso/17442",null,null,null,"BND"]
["*","Taxonomy",":","NL PLA 1.0.1",null,{"$f":"IF(D20=\"\",1,0)","v":0},null,null,null,null,null,null,null,null,null,null,"BARBADOS","http://standards.iso.org/iso/17442",null,null,null,"BOB"]
[null,null,null,null,null,null,null,null,null,null,null,null,null,null,null,null,"BELARUS","http://standards.iso.org/iso/17442",null,null,null,"BRL"]
["*","Module",":","Profit and loss accounts quarterly reporting",{"$f":"IFERROR(VLOOKUP(D22,S:T,2,FALSE),\"\")","v":"PLA-Q"},{"$f":"IF(D22=\"\",1,0)","v":0},null,null,null,null,null,null,null,null,null,null,"BELGIUM","http://www.swift.com",null,null,null,"BSD"]
[null,null,null,null,null,null,null,null,null,null,null,null,null,null,null,null,"BELIZE","http://standards.iso.org/iso/17442",null,null,null,"BTN"]
[null,null,null,null,null,null,null,null,null,null,null,null,null,null,null,null,"BENIN","http://standards.iso.org/iso/17442",null,null,null,"BWP"]
[null,"Advanced Requirements",null,null,null,null,null,null,null,null,null,null,null,null,null,null,"BERMUDA","http://standards.iso.org/iso/17442",null,null,null,"BYN"]
[null,null,null,null,null,null,null,null,null,null,null,null,null,null,null,null,"BHUTAN","http://standards.iso.org/iso/17442",null,null,null,"BZD"]
[null,"Identifier scheme",":",{"$f":"IFERROR(VLOOKUP(D16,Q:R,2,FALSE),R1)","v":"http://standards.iso.org/iso/17442"},{"$f":"D27","v":"http://standards.iso.org/iso/17442"},null,null,null,null,null,null,null,null,null,null,null,"BOLIVIA, PLURINATIONAL STATE OF","http://standards.iso.org/iso/17442",null,null,null,"CAD"]
[]
[null,"Monetary decimals",":"]
[]
[null,"Monetary precision",":",-3,null,{"$f":" 0.5 * 10^(-1 * PP_MonetaryPrecision)","v":500}]
[null,null,null,null,null,null,null,null,null,null,null,null,null,null,null,null,"BRAZIL","http://standards.iso.org/iso/17442",null,null,null,"COP"]
[null,"Pure decimals",":",4,null,{"$f":" 0.5 * 10^(-1 * PP_DecimalPrecision)","v":5.0000000000000002E-5},null,null,null,null,null,null,null,null,null,null,"BRITISH INDIAN OCEAN TERRITORY","http://standards.iso.org/iso/17442",null,null,null,"CRC"]
[null,null,null,null,null,null,null,null,null,null,null,null,null,null,null,null,"BRUNEI DARUSSALAM","http://standards.iso.org/iso/17442",null,null,null,"CUC"]
[null,"Pure precision",":",4,null,null,null,"#XBRL made simple!",null,null,null,null,null,null,null,null,"BULGARIA","http://standards.iso.org/iso/17442",null,null,null,"CUP"]
[null,null,null,null,null,null,null,null,null,null,null,null,null,null,null,null,"BURKINA FASO","http://standards.iso.org/iso/17442",null,null,null,"CVE"]
[null,"Concatenate Errors",":",false,null,null,null,null,null,null,null,null,null,null,null,null,"BURUNDI","http://standards.iso.org/iso/17442",null,null,null,"CZK"]
[null,"Additional Requirements (Country specific)",null,null,null,null,null,null,null,null,null,null,null,null,null,null,"CAMBODIA","http://standards.iso.org/iso/17442",null,null,null,"DJF"]
["BELGIUM",null,null,null,null,null,null,null,null,null,null,null,null,null,null,null,"CAMEROON","http://standards.iso.org/iso/17442",null,null,null,"DKK"]
["BELGIUM","Post Parsing features",":",null,null,{"$f":"IF(AND(A40=PP_Country,D40=\"\"),1,0)","v":0},null,null,null,null,null,null,null,null,null,null,"CANADA","http://standards.iso.org/iso/17442",null,null,null,"DOP"]
["BELGIUM",null,null,null,null,null,null,null,null,null,null,null,null,null,null,null,"CAPE VERDE","http://standards.iso.org/iso/17442",null,null,null,"DZD"]
["BELGIUM","Reporter e-mail",":",null,null,null,null,null,null,null,null,null,null,null,null,null,"CAYMAN ISLANDS","http://standards.iso.org/iso/17442",null,null,null,"EGP"]
["BELGIUM",null,null,null,null,null,null,null,null,null,null,null,null,null,null,null,"CENTRAL AFRICAN REPUBLIC","http://standards.iso.org/iso/17442",null,null,null,"ERN"]
["BELGIUM","Declarer Type",":",null,{"$f":"\"\"&D44","v":""},{"$f":"IF(AND(A44=PP_Country,D44=\"\"),1,0)","v":0},null,null,null,null,null,null,null,null,null,null,"CHAD","http://standards.iso.org/iso/17442",null,null,null,"ETB"]
["BELGIUM",null,null,null,null,null,null,null,null,null,null,null,null,null,null,null,"CHILE","http://standards.iso.org/iso/17442",null,null,null,"EUR"]
["BELGIUM","Domain",":",null,{"$f":"\"\"&D46","v":""},{"$f":"IF(AND(A46=PP_Country,D46=\"\"),1,0)","v":0},null,null,null,null,null,null,null,null,null,null,"CHINA","http://standards.iso.org/iso/17442",null,null,null,"FJD"]
["BELGIUM",null,null,null,null,null,null,null,null,null,null,null,null,null,null,null,"CHRISTMAS ISLAND","http://standards.iso.org/iso/17442",null,null,null,"FKP"]
[null,"ParsePort-specific parameters:",null,null,null,null,null,null,null,null,null,null,null,null,null,null,"COCOS (KEELING) ISLANDS","http://standards.iso.org/iso/17442",null,null,null,"GBP"]
[null,"Compress contexts",null,true]
[null,"Language",null,"EN",null,null,null,null,null,null,null,null,null,null,null,null,"COLOMBIA","http://standards.iso.org/iso/17442",null,null,null,"GEL"]
[null,"Debug mode",null,false,null,null,null,null,null,null,null,null,null,null,null,null,"COMOROS","http://standards.iso.org/iso/17442",null,null,null,"GGP"]
[null,"LookupValue fallback",null,false,null,null,null,null,null,null,null,null,null,null,null,null,"CONGO","http://standards.iso.org/iso/17442",null,null,null,"GHS"]
[null,null,null,null,null,null,null,null,null,null,null,"//General data label{B}","//General data value{E}",null,null,null,"CONGO, THE DEMOCRATIC REPUBLIC OF THE","http://standards.iso.org/iso/17442",null,null,null,"GIP"]
["BELGIUM",null,null,null,null,null,null,null,null,null,null,null,null,null,null,null,"COOK ISLANDS","http://standards.iso.org/iso/17442",null,null,null,"GMD"]
["BELGIUM",null,null,null,null,null,null,null,null,null,null,null,null,null,null,null,"COSTA RICA","http://standards.iso.org/iso/17442",null,null,null,"GNF"]
[null,null,null,null,null,null,null,null,null,null,null,null,null,null,null,null,"CÔTE D'IVOIRE","http://standards.iso.org/iso/17442",null,null,null,"GTQ"]
[null,null,null,null,null,null,null,null,null,null,null,null,null,null,null,null,"CROATIA","http://standards.iso.org/iso/17442",null,null,null,"GYD"]
[null,null,null,null,null,null,null,null,null,null,null,null,null,null,null,null,"CUBA","http://standards.iso.org/iso/17442",null,null,null,"HKD"]
[null,null,null,null,null,null,null,null,null,null,null,null,null,null,null,null,"CURAÇAO","http://standards.iso.org/iso/17442",null,null,null,"HNL"]
[null,null,null,null,null,null,null,null,null,null,null,null,null,null,null,null,"CYPRUS","http://standards.iso.org/iso/17442",null,null,null,"HRK"]
[null,null,null,null,null,null,null,null,null,null,null,null,null,null,null,null,"CZECH REPUBLIC","http://standards.iso.org/iso/17442",null,null,null,"HTG"]
[null,null,null,null,null,null,null,null,null,null,null,null,null,null,null,null,"DENMARK","http://standards.iso.org/iso/17442",null,null,null,"HUF"]
[null,null,null,null,null,null,null,null,null,null,null,null,null,null,null,null,"DJIBOUTI","http://standards.iso.org/iso/17442",null,null,null,"IDR"]
[null,null,null,null,null,null,null,null,null,null,null,null,null,null,null,null,"DOMINICA","http://standards.iso.org/iso/17442",null,null,null,"ILS"]
[null,null,null,null,null,null,null,null,null,null,null,null,null,null,null,null,"DOMINICAN REPUBLIC","http://standards.iso.org/iso/17442",null,null,null,"IMP"]
[null,null,null,null,null,null,null,null,null,null,null,null,null,null,null,null,"ECUADOR","http://standards.iso.org/iso/17442",null,null,null,"INR"]
[null,null,null,null,null,null,null,null,null,null,null,null,null,null,null,null,"EGYPT","http://standards.iso.org/iso/17442",null,null,null,"IQD"]
[null,null,null,null,null,null,null,null,null,null,null,null,null,null,null,null,"EL SALVADOR","http://standards.iso.org/iso/17442",null,null,null,"IRR"]
[null,null,null,null,null,null,null,null,null,null,null,null,null,null,null,null,"EQUATORIAL GUINEA","http://standards.iso.org/iso/17442",null,null,null,"ISK"]
[null,null,null,null,null,null,null,null,null,null,null,null,null,null,null,null,"ERITREA","http://standards.iso.org/iso/17442",null,null,null,"JEP"]
[null,null,null,null,null,null,null,null,null,null,null,null,null,null,null,null,"ESTONIA","http://standards.iso.org/iso/17442",null,null,null,"JMD"]
[null,null,null,null,null,null,null,null,null,null,null,null,null,null,null,null,"ETHIOPIA","http://standards.iso.org/iso/17442",null,null,null,"JOD"]
[null,null,null,null,null,null,null,null,null,null,null,null,null,null,null,null,"FALKLAND ISLANDS (MALVINAS)","http://standards.iso.org/iso/17442",null,null,null,"JPY"]
[null,null,null,null,null,null,null,null,null,null,null,null,null,null,null,null,"FAROE ISLANDS","http://standards.iso.org/iso/17442",null,null,null,"KES"]
[null,null,null,null,null,null,null,null,null,null,null,null,null,null,null,null,"FIJI","http://standards.iso.org/iso/17442",null,null,null,"KGS"]
[null,null,null,null,null,null,null,null,null,null,null,null,null,null,null,null,"FINLAND","http://standards.iso.org/iso/17442",null,null,null,"KHR"]
[null,null,null,null,null,null,null,null,null,null,null,null,null,null,null,null,"FRANCE","http://standards.iso.org/iso/17442",null,null,null,"KMF"]
[null,null,null,null,null,null,null,null,null,null,null,null,null,null,null,null,"FRENCH GUIANA","http://standards.iso.org/iso/17442",null,null,null,"KPW"]
[null,null,null,null,null,null,null,null,null,null,null,null,null,null,null,null,"FRENCH POLYNESIA","http://standards.iso.org/iso/17442",null,null,null,"KRW"]
[null,null,null,null,null,null,null,null,null,null,null,null,null,null,null,null,"FRENCH SOUTHERN TERRITORIES","http://standards.iso.org/iso/17442",null,null,null,"KWD"]
{"$rows_left_out":173}
{"sheet":"XBRL Errors","index":1,"n_rows":4,"n_cols":2,"rows_kept":4,"cut":false,"hidden":false,"merged":[]}
["Timestamp","Error"]
["2019-12-16T11:59:11","T01.01: Profit or loss before tax for Not allocated is not equal to the difference between incomes and expenses."]
["2019-12-16T11:59:11","T01.01: Profit or loss before tax for Rest of the world outside the Netherlands is not equal to the difference between incomes and expenses."]
["2019-12-16T11:59:11","T01.01: Profit or loss before tax for the Netherlands is not equal to the difference between incomes and expenses."]

{"sheet":"Index","index":2,"n_rows":8,"n_cols":5,"rows_kept":8,"cut":false,"hidden":false,"merged":[[2,1,2,14]]}
[]
[]
[null,"Index"]
[]
[null,"Template Code","Template Name","Reporting Status"]
[null,"T00.01","T00.01 - General information","Reported",{"$f":"IF($D$6=\"Reported\",\"@ForceFilingCode:true\",IF($D$6=\"Not Reported\",\"@ForceFilingCode:false\",\"\"))","v":"@ForceFilingCode:true"}]
[null,"T01.01","T01.01 - Profit and losses of Dutch MFI's","Reported",{"$f":"IF($D$7=\"Reported\",\"@ForceFilingCode:true\",IF($D$7=\"Not Reported\",\"@ForceFilingCode:false\",\"\"))","v":"@ForceFilingCode:true"}]
[null,"T01.02","T01.02 - MFI related information","Reported",{"$f":"IF($D$8=\"Reported\",\"@ForceFilingCode:true\",IF($D$8=\"Not Reported\",\"@ForceFilingCode:false\",\"\"))","v":"@ForceFilingCode:true"}]

{"sheet":"Show","index":3,"n_rows":8,"n_cols":3,"rows_kept":8,"cut":false,"hidden":true,"merged":[]}
["Sheet","Prefix","PLA-Q"]
["T00.01",{"$f":"IF(AND(HLOOKUP('General data'!$E$22,$C$1:$D$2,2,FALSE)=\"X\",Index!D6=\"Reported\"),\"/\",\"!\")","v":"/"},"X"]
["T01.01",{"$f":"IF(AND(HLOOKUP('General data'!$E$22,$C$1:$D$3,3,FALSE)=\"X\",Index!D7=\"Reported\"),\"/\",\"!\")","v":"/"},"X"]
["T01.02",{"$f":"IF(AND(HLOOKUP('General data'!$E$22,$C$1:$D$4,4,FALSE)=\"X\",Index!D8=\"Reported\"),\"/\",\"!\")","v":"/"},"X"]
[]
[{"$f":"IF(Index!D6=\"Not Reported\",\"/T00.01 Rows{Z}@ForceFilingCode:false\",\"\")","v":""},{"$f":"IF(Index!D6=\"Not Reported\",\"//T00.01 Rows{Z}@ForceFilingCode:false\",\"\")","v":""}]
[{"$f":"IF(Index!D7=\"Not Reported\",\"/T01.01 Rows{Z}@ForceFilingCode:false\",\"\")","v":""},{"$f":"IF(Index!D7=\"Not Reported\",\"//T01.01 Rows{Z}@ForceFilingCode:false\",\"\")","v":""}]
[{"$f":"IF(Index!D8=\"Not Reported\",\"/T01.02 Rows{Z}@ForceFilingCode:false\",\"\")","v":""},{"$f":"IF(Index!D8=\"Not Reported\",\"//T01.02 Rows{Z}@ForceFilingCode:false\",\"\")","v":""}]

{"sheet":"Hierarchies","index":4,"n_rows":0,"n_cols":0,"rows_kept":0,"cut":false,"hidden":true,"merged":[]}

{"sheet":"T00.01","index":5,"n_rows":19,"n_cols":9,"rows_kept":19,"cut":false,"hidden":false,"merged":[[1,1,1,14],[4,1,4,11],[8,3,11,3]]}
["Back to Index"]
[null,"Table group TG00: General information"]
[]
[]
[null,"T00.01 - General information"]
[]
[]
[]
[null,null,null,"x-axis"]
[]
[]
[]
[null,null,null,"010",null,null,null,{"$f":"Show!$B$2&\"T00.01 - General information Rows {\"&COLUMN($C$1)&\"}\"&Index!$E$6","v":"/T00.01 - General information Rows {3}@ForceFilingCode:true"},{"$f":"Show!$B$2&\"T00.01 - General information Columns {\"&COLUMN($D$1)&\"}\"","v":"/T00.01 - General information Columns {4}"}]
[null,"y-axis",""]
[null,"Contact details",""]
[null,"Name","010"]
[null,"Telephone number","020"]
[null,"Email adress","030"]
[null,null,null,null,null,null,null,{"$f":"Show!$B$2&Show!$B$2&\"T00.01 - General information Rows {\"&COLUMN($C$1)&\"}\"","v":"//T00.01 - General information Rows {3}"},{"$f":"Show!$B$2&Show!$B$2&\"T00.01 - General information Columns {\"&COLUMN($D$1)&\"}\"","v":"//T00.01 - General information Columns {4}"}]

{"sheet":"T01.01","index":6,"n_rows":84,"n_cols":15,"rows_kept":84,"cut":false,"hidden":false,"merged":[[1,1,1,14],[4,1,4,11],[8,3,9,9],[10,3,10,5],[10,8,12,8],[10,9,12,9],[11,3,12,3],[11,4,11,5],[11,6,12,6],[11,7,12,7]]}
["Back to Index"]
[null,"Table group TG01: PLA"]
[]
[]
[null,"T01.01 - Profit and losses of Dutch MFI's"]
[]
[]
[]
[null,null,null,"x-axis"]
[]
[null,null,null,"Netherlands",null,null,"Netherlands","Rest of the world outside the Netherlands","Not allocated","Grand total"]
[null,null,null,"MFI's","Government and private sector",null,"Total all sectors","Total all sectors"]
[null,null,null,null,"Government","Private sector"]
[null,null,null,"010","020","030","040","050","060","070",null,null,null,{"$f":"Show!$B$3&\"T01.01 - Profit and losses of Dutch MFI's Rows {\"&COLUMN($C$1)&\"}\"&Index!$E$7","v":"/T01.01 - Profit and losses of Dutch MFI's Rows {3}@ForceFilingCode:true"},{"$f":"Show!$B$3&\"T01.01 - Profit and losses of Dutch MFI's Columns {\"&COLUMN($D$1)&\"}\"","v":"/T01.01 - Profit and losses of Dutch MFI's Columns {4}"}]
[null,"y-axis",""]
[null,"Interest income",""]
[null,"Interest on loans and deposits","010"]
[null,"Interest on debt securities held","020"]
[null,"Interest on (interest) derivatives and hedge accounting","030"]
[null,"Other interest income","040"]
[null,"Fee and commission income",""]
[null,"Securities","050"]
[null,"Clearing and Settlement","060"]
[null,"Asset management","070"]
[null,"Trust","080"]
[null,"Financial mediation","090"]
[null,"Fiduciary activities","100"]
[null,"Payment services","110"]
[null,"Travel agency services","120"]
[null,"Structured finance","130"]
[null,"Servicing fees from securitization activities","140"]
[null,"Loan commitments","150"]
[null,"Insurance","160"]
[null,"Other fee and commission income","170"]
[null,"Dividend income (declared)","180"]
[null,"Other operating incomes","190"]
[null,"- of which real estate investments","200"]
[null,"Interest expenses",""]
[null,"Interest on loans and deposits","210"]
[null,"Interest on debt securities issued","220"]
[null,"Interest on (interest) derivatives and hedge accounting","230"]
[null,"Other interest expenses","240"]
[null,"Fee and commission expenses",""]
[null,"Clearing and settlements","250"]
[null,"Trust","260"]
[null,"Servicing fee for securitzation activities","270"]
[null,"Loan commitments received","280"]
[null,"Financial insurance received","290"]
[null,"Other fee and commission expenses","300"]
[null,"Personnel costs",""]
[null,"Wages and salaries","310"]
[null,"Wages in kind","320"]
[null,"Pension and similar expenses","330"]
[null,"Other social expenses","340"]
[null,"Temporary staff expenses","350"]
[null,"Interest discount","360"]
[null,"Share based payments","370"]
[null,"Other personnel costs","380"]
[null,"General and administrative costs","390"]
[null,"Other operating expenses","400"]
[null,"- Of which \"DGS\" expenses","410"]
[null,"- Of which SRF/NRF expenses (contribution 'in cash')","420"]
[null,"- Of which SRF/NRF expenses (in form of IPC)","430"]
[null,"Write-offs/write-downs","440"]
[null,"Provisions","450"]
[null,"Impairments",""]
[null,"Non-financial assets","460"]
[null,"Impairment on financial assets not measured at fair value through profit and loss","470"]
[null,"Valuation changes on assets and liabilities (other then impairments)","480"]
[null,"Profit or loss before tax from continuing operations","490"]
[null,"Profit or loss before tax from discontinued operations",""]
[null,"Result from sale subsidiaries/branches","500"]
[null,"Result form sale participations","510"]
[null,"Result before tax from non-MFI components","520"]
[null,"Tax.","530"]
[null,"- of which \"banking tax\"","540"]
[null,"Net result after tax (profit or loss)","550"]
[null,"Paid out dividend","560"]
[null,"Gross investment intangible assets(purchase-/-sales) in:",""]
[null,"- real estate for own use","570"]
{"$rows_left_out":5}
{"sheet":"T01.02","index":7,"n_rows":31,"n_cols":10,"rows_kept":31,"cut":false,"hidden":false,"merged":[[1,1,1,14],[4,1,4,11],[8,3,9,4],[11,3,12,3],[11,4,12,4]]}
["Back to Index"]
[null,"Table group TG01: PLA"]
[]
[]
[null,"T01.02 - MFI related information"]
[]
[]
[]
[null,null,null,"x-axis"]
[]
[null,null,null,"Netherlands","Rest of the world outside the Netherlands"]
[null,null,null,"Total all sectors","Total all sectors"]
[]
[null,null,null,"010","020",null,null,null,{"$f":"Show!$B$4&\"T01.02 - MFI related information Rows {\"&COLUMN($C$1)&\"}\"&Index!$E$8","v":"/T01.02 - MFI related information Rows {3}@ForceFilingCode:true"},{"$f":"Show!$B$4&\"T01.02 - MFI related information Columns {\"&COLUMN($D$1)&\"}\"","v":"/T01.02 - MFI related information Columns {4}"}]
[null,"y-axis",""]
[null,"Number of business entities","010"]
[null,"Number of offices","020"]
[null,"Number of employees (parttime/fulltime)","030"]
[null,"Number of employees  (in fte's)","040"]
[null,"Number of overnight deposits",""]
[null,"- transferable",""]
[null,"- accessible with internet/PC","050"]
[null,"- not accessible with internet/PC","060"]
[null,"- not transferable",""]
[null,"- accessible with internet/PC","070"]
[null,"- not accessible with internet/PC","080"]
[null,"Number of payment accounts","090"]
[null,"Number of saving accounts",""]
[null,"- with deposits with agreed maturity","100"]
[null,"- with deposits redeemable at notice","110"]
[null,null,null,null,null,null,null,null,{"$f":"Show!$B$4&Show!$B$4&\"T01.02 - MFI related information Rows {\"&COLUMN($C$1)&\"}\"","v":"//T01.02 - MFI related information Rows {3}"},{"$f":"Show!$B$4&Show!$B$4&\"T01.02 - MFI related information Columns {\"&COLUMN($E$1)&\"}\"","v":"//T01.02 - MFI related information Columns {5}"}]