{"text_format":"1","workbook":"xlsx","n_sheets":13,"sheets":["Datapoints","Assertions","General data","Index","Taxonomy","XBRL Errors","Info","T9004HK1","T9004HK2A","T9004HK2B","T9004HK3A","T9004HK3B","Data types and cell colors"],"not_rendered":{"charts":0,"images":5,"macros":1,"external_links":5,"defined_names":52,"comments":0,"pivot_tables":0},"unopened":[],"bounds":{"document_bytes":16777216,"sheet_cells":100000,"rows_first":2000,"rows_last":500,"rows_between":2000,"halvings":0,"cell_chars":16384,"cell_head_chars":4096},"cells_cut":0,"cells_raw":0,"read":"whole","date_system":"1900"}

{"sheet":"Datapoints","index":0,"n_rows":291,"n_cols":23,"rows_kept":291,"cut":false,"hidden":true,"merged":[]}
["Table","Sheet","Key(s)","Row","Column","Cell","Duplicate","{Metric}","dnb_dim:dim013 {Remaining maturity}","dnb_dim:dim037 {Denomination currency}","dnb_dim:dim038 {Collateral and/or guarantees}","dnb_dim:dim039 {Interest rate methodology}","dnb_dim:dim040 {Balance side}","dnb_dim:dim041 {Balance item}","dnb_dim:dim044 {Counterparty country/group}","dnb_dim:dim046 {Measure}","dnb_dim:dim047 {Type of measure}","dnb_dim:dim048 {Amount category}","dnb_dim:dim051 {Counterparty sector}","dnb_dim:dim052 {Original maturity}","dnb_dim:dim053 {Interest rate reset}","dnb_dim:dim054 {Period of notice}","dnb_dim:dim055 {Interest rate fixation}"]
["T9004HK1","","","010","010","D13",null,"dnb_met:pi001 {Weighted percentage}","dnb_dom009:mem006 {<= 1 year}","dnb_dom003:EUR {Euro}",null,"dnb_dom026:mem001 {Annualised agreed rate}","dnb_dom027:mem001 {Assets}","dnb_dom028:mem009 {Loans granted and deposits placed}","dnb_dom030:mem253 {Inside EMU area}","dnb_dom031:mem001 {Outstanding}","dnb_dom032:mem001 {End of period}",null,"dnb_dom008:mem032 {Non-financial corporations}","dnb_dom009:mem004 {> 1 year}"]
["T9004HK1","","","010","020","E13",null,"dnb_met:pi001 {Weighted percentage}","dnb_dom009:mem006 {<= 1 year}","dnb_dom003:EUR {Euro}",null,"dnb_dom026:mem001 {Annualised agreed rate}","dnb_dom027:mem001 {Assets}","dnb_dom028:mem009 {Loans granted and deposits placed}","dnb_dom030:mem253 {Inside EMU area}","dnb_dom031:mem001 {Outstanding}","dnb_dom032:mem001 {End of period}",null,"dnb_dom008:mem035 {Households}","dnb_dom009:mem004 {> 1 year}"]
["T9004HK1","","","020","010","D15",null,"dnb_met:pi001 {Weighted percentage}","dnb_dom009:mem004 {> 1 year}","dnb_dom003:EUR {Euro}",null,"dnb_dom026:mem001 {Annualised agreed rate}","dnb_dom027:mem001 {Assets}","dnb_dom028:mem009 {Loans granted and deposits placed}","dnb_dom030:mem253 {Inside EMU area}","dnb_dom031:mem001 {Outstanding}","dnb_dom032:mem001 {End of period}",null,"dnb_dom008:mem032 {Non-financial corporations}","dnb_dom009:mem004 {> 1 year}","dnb_dom035:mem001 {within 12 months}"]
["T9004HK1","","","020","020","E15",null,"dnb_met:pi001 {Weighted percentage}","dnb_dom009:mem004 {> 1 year}","dnb_dom003:EUR {Euro}",null,"dnb_dom026:mem001 {Annualised agreed rate}","dnb_dom027:mem001 {Assets}","dnb_dom028:mem009 {Loans granted and deposits placed}","dnb_dom030:mem253 {Inside EMU area}","dnb_dom031:mem001 {Outstanding}","dnb_dom032:mem001 {End of period}",null,"dnb_dom008:mem035 {Households}","dnb_dom009:mem004 {> 1 year}","dnb_dom035:mem001 {within 12 months}"]
["T9004HK1","","","030","010","D16",null,"dnb_met:pi001 {Weighted percentage}","dnb_dom009:mem004 {> 1 year}","dnb_dom003:EUR {Euro}",null,"dnb_dom026:mem001 {Annualised agreed rate}","dnb_dom027:mem001 {Assets}","dnb_dom028:mem009 {Loans granted and deposits placed}","dnb_dom030:mem253 {Inside EMU area}","dnb_dom031:mem001 {Outstanding}","dnb_dom032:mem001 {End of period}",null,"dnb_dom008:mem032 {Non-financial corporations}","dnb_dom009:mem004 {> 1 year}","dnb_dom035:mem002 {not within 12 months}"]
["T9004HK1","","","030","020","E16",null,"dnb_met:pi001 {Weighted percentage}","dnb_dom009:mem004 {> 1 year}","dnb_dom003:EUR {Euro}",null,"dnb_dom026:mem001 {Annualised agreed rate}","dnb_dom027:mem001 {Assets}","dnb_dom028:mem009 {Loans granted and deposits placed}","dnb_dom030:mem253 {Inside EMU area}","dnb_dom031:mem001 {Outstanding}","dnb_dom032:mem001 {End of period}",null,"dnb_dom008:mem035 {Households}","dnb_dom009:mem004 {> 1 year}","dnb_dom035:mem002 {not within 12 months}"]
["T9004HK1","","","040","010","D19",null,"dnb_met:pi001 {Weighted percentage}","dnb_dom009:mem009 {<= 2 years}","dnb_dom003:EUR {Euro}",null,"dnb_dom026:mem001 {Annualised agreed rate}","dnb_dom027:mem001 {Assets}","dnb_dom028:mem009 {Loans granted and deposits placed}","dnb_dom030:mem253 {Inside EMU area}","dnb_dom031:mem001 {Outstanding}","dnb_dom032:mem001 {End of period}",null,"dnb_dom008:mem032 {Non-financial corporations}","dnb_dom009:mem005 {> 2 years}"]
["T9004HK1","","","040","020","E19",null,"dnb_met:pi001 {Weighted percentage}","dnb_dom009:mem009 {<= 2 years}","dnb_dom003:EUR {Euro}",null,"dnb_dom026:mem001 {Annualised agreed rate}","dnb_dom027:mem001 {Assets}","dnb_dom028:mem009 {Loans granted and deposits placed}","dnb_dom030:mem253 {Inside EMU area}","dnb_dom031:mem001 {Outstanding}","dnb_dom032:mem001 {End of period}",null,"dnb_dom008:mem035 {Households}","dnb_dom009:mem005 {> 2 years}"]
["T9004HK1","","","050","010","D21",null,"dnb_met:pi001 {Weighted percentage}","dnb_dom009:mem005 {> 2 years}","dnb_dom003:EUR {Euro}",null,"dnb_dom026:mem001 {Annualised agreed rate}","dnb_dom027:mem001 {Assets}","dnb_dom028:mem009 {Loans granted and deposits placed}","dnb_dom030:mem253 {Inside EMU area}","dnb_dom031:mem001 {Outstanding}","dnb_dom032:mem001 {End of period}",null,"dnb_dom008:mem032 {Non-financial corporations}","dnb_dom009:mem005 {> 2 years}","dnb_dom035:mem003 {within 24 months}"]
{"$rows_left_out":282}
{"sheet":"Assertions","index":1,"n_rows":17,"n_cols":14,"rows_kept":17,"cut":false,"hidden":true,"merged":[]}
["ID","Changed per","Last change","Type","Threshold","Severity","Tables","Rows","Columns","Variable \nDefault Value","Sheets","Formula","Expression","Label (nl)"]
["v0001_m",null,"Add","Manual","Interval arithmetics","Non-blocking","T9004HK2A","r080, r190, r300","c030",null,null,"Pattern({T9004HK2A,c030}: r080 = r[90-110]})","$a = sum($b)","The sum of breakdowns by interest rate fixation period must be equal to the total of the maturity concerned. "]
["v0001_m",null,"Add","Manual","Interval arithmetics","Non-blocking","T9004HK3A","r080, r190, r300","c020",null,null,"Pattern({T9004HK3A,c020}: r080 = r[90-110]})","$a = sum($b)","The sum of breakdowns by interest rate fixation period must be equal to the total of the maturity concerned. "]
["v0002_m",null,"Add","Manual","Interval arithmetics","Non-blocking","T9004HK2A",null,"c030",null,null,"sum {T9004HK2A, c030, r[010-060]= sum {T9004HK2A, c030, r[070,080]","sum($a)=sum($b)","The sum of breakdowns by interest rate fixation period must be equal to sum of the original maturities."]
["v0002_m",null,"Add","Manual","Interval arithmetics","Non-blocking","T9004HK2A",null,"c030",null,null,"sum {T9004HK2A, c030, r[120-170]= sum {T9004HK2A, c030, r[180,190]","sum($a)=sum($b)","The sum of breakdowns by interest rate fixation period must be equal to sum of the original maturities."]
["v0002_m",null,"Add","Manual","Interval arithmetics","Non-blocking","T9004HK2A",null,"c030",null,null,"sum {T9004HK2A, c030, r[230-280]= sum {T9004HK2A, c030, r[290,300]","sum($a)=sum($b)","The sum of breakdowns by interest rate fixation period must be equal to sum of the original maturities."]
["v0002_m",null,"Add","Manual","Interval arithmetics","Non-blocking","T9004HK3A",null,"c020",null,null,"sum {T9004HK3A, c020, r[010-060]= sum {T9004HK3A, c020, r[070,080]","sum($a)=sum($b)","The sum of breakdowns by interest rate fixation period must be equal to sum of the original maturities."]
["v0002_m",null,"Add","Manual","Interval arithmetics","Non-blocking","T9004HK3A",null,"c020",null,null,"sum {T9004HK3A, c020, r[120-170]= sum {T9004HK3A, c020, r[180,190]","sum($a)=sum($b)","The sum of breakdowns by interest rate fixation period must be equal to sum of the original maturities."]
["v0002_m",null,"Add","Manual","Interval arithmetics","Non-blocking","T9004HK3A",null,"c020",null,null,"sum {T9004HK3A, c020, r[230-280]= sum {T9004HK3A, c020, r[290,300]","sum($a)=sum($b)","The sum of breakdowns by interest rate fixation period must be equal to sum of the original maturities."]
["v0003_m",null,"Add","Manual","Interval arithmetics","Non-blocking","T9004HK2A, T9004HK3A",null,null,null,null,null,"if ($b=0) then ($a=0) else (($a =($c*$d+$e*$f+$g*$h) div ($d+$f+$h) ))","The interest rate of other loans with maturity > 1 year must be equal to the weighted interest rate of the breakdowns by interest rate fixation period."]
{"$rows_left_out":8}
{"sheet":"General data","index":2,"n_rows":251,"n_cols":23,"rows_kept":251,"cut":false,"hidden":false,"merged":[[0,6,2,6],[3,0,5,9]]}
[null,null,null,null,null,null,null,"Version:",null,"1.0.1.2",null,null,null,null,null,null,"Not applicable/All geographical areas","http://standards.iso.org/iso/17442","DNB MIR reporting","MIR","01","EUR","NL MIR 1.0.1"]
[null,null,null,null,null,null,null,null,null,null,null,null,null,null,null,null,"AFGHANISTAN","http://standards.iso.org/iso/17442",null,null,"02","AED"]
[null,null,null,null,null,null,null," ",null,null,null,null,null,null,null,null,"ALBANIA","http://standards.iso.org/iso/17442",null,null,"04","AFN"]
[null,null,null,null,null,null,null,null,null,null,null,null,null,null,null,null,"ALGERIA","http://standards.iso.org/iso/17442",null,null,"05","ALL"]
[null,null,null,null,null,null,null,null,null,null,null,null,null,null,null,null,"AMERICAN SAMOA","http://standards.iso.org/iso/17442",null,null,"07","AMD"]
[null,null,null,null,null,null,null,null,null,null,null,null,null,null,null,null,"ANDORRA","http://standards.iso.org/iso/17442",null,null,"08","ANG"]
[null,null,null,null,null,null,null,null,null,null,null,null,null,null,null,null,"ANGOLA","http://standards.iso.org/iso/17442",null,null,"10","AOA"]
[null,"General Data",null,null,null,null,null,null,null,null,null,"/General data label{B}","/General data value{E}",null,null,null,"ANGUILLA","http://standards.iso.org/iso/17442",null,null,"11","ARS"]
[null,null,null,null,null,null,null,null,null,null,null,null,null,null,null,null,"ANTARCTICA","http://standards.iso.org/iso/17442",null,null,"12","AUD"]
["*","Identifier",":","LEGALIDENTIFIER20POS",{"$f":"\"\"&D10","v":"LEGALIDENTIFIER20POS"},{"$f":"IF(D10=\"\",1,0)","v":0},null,null,null,null,null,null,null,null,null,null,"ANTIGUA AND BARBUDA","http://standards.iso.org/iso/17442",null,null,"13","AWG"]
{"$rows_left_out":242}
{"sheet":"Index","index":3,"n_rows":9,"n_cols":3,"rows_kept":9,"cut":false,"hidden":false,"merged":[[2,1,2,3]]}
[]
[]
[null,"Table Index MIR"]
[]
[null,"Template","Reporting status"]
[null,"Table group 0: General information"]
[null,"Table group 9004HK1 : MFI Statistics on interest rates, weighted average interest rates on outstanding amounts of Dutch MFIs"]
[null,"Table group 9004HK2 : MFI Statistics on interest rates, weighted average interest rates on all new business of Dutch MFIs"]
[null,"Table group 9004HK3 : MFI Statistics on interest rates, weighted interest rates on new business with collateral and/or guarantees (if cover >= 100%) of Dutch MFIs"]

{"sheet":"Taxonomy","index":4,"n_rows":16,"n_cols":10,"rows_kept":16,"cut":false,"hidden":true,"merged":[]}
["Object","Table","Prefix","Label (nl)","Module"]
["Framework",null,null,"DNB MIR reporting","DNB-NR"]
["Normative code",null,null,null,"MIR-2018-01"]
["Publication date",null,null,null,"2017-12-31"]
["Taxonomy",null,null,"MIR reporting","MIR"]
["Module",null,null,"MFI statistics on interest rates","MIR"]
["Table group","TG000",{"$f":"IF(INDEX($E$6:I7,ROW()-5,MATCH('General data'!$E$22,Taxonomy!$E$6:$E$6,0))=\"X\",\"/\",\"!\")","v":"!"},"Table group 0: General information",null,null,null,null,null,{"$f":"IF(Index!C6=\"reported\",\"@ForceFilingCode:true\",IF(Index!C6=\"not reported\",\"@ForceFilingCode:false\",\"\"))","v":""}]
["Table","Info",{"$f":"IF(INDEX($E$6:I8,ROW()-5,MATCH('General data'!$E$22,Taxonomy!$E$6:$E$6,0))=\"X\",\"/\",\"!\")","v":"/"},"Info - General information","X"]
["Table group","TG9004HK1",{"$f":"IF(INDEX($E$6:I9,ROW()-5,MATCH('General data'!$E$22,Taxonomy!$E$6:$E$6,0))=\"X\",\"/\",\"!\")","v":"!"},"Table group 9004HK1 : MFI Statistics on interest rates, weighted average interest rates on outstanding amounts of Dutch MFIs",null,null,null,null,null,{"$f":"IF(Index!C7=\"reported\",\"@ForceFilingCode:true\",IF(Index!C7=\"not reported\",\"@ForceFilingCode:false\",\"\"))","v":""}]
["Table","T9004HK1",{"$f":"IF(INDEX($E$6:I10,ROW()-5,MATCH('General data'!$E$22,Taxonomy!$E$6:$E$6,0))=\"X\",\"/\",\"!\")","v":"/"},"Weighted interest percentages of all outstanding amounts denominated in euros of Dutch MFIs","X"]
{"$rows_left_out":7}
{"sheet":"XBRL Errors","index":5,"n_rows":1,"n_cols":2,"rows_kept":1,"cut":false,"hidden":false,"merged":[]}
["Timestamp:","Error:"]

{"sheet":"Info","index":6,"n_rows":13,"n_cols":11,"rows_kept":13,"cut":false,"hidden":false,"merged":[[4,1,4,3],[6,1,7,2]]}
[]
[]
[]
[]
[null,"Info - General information",null,null,null,"Metric"]
[]
[null,null,null,"Responsable for reporting"]
[null,null,null,"010",null,null,null,null,null,{"$f":"Taxonomy!$C$8 & $B$5& \" Rows {\"& COLUMN(C9) & \"}\"&Taxonomy!$J$7","v":"/Info - General information Rows {3}"},{"$f":"Taxonomy!$C$8&$B$5& \" Columns {\"&COLUMN(Info!D9)&\"}\"&Taxonomy!$J$7","v":"/Info - General information Columns {4}"}]
[null,"Contact details"]
[null,"Name","010",null,null,"Name contact person {si}"]
{"$rows_left_out":4}
{"sheet":"T9004HK1","index":7,"n_rows":64,"n_cols":16,"rows_kept":64,"cut":false,"hidden":false,"merged":[[4,1,4,4],[6,3,6,4],[6,1,8,2]]}
[]
[null,null,null,null,null,null,"Denomination currency\nCurrency","Counterparty country/group\nCountry","Interest rate methodology\nInterest rate methodology"]
[null,null,null,null,null,null,"Euro","Inside EMU area","Annualised agreed rate"]
[]
[null,"Weighted interest percentages of all outstanding amounts denominated in euros of Dutch MFIs.",null,null,null,null,"Balance side\nBalance side","Balance item\nBalance item","Original maturity\nTime interval","Remaining maturity\nTime interval","Interest rate reset\nInterest rate reset","Period of notice\nTime interval"]
[]
[null,null,null,"Weighted interest rates"]
[null,null,null,"Non-financial corporations","Households"]
[null,null,null,"010","020",null,null,null,null,null,null,null,null,null,{"$f":"Taxonomy!$C$10&\"Weighted interest percentages of all outstanding amounts denominated in euros of Dutch MFIs Rows {\" & COLUMN(C9) & \"} \" &Taxonomy!J9","v":"/Weighted interest percentages of all outstanding amounts denominated in euros of Dutch MFIs Rows {3} "},{"$f":"Taxonomy!$C$10&\"Weighted interest percentages of all outstanding amounts denominated in euros of Dutch MFIs Columns {\" & COLUMN(D9) & \"}\"","v":"/Weighted interest percentages of all outstanding amounts denominated in euros of Dutch MFIs Columns {4}"}]
[null,"Assets"]
{"$rows_left_out":55}
{"sheet":"T9004HK2A","index":8,"n_rows":68,"n_cols":18,"rows_kept":68,"cut":false,"hidden":false,"merged":[[6,3,6,4],[6,5,6,6],[4,1,4,6],[6,1,8,2]]}
[]
[null,null,null,null,null,null,null,null,"Denomination currency\nCurrency","Counterparty country/group\nCountry","Counterparty sector\nSector"]
[null,null,null,null,null,null,null,null,"Euro","Inside EMU area","Non-financial corporations"]
[]
[null,"Weighted interest percentages and volumes of all outstanding amounts denominated in euros of Dutch Non Financial Corporations",null,null,null,null,null,null,"Balance side\nBalance side","Balance item\nBalance item","Amount category\nAmount category","Original maturity\nTime interval","Interest rate fixation\nTime interval"]
[]
[null,null,null,"Interest Rates",null,"Volumes"]
[null,null,null,"Total","of which weighted interest rate on renegotiated new business","Total","of which volume of renegotiated new business"]
[null,null,null,"010","020","030","040",null,null,null,null,null,null,null,null,null,{"$f":"Taxonomy!$C$12&\"Weighted interest percentages and volumes on all new business denominated in euros of Dutch MFI's with Non Financial Corporations Rows {\" & COLUMN(C9) & \"} \" &Taxonomy!J11","v":"/Weighted interest percentages and volumes on all new business denominated in euros of Dutch MFI's with Non Financial Corporations Rows {3} "},{"$f":"Taxonomy!$C$12&\"Weighted interest percentages and volumes on all new business denominated in euros of Dutch MFI's with Non Financial Corporations Columns {\" & COLUMN(D9) & \"}\"","v":"/Weighted interest percentages and volumes on all new business denominated in euros of Dutch MFI's with Non Financial Corporations Columns {4}"}]
[null,"Assets"]
{"$rows_left_out":59}
{"sheet":"T9004HK2B","index":9,"n_rows":45,"n_cols":24,"rows_kept":45,"cut":false,"hidden":false,"merged":[[6,3,6,4],[6,5,6,6],[6,1,8,2],[4,1,4,6]]}
[]
[null,null,null,null,null,null,null,null,"Denomination currency\nCurrency","Counterparty country/group\nCountry","Counterparty sector\nSector"]
[null,null,null,null,null,null,null,null,"Euro","Inside EMU area","Households"]
[]
[null,"Weighted interest percentages and volumes of all outstanding amounts denominated in euros of Dutch Households",null,null,null,null,null,null,"Balance side\nBalance side","Balance item\nBalance item","Interest rate methodology\nInterest rate methodology","Original maturity\nTime interval","Interest rate fixation\nTime interval"]
[]
[null,null,null,"Interest Rates",null,"Volumes"]
[null,null,null,"Total","of which weighted interest rate on renegotiated new business","Total","of which volume of renegotiated new business"]
[null,null,null,"010","020","030","040",null,null,null,null,null,null,null,null,null,null,null,null,null,null,null,{"$f":"Taxonomy!$C$13&\"Weighted interest percentages and volumes on all new business denominated in euros of Dutch MFI's with households Rows {\" & COLUMN(C9) & \"} \" &Taxonomy!J11","v":"/Weighted interest percentages and volumes on all new business denominated in euros of Dutch MFI's with households Rows {3} "},{"$f":"Taxonomy!$C$13&\"Weighted interest percentages and volumes on all new business denominated in euros of Dutch MFI's with households Columns {\" & COLUMN(D9) & \"}\"","v":"/Weighted interest percentages and volumes on all new business denominated in euros of Dutch MFI's with households Columns {4}"}]
[null,"Assets"]
{"$rows_left_out":36}
{"sheet":"T9004HK3A","index":10,"n_rows":59,"n_cols":18,"rows_kept":59,"cut":false,"hidden":false,"merged":[[4,1,4,4],[6,1,7,2]]}
[]
[null,null,null,null,null,null,"Denomination currency\nCurrency","Counterparty country/group\nCountry","Counterparty sector\nSector","Balance side\nBalance side","Collateral and/or guarantees\nCollateral and/or guarantees"]
[null,null,null,null,null,null,"Euro","Inside EMU area","Non-financial corporations","Assets",">= 100%"]
[]
[null,"Weighted interest percentages and volumes of all new contracts denominated in euros with collateral/guarantees (coverage >= 100%) of Dutch Non Financial Corporations",null,null,null,null,"Balance item\nBalance item","Amount category\nAmount category","Original maturity\nTime interval","Interest rate fixation\nTime interval"]
[]
[null,null,null,"Weighted interest rates","Volume of new business"]
[null,null,null,"010","020",null,null,null,null,null,null,null,null,null,null,null,{"$f":"Taxonomy!$C$15&\"Weighted interest percentages and volumes on all new business denominated in euros with collateral/guarantees (coverage >= 100%) with Non Financial Corporations Rows {\" & COLUMN(C8) & \"} \" &Taxonomy!J14","v":"/Weighted interest percentages and volumes on all new business denominated in euros with collateral/guarantees (coverage >= 100%) with Non Financial Corporations Rows {3} "},{"$f":"Taxonomy!$C$15&\"Weighted interest percentages and volumes on all new business denominated in euros with collateral/guarantees (coverage >= 100%) with Non Financial Corporations Columns {\" & COLUMN(D8) & \"}\"","v":"/Weighted interest percentages and volumes on all new business denominated in euros with collateral/guarantees (coverage >= 100%) with Non Financial Corporations Columns {4}"}]
[null,"Assets"]
[]
{"$rows_left_out":50}
{"sheet":"T9004HK3B","index":11,"n_rows":25,"n_cols":17,"rows_kept":25,"cut":false,"hidden":false,"merged":[[4,1,4,4],[6,1,7,2]]}
[]
[null,null,null,null,null,null,"Denomination currency\nCurrency","Counterparty country/group\nCountry","Counterparty sector\nSector","Balance side\nBalance side","Collateral and/or guarantees\nCollateral and/or guarantees"]
[null,null,null,null,null,null,"Euro","Inside EMU area","Households","Assets",">= 100%"]
[]
[null,"Weighted interest percentages and volumes of all new contracts denominated in euros with collateral/guarantees (coverage >= 100%) of Dutch Households",null,null,null,null,"Balance item\nBalance item","Interest rate fixation\nTime interval"]
[]
[null,null,null,"Weighted interest rates","Volume of new business"]
[null,null,null,"010","020",null,null,null,null,null,null,null,null,null,null,{"$f":"Taxonomy!$C$16&\"Weighted interest percentages and volumes on all new business denominated in euros with collateral/guarantees (coverage >= 100%) with  Households Rows {\" & COLUMN(C8) & \"} \" &Taxonomy!J14","v":"/Weighted interest percentages and volumes on all new business denominated in euros with collateral/guarantees (coverage >= 100%) with  Households Rows {3} "},{"$f":"Taxonomy!$C$16&\"Weighted interest percentages and volumes on all new business denominated in euros with collateral/guarantees (coverage >= 100%) with  Households Columns {\" & COLUMN(D8) & \"}\"","v":"/Weighted interest percentages and volumes on all new business denominated in euros with collateral/guarantees (coverage >= 100%) with  Households Columns {4}"}]
[null,"Assets"]
[]
{"$rows_left_out":16}
{"sheet":"Data types and cell colors","index":12,"n_rows":12,"n_cols":3,"rows_kept":12,"cut":false,"hidden":true,"merged":[]}
[]
[null,"Color","Description"]
[null,"{bi}","Boolean"]
[null,"{di}","Date"]
[null,"{ii}","Integer"]
[null,"{mi}","Monetary"]
[null,"{pi}","Percentage"]
[null,"{ei}","QName (Enumeration)"]
[null,"{si}","String"]
[null,"Italic","Key for (merged) open table"]
{"$rows_left_out":2}