{"text_format":"1","workbook":"xlsx","n_sheets":10,"sheets":["General data","XBRL Errors","Index","Show","Hierarchies","T9004HK1","T9004HK2A","T9004HK2B","T9004HK3A","T9004HK3B"],"not_rendered":{"charts":0,"images":3,"macros":1,"external_links":0,"defined_names":35,"comments":0,"pivot_tables":0},"unopened":[],"bounds":{"document_bytes":16777216,"sheet_cells":100000,"rows_first":2000,"rows_last":500,"rows_between":2000,"halvings":0,"cell_chars":16384,"cell_head_chars":4096},"cells_cut":0,"cells_raw":0,"read":"whole","date_system":"1900"}

{"sheet":"General data","index":0,"n_rows":247,"n_cols":23,"rows_kept":247,"cut":false,"hidden":false,"merged":[[0,6,2,6],[3,0,5,9]]}
[null,null,null,null,null,null,null,"Version:",null,"1.1.0.1",null,null,null,null,null,null,"Not applicable/All geographical areas","http://standards.iso.org/iso/17442","Module with all tables","MIR-ALL","01","EUR","NL MIR 1.1.0"]
[null,null,null,null,null,null,null,null,null,null,null,null,null,null,null,null,"AFGHANISTAN","http://standards.iso.org/iso/17442","MFI statistics on interest rates","MIR","17","AED"]
[null,null,null,null,null,null,null," ",null,null,null,null,null,null,null,null,"ALBANIA","http://standards.iso.org/iso/17442",null,null,"18","AFN"]
[null,null,null,null,null,null,null,null,null,null,null,null,null,null,null,null,"ALGERIA","http://standards.iso.org/iso/17442",null,null,"19","ALL"]
[null,null,null,null,null,null,null,null,null,null,null,null,null,null,null,null,"AMERICAN SAMOA","http://standards.iso.org/iso/17442",null,null,"20","AMD"]
[null,null,null,null,null,null,null,null,null,null,null,null,null,null,null,null,"ANDORRA","http://standards.iso.org/iso/17442",null,null,"All","ANG"]
[null,null,null,null,null,null,null,null,null,null,null,null,null,null,null,null,"ANGOLA","http://standards.iso.org/iso/17442",null,null,"All","AOA"]
[null,"General Data",null,null,null,null,null,null,null,null,null,"/General data label{B}","/General data value{E}",null,null,null,"ANGUILLA","http://standards.iso.org/iso/17442",null,null,null,"ARS"]
[null,null,null,null,null,null,null,null,null,null,null,null,null,null,null,null,"ANTARCTICA","http://standards.iso.org/iso/17442",null,null,null,"AUD"]
["*","Identifier",":","LEGALIDENTIFIER20POS",{"$f":"\"\"&D10","v":"LEGALIDENTIFIER20POS"},{"$f":"IF(D10=\"\",1,0)","v":0},null,null,null,null,null,null,null,null,null,null,"ANTIGUA AND BARBUDA","http://standards.iso.org/iso/17442",null,null,null,"AWG"]
[null,null,null,null,null,null,null,null,null,null,null,null,null,null,null,null,"ARGENTINA","http://standards.iso.org/iso/17442",null,null,null,"AZN"]
["*","Period start date",":","2020-01-01",{"$f":"D12","v":"2020-01-01"},{"$f":"IF(D12=\"\",1,0)","v":0},null,null,null,null,null,null,null,null,null,null,"ARMENIA","http://standards.iso.org/iso/17442",null,null,null,"BAM"]
[null,null,null,null,null,null,null,null,null,null,null,null,null,null,null,null,"ARUBA","http://standards.iso.org/iso/17442",null,null,null,"BBD"]
["*","Period end date",":","2020-12-31",{"$f":"D14","v":"2020-12-31"},{"$f":"IF(D14=\"\",1,0)","v":0},null,null,null,null,null,null,null,null,null,null,"AUSTRALIA","http://standards.iso.org/iso/17442",null,null,null,"BDT"]
[null,null,null,null,null,null,null,null,null,null,null,null,null,null,null,null,"AUSTRIA","http://standards.iso.org/iso/17442",null,null,null,"BGN"]
[null,"Country",":","Not applicable/All geographical areas",null,null,null,null,null,null,null,null,null,null,null,null,"AZERBAIJAN","http://standards.iso.org/iso/17442",null,null,null,"BHD"]
[null,null,null,null,null,null,null,null,null,null,null,null,null,null,null,null,"BAHAMAS","http://standards.iso.org/iso/17442",null,null,null,"BIF"]
["*","Filing Currency",":","EUR",{"$f":"\"\"&D18","v":"EUR"},{"$f":"IF(D18=\"\",1,0)","v":0},null,null,null,null,null,null,null,null,null,null,"BAHRAIN","http://standards.iso.org/iso/17442",null,null,null,"BMD"]
[null,null,null,null,null,null,null,null,null,null,null,null,null,null,null,null,"BANGLADESH","http://standards.iso.org/iso/17442",null,null,null,"BND"]
["*","Taxonomy",":","NL MIR 1.1.0",null,{"$f":"IF(D20=\"\",1,0)","v":0},null,null,null,null,null,null,null,null,null,null,"BARBADOS","http://standards.iso.org/iso/17442",null,null,null,"BOB"]
[null,null,null,null,null,null,null,null,null,null,null,null,null,null,null,null,"BELARUS","http://standards.iso.org/iso/17442",null,null,null,"BRL"]
["*","Module",":","Module with all tables",{"$f":"IFERROR(VLOOKUP(D22,S:T,2,FALSE),\"\")","v":"MIR-ALL"},{"$f":"IF(D22=\"\",1,0)","v":0},null,null,null,null,null,null,null,null,null,null,"BELGIUM","http://www.swift.com",null,null,null,"BSD"]
[null,null,null,null,null,null,null,null,null,null,null,null,null,null,null,null,"BELIZE","http://standards.iso.org/iso/17442",null,null,null,"BTN"]
[null,null,null,null,null,null,null,null,null,null,null,null,null,null,null,null,"BENIN","http://standards.iso.org/iso/17442",null,null,null,"BWP"]
[null,"Advanced Requirements",null,null,null,null,null,null,null,null,null,null,null,null,null,null,"BERMUDA","http://standards.iso.org/iso/17442",null,null,null,"BYN"]
[null,null,null,null,null,null,null,null,null,null,null,null,null,null,null,null,"BHUTAN","http://standards.iso.org/iso/17442",null,null,null,"BZD"]
[null,"Identifier scheme",":",{"$f":"IFERROR(VLOOKUP(D16,Q:R,2,FALSE),R1)","v":"http://standards.iso.org/iso/17442"},{"$f":"D27","v":"http://standards.iso.org/iso/17442"},null,null,null,null,null,null,null,null,null,null,null,"BOLIVIA, PLURINATIONAL STATE OF","http://standards.iso.org/iso/17442",null,null,null,"CAD"]
[null,null,null,null,null,null,null,null,null,null,null,null,null,null,null,null,"BRAZIL","http://standards.iso.org/iso/17442",null,null,null,"COP"]
[null,"Monetary decimals",":",null,null,null,null,null,null,null,null,null,null,null,null,null,"BRITISH INDIAN OCEAN TERRITORY","http://standards.iso.org/iso/17442",null,null,null,"CRC"]
[null,null,null,null,null,null,null,null,null,null,null,null,null,null,null,null,"BRUNEI DARUSSALAM","http://standards.iso.org/iso/17442",null,null,null,"CUC"]
[null,"Monetary precision",":",-3,null,{"$f":" 0.5 * 10^(-1 * PP_MonetaryPrecision)","v":500},null,null,null,null,null,null,null,null,null,null,"BULGARIA","http://standards.iso.org/iso/17442",null,null,null,"CUP"]
[null,null,null,null,null,null,null,null,null,null,null,null,null,null,null,null,"BURKINA FASO","http://standards.iso.org/iso/17442",null,null,null,"CVE"]
[null,"Pure decimals",":",4,null,{"$f":" 0.5 * 10^(-1 * PP_DecimalPrecision)","v":5.0000000000000002E-5},null,null,null,null,null,null,null,null,null,null,"BURUNDI","http://standards.iso.org/iso/17442",null,null,null,"CZK"]
[null,null,null,null,null,null,null,null,null,null,null,null,null,null,null,null,"CAMBODIA","http://standards.iso.org/iso/17442",null,null,null,"DJF"]
[null,"Pure precision",":",4,null,null,null,"#XBRL made simple!",null,null,null,null,null,null,null,null,"CAMEROON","http://standards.iso.org/iso/17442",null,null,null,"DKK"]
[null,null,null,null,null,null,null,null,null,null,null,null,null,null,null,null,"CANADA","http://standards.iso.org/iso/17442",null,null,null,"DOP"]
[null,"Concatenate Errors",":",false,null,null,null,null,null,null,null,null,null,null,null,null,"CAPE VERDE","http://standards.iso.org/iso/17442",null,null,null,"DZD"]
[null,"Additional Requirements (Country specific)",null,null,null,null,null,null,null,null,null,null,null,null,null,null,"CAYMAN ISLANDS","http://standards.iso.org/iso/17442",null,null,null,"EGP"]
["BELGIUM",null,null,null,null,null,null,null,null,null,null,null,null,null,null,null,"CENTRAL AFRICAN REPUBLIC","http://standards.iso.org/iso/17442",null,null,null,"ERN"]
["BELGIUM","Post Parsing features",":",null,null,{"$f":"IF(AND(A40=PP_Country,D40=\"\"),1,0)","v":0},null,null,null,null,null,null,null,null,null,null,"CHAD","http://standards.iso.org/iso/17442",null,null,null,"ETB"]
{"$rows_left_out":208}
{"sheet":"XBRL Errors","index":1,"n_rows":1,"n_cols":2,"rows_kept":1,"cut":false,"hidden":false,"merged":[]}
["Timestamp","Error"]

{"sheet":"Index","index":2,"n_rows":10,"n_cols":5,"rows_kept":10,"cut":false,"hidden":false,"merged":[[2,1,2,14]]}
[]
[]
[null,"Index"]
[]
[null,"Template Code","Template Name","Reporting Status"]
[null,"T9004HK1","Weighted interest percentages of all outstanding amounts denominated in euros of Dutch MFIs.",null,{"$f":"IF($D$6=\"Reported\",\"@ForceFilingCode:true\",IF($D$6=\"Not Reported\",\"@ForceFilingCode:false\",\"\"))","v":""}]
[null,"T9004HK2A","Weighted interest percentages and volumes on all new business denominated in euros of Dutch MFI's with Non Financial Corporations",null,{"$f":"IF($D$7=\"Reported\",\"@ForceFilingCode:true\",IF($D$7=\"Not Reported\",\"@ForceFilingCode:false\",\"\"))","v":""}]
[null,"T9004HK2B","Weighted interest percentages and volumes on all new business denominated in euros of Dutch MFI's with households",null,{"$f":"IF($D$8=\"Reported\",\"@ForceFilingCode:true\",IF($D$8=\"Not Reported\",\"@ForceFilingCode:false\",\"\"))","v":""}]
[null,"T9004HK3A","Weighted interest percentages and volumes on all new business denominated in euros with collateral/guarantees (coverage >= 100%) with Non Financial Corporations",null,{"$f":"IF($D$9=\"Reported\",\"@ForceFilingCode:true\",IF($D$9=\"Not Reported\",\"@ForceFilingCode:false\",\"\"))","v":""}]
[null,"T9004HK3B","Weighted interest percentages and volumes on all new business denominated in euros with collateral/guarantees (coverage >= 100%) with  Households",null,{"$f":"IF($D$10=\"Reported\",\"@ForceFilingCode:true\",IF($D$10=\"Not Reported\",\"@ForceFilingCode:false\",\"\"))","v":""}]

{"sheet":"Show","index":3,"n_rows":12,"n_cols":4,"rows_kept":12,"cut":false,"hidden":true,"merged":[]}
["Sheet","Prefix","MIR-ALL","MIR"]
["T9004HK1",{"$f":"IF(AND(HLOOKUP('General data'!$E$22,$C$1:$E$2,2,FALSE)=\"X\",Index!D6=\"Reported\"),\"/\",\"!\")","v":"!"},"X","X"]
["T9004HK2A",{"$f":"IF(AND(HLOOKUP('General data'!$E$22,$C$1:$E$3,3,FALSE)=\"X\",Index!D7=\"Reported\"),\"/\",\"!\")","v":"!"},"X","X"]
["T9004HK2B",{"$f":"IF(AND(HLOOKUP('General data'!$E$22,$C$1:$E$4,4,FALSE)=\"X\",Index!D8=\"Reported\"),\"/\",\"!\")","v":"!"},"X","X"]
["T9004HK3A",{"$f":"IF(AND(HLOOKUP('General data'!$E$22,$C$1:$E$5,5,FALSE)=\"X\",Index!D9=\"Reported\"),\"/\",\"!\")","v":"!"},"X","X"]
["T9004HK3B",{"$f":"IF(AND(HLOOKUP('General data'!$E$22,$C$1:$E$6,6,FALSE)=\"X\",Index!D10=\"Reported\"),\"/\",\"!\")","v":"!"},"X","X"]
[]
[{"$f":"IF(Index!D6=\"Not Reported\",\"/T9004HK1 Rows{Z}@ForceFilingCode:false\",\"\")","v":""},{"$f":"IF(Index!D6=\"Not Reported\",\"//T9004HK1 Rows{Z}@ForceFilingCode:false\",\"\")","v":""}]
[{"$f":"IF(Index!D7=\"Not Reported\",\"/T9004HK2A Rows{Z}@ForceFilingCode:false\",\"\")","v":""},{"$f":"IF(Index!D7=\"Not Reported\",\"//T9004HK2A Rows{Z}@ForceFilingCode:false\",\"\")","v":""}]
[{"$f":"IF(Index!D8=\"Not Reported\",\"/T9004HK2B Rows{Z}@ForceFilingCode:false\",\"\")","v":""},{"$f":"IF(Index!D8=\"Not Reported\",\"//T9004HK2B Rows{Z}@ForceFilingCode:false\",\"\")","v":""}]
[{"$f":"IF(Index!D9=\"Not Reported\",\"/T9004HK3A Rows{Z}@ForceFilingCode:false\",\"\")","v":""},{"$f":"IF(Index!D9=\"Not Reported\",\"//T9004HK3A Rows{Z}@ForceFilingCode:false\",\"\")","v":""}]
[{"$f":"IF(Index!D10=\"Not Reported\",\"/T9004HK3B Rows{Z}@ForceFilingCode:false\",\"\")","v":""},{"$f":"IF(Index!D10=\"Not Reported\",\"//T9004HK3B Rows{Z}@ForceFilingCode:false\",\"\")","v":""}]

{"sheet":"Hierarchies","index":4,"n_rows":0,"n_cols":0,"rows_kept":0,"cut":false,"hidden":true,"merged":[]}

{"sheet":"T9004HK1","index":5,"n_rows":54,"n_cols":10,"rows_kept":54,"cut":false,"hidden":true,"merged":[[1,1,1,14],[4,1,4,11],[8,3,9,4],[10,3,10,4],[11,3,13,3],[11,4,13,4]]}
["Back to Index"]
[null,"Table group 9004HK1 : MFI Statistics on interest rates, weighted average interest rates on outstanding amounts of Dutch MFIs"]
[]
[]
[null,"Weighted interest percentages of all outstanding amounts denominated in euros of Dutch MFIs."]
[]
[]
[]
[null,null,null,"x-axis"]
[]
[null,null,null,"Weighted interest rates"]
[null,null,null,"Non-financial corporations","Households"]
[]
[]
[null,null,null,"010","020",null,null,null,{"$f":"Show!$B$2&\"T9004HK1 Rows {\"&COLUMN($C$1)&\"}\"&Index!$E$6","v":"!T9004HK1 Rows {3}"},{"$f":"Show!$B$2&\"T9004HK1 Columns {\"&COLUMN($D$1)&\"}\"","v":"!T9004HK1 Columns {4}"}]
[null,"y-axis",""]
[null,"Assets",""]
[null,"Loans granted and deposits placed with original maturity > 1 years",""]
[null,"- Of which, remaining maturity <= 1 years","010"]
[null,"- Of which, remaining maturity > 1 years",""]
[null,"- with interest rate reset within 12 months","020"]
[null,"- without interest rate reset within 12 months","030"]
[null,"Loans granted and deposits placed with original maturity > 2 years",""]
[null,"- Of which, remaining maturity <= 2 years","040"]
[null,"- Of which, remaining maturity > 2 years",""]
[null,"- with interest rate reset within 24 months","050"]
[null,"- without interest rate reset within 24 months","060"]
[null,"Loans for house purchases",""]
[null,"- maturity <= 1 year","070"]
[null,"- 1 year < maturity <= 5 year","080"]
[null,"- maturity > 5 year","090"]
[null,"Loans for consumption (personal)",""]
[null,"- maturity <= 1 year","100"]
[null,"- 1 year < maturity <= 5 year","110"]
[null,"- maturity > 5 year","120"]
[null,"Revolving loans","130"]
[null,"Overdrafts","140"]
[null,"Credit cards (extended credit)","150"]
[null,"Other loans",""]
[null,"- maturity <= 1 year","160"]
{"$rows_left_out":15}
{"sheet":"T9004HK2A","index":6,"n_rows":63,"n_cols":12,"rows_kept":63,"cut":false,"hidden":true,"merged":[[1,1,1,14],[4,1,4,11],[8,3,9,6],[10,3,10,4],[10,5,10,6],[11,3,12,3],[11,4,12,4],[11,5,12,5],[11,6,12,6]]}
["Back to Index"]
[null,"Table group 9004HK2 : MFI Statistics on interest rates, weighted average interest rates on all new business of Dutch MFIs"]
[]
[]
[null,"Weighted interest percentages and volumes on all new business denominated in euros of Dutch MFI's with Non Financial Corporations"]
[]
[]
[]
[null,null,null,"x-axis"]
[]
[null,null,null,"Interest Rates",null,"Volumes"]
[null,null,null,"Total","of which weighted interest rate on renegotiated new business","Total","of which volume of renegotiated new business"]
[]
[null,null,null,"010","020","030","040",null,null,null,{"$f":"Show!$B$3&\"T9004HK2A Rows {\"&COLUMN($C$1)&\"}\"&Index!$E$7","v":"!T9004HK2A Rows {3}"},{"$f":"Show!$B$3&\"T9004HK2A Columns {\"&COLUMN($D$1)&\"}\"","v":"!T9004HK2A Columns {4}"}]
[null,"y-axis",""]
[null,"Assets",""]
[null,"Other loans <= EUR 0.25 million (with breakdown of interest rate fixation)",""]
[null,"- floating interest and <= 3 months interest fixation","010"]
[null,"- > 3 months - 1 year interest fixation","020"]
[null,"- > 1 year - 3 years interest fixation","030"]
[null,"- > 3 year - 5 years interest fixation","040"]
[null,"- > 5 years and <= 10 years interest fixation","050"]
[null,"- > 10 years interest fixation","060"]
[null,"Other loans <= EUR 0.25 million (with breakdown of maturity and interest rate fixation)",""]
[null,"- maturity <= 1 year","070"]
[null,"- maturity > 1 year","080"]
[null,"- original maturity > 1 year; and floating interest and <=1 year interest fixation","090"]
[null,"- original maturity > 1 year; and > 1 year and <=5 year interest fixation","100"]
[null,"- original maturity > 1 year; and > 5 year interest fixation","110"]
[null,"Other loans in excess of EUR 0.25 to EUR 1 million (with breakdown by interest fixation)",""]
[null,"- floating interest and <= 3 months interest fixation","120"]
[null,"- > 3 months - 1 year interest fixation","130"]
[null,"- > 1 year - 3 years interest fixation","140"]
[null,"- > 3 year - 5 years interest fixation","150"]
[null,"- > 5 years and <= 10 years interest fixation","160"]
[null,"- > 10 years interest fixation","170"]
[null,"Other loans in excess of EUR 0.25 to EUR 1 million (with breakdown by maturity and interest fixation)",""]
[null,"- maturity <= 1 year","180"]
[null,"- maturity > 1 year","190"]
[null,"- original maturity > 1 year; and floating interest and <=1 year interest fixation","200"]
{"$rows_left_out":24}
{"sheet":"T9004HK2B","index":7,"n_rows":43,"n_cols":12,"rows_kept":43,"cut":false,"hidden":true,"merged":[[1,1,1,14],[4,1,4,11],[8,3,9,6],[10,3,10,4],[10,5,10,6],[11,3,12,3],[11,4,12,4],[11,5,12,5],[11,6,12,6]]}
["Back to Index"]
[null,"Table group 9004HK2 : MFI Statistics on interest rates, weighted average interest rates on all new business of Dutch MFIs"]
[]
[]
[null,"Weighted interest percentages and volumes on all new business denominated in euros of Dutch MFI's with households"]
[]
[]
[]
[null,null,null,"x-axis"]
[]
[null,null,null,"Interest Rates",null,"Volumes"]
[null,null,null,"Total","of which weighted interest rate on renegotiated new business","Total","of which volume of renegotiated new business"]
[]
[null,null,null,"010","020","030","040",null,null,null,{"$f":"Show!$B$4&\"T9004HK2B Rows {\"&COLUMN($C$1)&\"}\"&Index!$E$8","v":"!T9004HK2B Rows {3}"},{"$f":"Show!$B$4&\"T9004HK2B Columns {\"&COLUMN($D$1)&\"}\"","v":"!T9004HK2B Columns {4}"}]
[null,"y-axis",""]
[null,"Assets",""]
[null,"Loans for house purchases",""]
[null,"- floating interest and <= 1 year interest fixation","010"]
[null,"- > 1 year and <= 5 years interest fixation","020"]
[null,"- > 5 years and <= 10 years interest fixation","030"]
[null,"- > 10 years interest fixation","040"]
[null,"Housing loans under APRC methodology","050"]
[null,"Loans for consumption (personal)",""]
[null,"- floating interest and <= 1 year interest fixation","060"]
[null,"- > 1 year and <= 5 years interest fixation","070"]
[null,"- > 5 years interest fixation","080"]
[null,"Loans for consumption purposes under APRC methodology","090"]
[null,"Other loans",""]
[null,"- floating interest and <= 1 year interest fixation","100"]
[null,"- > 1 year and <= 5 years interest fixation","110"]
[null,"- > 5 years interest fixation","120"]
[null,"Other loans, Of which sole proprietors",""]
[null,"- floating interest and <= 1 year interest fixation","121"]
[null,"- > 1 year and <= 5 years interest fixation","122"]
[null,"- > 5 years interest fixation","123"]
[null,"Liabilities",""]
[null,"Deposits with agreed maturity",""]
[null,"- maturity <= 1 year","130"]
[null,"- 1 year < maturity <= 2 year","140"]
[null,"- maturity > 2 year","150"]
{"$rows_left_out":4}
{"sheet":"T9004HK3A","index":8,"n_rows":56,"n_cols":10,"rows_kept":56,"cut":false,"hidden":true,"merged":[[1,1,1,14],[4,1,4,11],[8,3,9,4],[10,3,12,3],[10,4,12,4]]}
["Back to Index"]
[null,"Table group 9004HK3 : MFI Statistics on interest rates, weighted interest rates on new business with collateral and/or guarantees (if cover >= 100%) of Dutch MFIs"]
[]
[]
[null,"Weighted interest percentages and volumes on all new business denominated in euros with collateral/guarantees (coverage >= 100%) with Non Financial Corporations"]
[]
[]
[]
[null,null,null,"x-axis"]
[]
[null,null,null,"Weighted interest rates","Volume of new business"]
[]
[]
[null,null,null,"010","020",null,null,null,{"$f":"Show!$B$5&\"T9004HK3A Rows {\"&COLUMN($C$1)&\"}\"&Index!$E$9","v":"!T9004HK3A Rows {3}"},{"$f":"Show!$B$5&\"T9004HK3A Columns {\"&COLUMN($D$1)&\"}\"","v":"!T9004HK3A Columns {4}"}]
[null,"y-axis",""]
[null,"Assets",""]
[null,"Other loans <= EUR 0.25 million (with breakdown of interest rate fixation)",""]
[null,"- floating interest and <= 3 months interest fixation","010"]
[null,"- > 3 months - 1 year interest fixation","020"]
[null,"- > 1 year - 3 years interest fixation","030"]
[null,"- > 3 year - 5 years interest fixation","040"]
[null,"- > 5 years and <= 10 years interest fixation","050"]
[null,"- > 10 years interest fixation","060"]
[null,"Other loans <= EUR 0.25 million (with breakdown of maturity and interest rate fixation)",""]
[null,"- maturity <= 1 year","070"]
[null,"- maturity > 1 year","080"]
[null,"- original maturity > 1 year; and floating interest and <=1 year interest fixation","090"]
[null,"- original maturity > 1 year; and > 1 year and <=5 year interest fixation","100"]
[null,"- original maturity > 1 year; and > 5 year interest fixation","110"]
[null,"Other loans in excess of EUR 0.25 to EUR 1 million (with breakdown by interest fixation)",""]
[null,"- floating interest and <= 3 months interest fixation","120"]
[null,"- > 3 months - 1 year interest fixation","130"]
[null,"- > 1 year - 3 years interest fixation","140"]
[null,"- > 3 year - 5 years interest fixation","150"]
[null,"- > 5 years and <= 10 years interest fixation","160"]
[null,"- > 10 years interest fixation","170"]
[null,"Other loans in excess of EUR 0.25 to EUR 1 million (with breakdown by maturity and interest fixation)",""]
[null,"- maturity <= 1 year","180"]
[null,"- maturity > 1 year","190"]
[null,"- original maturity > 1 year; and floating interest and <=1 year interest fixation","200"]
{"$rows_left_out":17}
{"sheet":"T9004HK3B","index":9,"n_rows":26,"n_cols":10,"rows_kept":26,"cut":false,"hidden":true,"merged":[[1,1,1,14],[4,1,4,11],[8,3,9,4],[10,3,12,3],[10,4,12,4]]}
["Back to Index"]
[null,"Table group 9004HK3 : MFI Statistics on interest rates, weighted interest rates on new business with collateral and/or guarantees (if cover >= 100%) of Dutch MFIs"]
[]
[]
[null,"Weighted interest percentages and volumes on all new business denominated in euros with collateral/guarantees (coverage >= 100%) with  Households"]
[]
[]
[]
[null,null,null,"x-axis"]
[]
[null,null,null,"Weighted interest rates","Volume of new business"]
[]
[]
[null,null,null,"010","020",null,null,null,{"$f":"Show!$B$6&\"T9004HK3B Rows {\"&COLUMN($C$1)&\"}\"&Index!$E$10","v":"!T9004HK3B Rows {3}"},{"$f":"Show!$B$6&\"T9004HK3B Columns {\"&COLUMN($D$1)&\"}\"","v":"!T9004HK3B Columns {4}"}]
[null,"y-axis",""]
[null,"Assets",""]
[null,"Loans for house purchases",""]
[null,"- floating interest and <= 1 year interest fixation","010"]
[null,"- > 1 year and <= 5 years interest fixation","020"]
[null,"- > 5 years and <= 10 years interest fixation","030"]
[null,"- > 10 years interest fixation","040"]
[null,"Loans for consumption (personal)",""]
[null,"- floating interest and <= 1 year interest fixation","050"]
[null,"- > 1 year and <= 5 years interest fixation","060"]
[null,"- > 5 years interest fixation","070"]
[null,null,null,null,null,null,null,null,{"$f":"Show!$B$6&Show!$B$6&\"T9004HK3B Rows {\"&COLUMN($C$1)&\"}\"","v":"!!T9004HK3B Rows {3}"},{"$f":"Show!$B$6&Show!$B$6&\"T9004HK3B Columns {\"&COLUMN($E$1)&\"}\"","v":"!!T9004HK3B Columns {5}"}]