{"text_format":"1","workbook":"xlsx","n_sheets":4,"sheets":["Stamdata","Enumerations","labels","Pre-validation"],"not_rendered":{"charts":0,"images":0,"macros":1,"external_links":0,"defined_names":17,"comments":0,"pivot_tables":0},"unopened":[],"bounds":{"document_bytes":16777216,"sheet_cells":100000,"rows_first":2000,"rows_last":500,"rows_between":2000,"halvings":0,"cell_chars":16384,"cell_head_chars":4096},"cells_cut":0,"cells_raw":0,"read":"whole","date_system":"1900"}

{"sheet":"Stamdata","index":0,"n_rows":1181,"n_cols":33,"rows_kept":1181,"cut":false,"hidden":false,"merged":[[22,3,22,5],[23,3,23,5],[24,3,24,5],[25,3,25,5],[26,3,26,5],[27,3,27,5],[37,3,37,5],[38,3,38,5],[39,3,39,5],[40,3,40,5],[41,3,41,5],[42,3,42,5],[28,3,28,5],[32,3,32,5],[33,3,33,5],[34,3,34,5],[35,3,35,5],[36,3,36,5],[52,3,52,5],[53,3,53,5],[54,3,54,5],[55,3,55,5],[56,3,56,5],[57,3,57,5],[43,3,43,5],[44,3,44,5],[45,3,45,5],[49,3,49,5],[50,3,50,5],[51,3,51,5],[64,3,64,5],[65,3,65,5],[66,3,66,5],[67,3,67,5],[113,3,113,5],[114,3,114,5],[58,3,58,5],[59,3,59,5],[60,3,60,5],[61,3,61,5],[62,3,62,5],[63,3,63,5],[127,3,127,5],[131,3,131,5],[135,3,135,5],[136,3,136,5],[137,3,137,5],[138,3,138,5],[118,3,118,5],[119,3,119,5],[120,3,120,5],[121,3,121,5],[125,3,125,5],[126,3,126,5],[151,3,151,5],[152,3,152,5],[153,3,153,5],[154,3,154,5],[159,3,159,5],[160,3,160,5],[139,3,139,5],[143,3,143,5],[147,3,147,5],[148,3,148,5],[149,3,149,5],[150,3,150,5],[167,3,167,5],[168,3,168,5],[172,3,172,5],[185,3,185,5],[200,3,200,5],[213,3,213,5],[161,3,161,5],[162,3,162,5],[163,3,163,5],[164,3,164,5],[165,3,165,5],[166,3,166,5],[220,3,220,5],[221,3,221,5],[222,3,222,5],[226,3,226,5],[227,3,227,5],[228,3,228,5],[214,3,214,5],[215,3,215,5],[216,3,216,5],[217,3,217,5],[218,3,218,5],[219,3,219,5],[251,3,251,5],[252,3,252,5],[253,3,253,5],[254,3,254,5],[255,3,255,5],[256,3,256,5],[232,3,232,5],[236,3,236,5],[240,3,240,5],[244,3,244,5],[245,3,245,5],[250,3,250,5],[263,3,263,5],[264,3,264,5],[265,3,265,5],[266,3,266,5],[267,3,267,5],[268,3,268,5],[257,3,257,5],[258,3,258,5],[259,3,259,5],[260,3,260,5],[261,3,261,5],[262,3,262,5],[275,3,275,5],[276,3,276,5],[277,3,277,5],[278,3,278,5],[279,3,279,5],[280,3,280,5],[269,3,269,5],[270,3,270,5],[271,3,271,5],[272,3,272,5],[273,3,273,5],[274,3,274,5],[287,3,287,5],[288,3,288,5],[289,3,289,5],[290,3,290,5],[291,3,291,5],[292,3,292,5],[281,3,281,5],[282,3,282,5],[283,3,283,5],[284,3,284,5],[285,3,285,5],[286,3,286,5],[299,3,299,5],[300,3,300,5],[301,3,301,5],[302,3,302,5],[303,3,303,5],[304,3,304,5],[293,3,293,5],[294,3,294,5],[295,3,295,5],[296,3,296,5],[297,3,297,5],[298,3,298,5],[311,3,311,5],[312,3,312,5],[313,3,313,5],[314,3,314,5],[315,3,315,5],[316,3,316,5],[305,3,305,5],[306,3,306,5],[307,3,307,5],[308,3,308,5],[309,3,309,5],[310,3,310,5],[323,3,323,5],[324,3,324,5],[325,3,325,5],[326,3,326,5],[327,3,327,5],[328,3,328,5],[317,3,317,5],[318,3,318,5],[319,3,319,5],[320,3,320,5],[321,3,321,5],[322,3,322,5],[335,3,335,5],[336,3,336,5],[337,3,337,5],[338,3,338,5],[339,3,339,5],[340,3,340,5],[329,3,329,5],[330,3,330,5],[331,3,331,5],[332,3,332,5],[333,3,333,5],[334,3,334,5],[347,3,347,5],[348,3,348,5],[349,3,349,5],[350,3,350,5],[351,3,351,5],[352,3,352,5],[341,3,341,5],[342,3,342,5],[343,3,343,5],[344,3,344,5],[345,3,345,5],[346,3,346,5],[359,3,359,5],[363,3,363,5],[364,3,364,5],[365,3,365,5],[366,3,366,5],[367,3,367,5],[353,3,353,5],[354,3,354,5],[355,3,355,5],[356,3,356,5],[357,3,357,5],[358,3,358,5],[374,3,374,5],[375,3,375,5],[376,3,376,5],[377,3,377,5],[378,3,378,5],[379,3,379,5],[368,3,368,5],[369,3,369,5],[370,3,370,5],[371,3,371,5],[372,3,372,5],[373,3,373,5],[386,3,386,5],[387,3,387,5],[388,3,388,5],[389,3,389,5],[390,3,390,5],[391,3,391,5],[380,3,380,5],[381,3,381,5],[382,3,382,5],[383,3,383,5],[384,3,384,5],[385,3,385,5],[411,3,411,5],[412,3,412,5],[413,3,413,5],[414,3,414,5],[415,3,415,5],[416,3,416,5],[392,3,392,5],[393,3,393,5],[394,3,394,5],[408,3,408,5],[409,3,409,5],[410,3,410,5],[438,3,438,5],[439,3,439,5],[440,3,440,5],[441,3,441,5],[442,3,442,5],[443,3,443,5],[417,3,417,5],[433,3,433,5],[434,3,434,5],[435,3,435,5],[436,3,436,5],[437,3,437,5],[463,3,463,5],[464,3,464,5],[465,3,465,5],[466,3,466,5],[467,3,467,5],[468,3,468,5],[453,3,453,5],[454,3,454,5],[455,3,455,5],[456,3,456,5],[457,3,457,5],[458,3,458,5],[484,3,484,5],[485,3,485,5],[486,3,486,5],[496,3,496,5],[509,3,509,5],[510,3,510,5],[478,3,478,5],[479,3,479,5],[480,3,480,5],[481,3,481,5],[482,3,482,5],[483,3,483,5],[525,3,525,5],[526,3,526,5],[531,3,531,5],[532,3,532,5],[537,3,537,5],[538,3,538,5],[511,3,511,5],[512,3,512,5],[513,3,513,5],[517,3,517,5],[518,3,518,5],[520,3,520,5],[591,3,591,5],[611,3,611,5],[660,3,660,5],[661,3,661,5],[681,3,681,5],[685,3,685,5],[539,3,539,5],[540,3,540,5],[541,3,541,5],[588,3,588,5],[589,3,589,5],[590,3,590,5],[708,3,708,5],[709,3,709,5],[710,3,710,5],[711,3,711,5],[712,3,712,5],[713,3,713,5],[689,3,689,5],[693,3,693,5],[697,3,697,5],[701,3,701,5],[706,3,706,5],[707,3,707,5],[720,3,720,5],[721,3,721,5],[722,3,722,5],[740,3,740,5],[741,3,741,5],[742,3,742,5],[714,3,714,5],[715,3,715,5],[716,3,716,5],[717,3,717,5],[718,3,718,5],[719,3,719,5],[749,3,749,5],[760,3,760,5],[761,3,761,5],[762,3,762,5],[763,3,763,5],[773,3,773,5],[743,3,743,5],[744,3,744,5],[745,3,745,5],[746,3,746,5],[747,3,747,5],[748,3,748,5],[780,3,780,5],[781,3,781,5],[782,3,782,5],[783,3,783,5],[784,3,784,5],[785,3,785,5],[774,3,774,5],[775,3,775,5],[776,3,776,5],[777,3,777,5],[778,3,778,5],[779,3,779,5],[818,3,818,5],[833,3,833,5],[834,3,834,5],[835,3,835,5],[836,3,836,5],[848,3,848,5],[786,3,786,5],[787,3,787,5],[788,3,788,5],[789,3,789,5],[790,3,790,5],[791,3,791,5],[855,3,855,5],[856,3,856,5],[857,3,857,5],[858,3,858,5],[871,3,871,5],[876,3,876,5],[849,3,849,5],[850,3,850,5],[851,3,851,5],[852,3,852,5],[853,3,853,5],[854,3,854,5],[1139,3,1139,5],[1140,3,1140,5],[1145,3,1145,5],[1146,3,1146,5],[1147,3,1147,5],[1148,3,1148,5],[877,3,877,5],[878,3,878,5],[879,3,879,5],[1136,3,1136,5],[1137,3,1137,5],[1138,3,1138,5],[1155,3,1155,5],[1156,3,1156,5],[1161,3,1161,5],[1162,3,1162,5],[1166,3,1166,5],[1167,3,1167,5],[1149,3,1149,5],[1150,3,1150,5],[1151,3,1151,5],[1152,3,1152,5],[1153,3,1153,5],[1154,3,1154,5]]}
[null,null,null,{"$f":"IF(D58=\"Fiscaal\",IF(_xlfn.SINGLE(PP_Language)=\"NL\",\"Fiscaal\",\"Fiscal\"),IF(_xlfn.SINGLE(PP_Language)=\"NL\",\"Commercieel\",\"Commercial\"))","v":"Commercial"}]
[null,"Conversion info"]
[null,null,null,null,null,null,null,null,null,null,null,null,null,null,null,null,null,null,null,null,null,null,null,null,null,"/General data label {2}","/General data value {4}"]
[null,null,null,"NL 2021 15.0"]
[null,null,null,"EN"]
[null,"entrypoint",null,"KvK: Jaarverantwoording 2020 NLGAAP - kleine rechtspersonen - publicatiestukken"]
[null,"identifier scheme",null,"http://www.kvk.nl/kvk-id"]
[null,"Vorigvorig jaar",null,{"$f":"DATE(YEAR(D54)-1,MONTH(D54),DAY(D54))","v":"3798-12-31"}]
[null,null,null,"INF"]
[null,null,null,"INF"]
[null,null,null,"INF"]
[null,null,null,"INF"]
[null,null,null,false]
[null,null,null,true]
[null,null,null,null,null,null,null,null,null,null,null,null,null,null,null,null,null,null,null,null,null,null,null,null,null,"//General data label {2}","//General data value {4}"]
[]
[]
[]
[null,{"$f":"INDEX(labels!$A$2:$C$2,1,MATCH(PP_Language,labels!$A$1:$C$1,0))","v":"Document and entity information"}]
[null,{"$f":"INDEX(labels!$A$3:$C$3,1,MATCH(PP_Language,labels!$A$1:$C$1,0))","v":"Entity information"}]
[null,{"$f":"INDEX(labels!$A$3:$C$3,1,MATCH(PP_Language,labels!$A$1:$C$1,0))","v":"Entity information"}]
[null,null,null,null,null,null,null,null,null,null,null,null,null,null,null,null,null,null,null,null,null,null,null,null,null,{"$f":"\"/entity-information label {\"&COLUMN($B$23)&\"}\"","v":"/entity-information label {2}"},null,{"$f":"\"/entity-information values {\"&COLUMN($D$23)&\"}\"","v":"/entity-information values {4}"}]
[null,{"$f":"INDEX(labels!$A$4:$C$4,1,MATCH(PP_Language,labels!$A$1:$C$1,0))","v":"Name of the legal entity"}]
[null,{"$f":"INDEX(labels!$A$5:$C$5,1,MATCH(PP_Language,labels!$A$1:$C$1,0))","v":"Legal form of the legal entity"}]
[null,{"$f":"INDEX(labels!$A$6:$C$6,1,MATCH(PP_Language,labels!$A$1:$C$1,0))","v":"Registered office of the legal entity"}]
[null,{"$f":"INDEX(labels!$A$7:$C$7,1,MATCH(PP_Language,labels!$A$1:$C$1,0))","v":"Registration number at the Chamber of Commerce"}]
[null,{"$f":"INDEX(labels!$A$8:$C$8,1,MATCH(PP_Language,labels!$A$1:$C$1,0))","v":"Business names"}]
[null,{"$f":"INDEX(labels!$A$9:$C$9,1,MATCH(PP_Language,labels!$A$1:$C$1,0))","v":"Classification of the legal entity based on the legal size criteria"}]
[null,{"$f":"INDEX(labels!$A$10:$C$10,1,MATCH(PP_Language,labels!$A$1:$C$1,0))","v":"SBI-code"}]
[null,null,null,null,null,null,null,null,null,null,null,null,null,null,null,null,null,null,null,null,null,null,null,null,null,{"$f":"\"//entity-information label {\"&COLUMN($B$30)&\"}\"","v":"//entity-information label {2}"},null,{"$f":"\"//entity-information values {\"&COLUMN($D$30)&\"}\"","v":"//entity-information values {4}"}]
[null,{"$f":"INDEX(labels!$A$11:$C$11,1,MATCH(PP_Language,labels!$A$1:$C$1,0))","v":"Address of the legal entity"}]
[null,null,null,null,null,null,null,null,null,null,null,null,null,null,null,null,null,null,null,null,null,null,null,null,null,{"$f":"\"/entity-address label {\"&COLUMN($B$33)&\"}\"","v":"/entity-address label {2}"},null,{"$f":"\"/entity-address values {\"&COLUMN($D$33)&\"}\"","v":"/entity-address values {4}"}]
[null,{"$f":"INDEX(labels!$A$12:$C$12,1,MATCH(PP_Language,labels!$A$1:$C$1,0))","v":"Description of location NL"}]
[null,{"$f":"INDEX(labels!$A$13:$C$13,1,MATCH(PP_Language,labels!$A$1:$C$1,0))","v":"Street name NL"}]
[null,{"$f":"INDEX(labels!$A$14:$C$14,1,MATCH(PP_Language,labels!$A$1:$C$1,0))","v":"House number NL"}]
[null,{"$f":"INDEX(labels!$A$15:$C$15,1,MATCH(PP_Language,labels!$A$1:$C$1,0))","v":"House number addition"}]
[null,{"$f":"INDEX(labels!$A$16:$C$16,1,MATCH(PP_Language,labels!$A$1:$C$1,0))","v":"PO box number"}]
[null,{"$f":"INDEX(labels!$A$17:$C$17,1,MATCH(PP_Language,labels!$A$1:$C$1,0))","v":"Postal code NL"}]
[null,{"$f":"INDEX(labels!$A$18:$C$18,1,MATCH(PP_Language,labels!$A$1:$C$1,0))","v":"Place of residence NL"}]
[null,{"$f":"INDEX(labels!$A$19:$C$19,1,MATCH(PP_Language,labels!$A$1:$C$1,0))","v":"Description of location abroad"}]
[null,{"$f":"INDEX(labels!$A$20:$C$20,1,MATCH(PP_Language,labels!$A$1:$C$1,0))","v":"Street name abroad"}]
[null,{"$f":"INDEX(labels!$A$21:$C$21,1,MATCH(PP_Language,labels!$A$1:$C$1,0))","v":"House number abroad"}]
[null,{"$f":"INDEX(labels!$A$22:$C$22,1,MATCH(PP_Language,labels!$A$1:$C$1,0))","v":"Postal code abroad"}]
[null,{"$f":"INDEX(labels!$A$23:$C$23,1,MATCH(PP_Language,labels!$A$1:$C$1,0))","v":"Place of residence abroad"}]
[null,{"$f":"INDEX(labels!$A$24:$C$24,1,MATCH(PP_Language,labels!$A$1:$C$1,0))","v":"Name region"}]
[null,{"$f":"INDEX(labels!$A$25:$C$25,1,MATCH(PP_Language,labels!$A$1:$C$1,0))","v":"Country name, ISO"}]
[null,null,null,null,null,null,null,null,null,null,null,null,null,null,null,null,null,null,null,null,null,null,null,null,null,{"$f":"\"//entity-address label {\"&COLUMN($B$47)&\"}\"","v":"//entity-address label {2}"},null,{"$f":"\"//entity-address values {\"&COLUMN($D$47)&\"}\"","v":"//entity-address values {4}"}]
[null,{"$f":"INDEX(labels!$A$26:$C$26,1,MATCH(PP_Language,labels!$A$1:$C$1,0))","v":"Document information"}]
[null,null,null,null,null,null,null,null,null,null,null,null,null,null,null,null,null,null,null,null,null,null,null,null,null,{"$f":"\"/document-information label {\"&COLUMN($B$50)&\"}\"","v":"/document-information label {2}"},null,{"$f":"\"/document-information values {\"&COLUMN($D$50)&\"}\"","v":"/document-information values {4}"}]
[null,{"$f":"INDEX(labels!$A$27:$C$27,1,MATCH(PP_Language,labels!$A$1:$C$1,0))","v":"Title of the document"}]
[null,{"$f":"INDEX(labels!$A$28:$C$28,1,MATCH(PP_Language,labels!$A$1:$C$1,0))","v":"Start date of the period concerning the financial statement"}]
[null,{"$f":"INDEX(labels!$A$29:$C$29,1,MATCH(PP_Language,labels!$A$1:$C$1,0))","v":"End date of the period concerning the financial statement"}]
[null,{"$f":"INDEX(labels!$A$30:$C$30,1,MATCH(PP_Language,labels!$A$1:$C$1,0))","v":"Start date of the previous period concerning the financial statement"}]
[null,{"$f":"INDEX(labels!$A$31:$C$31,1,MATCH(PP_Language,labels!$A$1:$C$1,0))","v":"End date of the previous period concerning the financial statement"}]
[null,{"$f":"INDEX(labels!$A$32:$C$32,1,MATCH(PP_Language,labels!$A$1:$C$1,0))","v":"Reporting period different than annual (Y/N)"}]
[null,{"$f":"INDEX(labels!$A$33:$C$33,1,MATCH(PP_Language,labels!$A$1:$C$1,0))","v":"Description of the reason for deviating from an annual reporting period"}]
[null,{"$f":"INDEX(labels!$A$34:$C$34,1,MATCH(PP_Language,labels!$A$1:$C$1,0))","v":"Description of the impact on comparative figures when deviating from an annual reporting period"}]
[null,{"$f":"INDEX(labels!$A$35:$C$35,1,MATCH(PP_Language,labels!$A$1:$C$1,0))","v":"Basis of preparation"}]
[null,{"$f":"INDEX(labels!$A$36:$C$36,1,MATCH(PP_Language,labels!$A$1:$C$1,0))","v":"Presentation currency of the document"}]
[null,{"$f":"INDEX(labels!$A$37:$C$37,1,MATCH(PP_Language,labels!$A$1:$C$1,0))","v":"Units in which the figures in the financial statements are expressed"}]
[null,{"$f":"INDEX(labels!$A$38:$C$38,1,MATCH(PP_Language,labels!$A$1:$C$1,0))","v":"Date of preparation of the financial statements"}]
[null,{"$f":"INDEX(labels!$A$39:$C$39,1,MATCH(PP_Language,labels!$A$1:$C$1,0))","v":"Financial statements adopted (Y/N)"}]
[null,{"$f":"INDEX(labels!$A$40:$C$40,1,MATCH(PP_Language,labels!$A$1:$C$1,0))","v":"Date of adoption of the financial statements"}]
[null,{"$f":"INDEX(labels!$A$41:$C$41,1,MATCH(PP_Language,labels!$A$1:$C$1,0))","v":"Resubmission of document due to substantive and insurmountable inaccuracies (Y/N)"}]
[null,{"$f":"INDEX(labels!$A$42:$C$42,1,MATCH(PP_Language,labels!$A$1:$C$1,0))","v":"Explanation of resubmission of the document due to substantive and insurmountable inaccuracies"}]
[null,{"$f":"INDEX(labels!$A$43:$C$43,1,MATCH(PP_Language,labels!$A$1:$C$1,0))","v":"Resubmission of the document due to technical and/or process-related inaccuracies (Y/N)"}]
[null,{"$f":"INDEX(labels!$A$44:$C$44,1,MATCH(PP_Language,labels!$A$1:$C$1,0))","v":"Explanation of resubmission of document due to technical and/or process-related inaccuracies"}]
[null,{"$f":"INDEX(labels!$A$45:$C$45,1,MATCH(PP_Language,labels!$A$1:$C$1,0))","v":"Email address"}]
[null,null,null,null,null,null,null,null,null,null,null,null,null,null,null,null,null,null,null,null,null,null,null,null,null,{"$f":"\"//document-information label {\"&COLUMN($B$69)&\"}\"","v":"//document-information label {2}"},null,{"$f":"\"//document-information values {\"&COLUMN($D$69)&\"}\"","v":"//document-information values {4}"}]
[null,{"$f":"INDEX(labels!$A$48:$C$48,1,MATCH(PP_Language,labels!$A$1:$C$1,0))","v":"Financial statements"}]
[null,{"$f":"INDEX(labels!$A$101:$C$101,1,MATCH(PP_Language,labels!$A$1:$C$1,0))","v":"Company financial statements"}]
[null,{"$f":"INDEX(labels!$A$56:$C$56,1,MATCH(PP_Language,labels!$A$1:$C$1,0))","v":"Balance sheet"}]
[null,{"$f":"INDEX(labels!$A$56:$C$56,1,MATCH(PP_Language,labels!$A$1:$C$1,0))","v":"Balance sheet"}]
[]
[null,null,null,{"$f":"INDEX(labels!$A$102:$C$102,1,MATCH(PP_Language,labels!$A$1:$C$1,0))","v":"Current"},null,{"$f":"INDEX(labels!$A$104:$C$104,1,MATCH(PP_Language,labels!$A$1:$C$1,0))","v":"Previous"},null,null,null,null,null,null,null,null,null,null,null,null,null,null,null,null,null,null,null,{"$f":"\"/balance-sheet label {\"&COLUMN($B$75)&\"}\"","v":"/balance-sheet label {2}"},null,{"$f":"\"/balance-sheet \" & BasisOfPreparationAxis & \" \"  & INDEX(labels!$A$103:$C$103,1,MATCH(PP_Language,labels!$A$1:$C$1,0)) &  \" \"  & INDEX(labels!$A$102:$C$102,1,MATCH(PP_Language,labels!$A$1:$C$1,0)) &  \" {\"&COLUMN($D$75)&\"}\"","v":"/balance-sheet Commercial Separate Current {4}"},null,{"$f":"\"/balance-sheet \" & BasisOfPreparationAxis & \" \"  & INDEX(labels!$A$103:$C$103,1,MATCH(PP_Language,labels!$A$1:$C$1,0)) &  \" \"  & INDEX(labels!$A$104:$C$104,1,MATCH(PP_Language,labels!$A$1:$C$1,0)) &  \" {\"&COLUMN($F$75)&\"}\"","v":"/balance-sheet Commercial Separate Previous {6}"}]
[null,{"$f":"INDEX(labels!$A$105:$C$105,1,MATCH(PP_Language,labels!$A$1:$C$1,0))","v":"Balance sheet before or after appropriation of results"}]
[]
[null,{"$f":"INDEX(labels!$A$57:$C$57,1,MATCH(PP_Language,labels!$A$1:$C$1,0))","v":"Intangible assets"}]
[null,{"$f":"INDEX(labels!$A$58:$C$58,1,MATCH(PP_Language,labels!$A$1:$C$1,0))","v":"Property, plant and equipment"}]
[null,{"$f":"INDEX(labels!$A$59:$C$59,1,MATCH(PP_Language,labels!$A$1:$C$1,0))","v":"Investment properties"}]
[null,{"$f":"INDEX(labels!$A$60:$C$60,1,MATCH(PP_Language,labels!$A$1:$C$1,0))","v":"Financial assets"}]
[null,{"$f":"INDEX(labels!$A$106:$C$106,1,MATCH(PP_Language,labels!$A$1:$C$1,0))","v":"Total of non-current assets"},null,{"$f":"IF(OR(NOT(0=0),NOT(AND(Stamdata!$D$78=\"\",Stamdata!$D$79=\"\",Stamdata!$D$80=\"\",Stamdata!$D$81=\"\"))), - 0+ SUM(Stamdata!$D$78,Stamdata!$D$79,Stamdata!$D$80,Stamdata!$D$81),\"\")","v":""},null,{"$f":"IF(OR(NOT(0=0),NOT(AND(Stamdata!$F$78=\"\",Stamdata!$F$79=\"\",Stamdata!$F$80=\"\",Stamdata!$F$81=\"\"))), - 0+ SUM(Stamdata!$F$78,Stamdata!$F$79,Stamdata!$F$80,Stamdata!$F$81),\"\")","v":""}]
[]
[null,{"$f":"INDEX(labels!$A$61:$C$61,1,MATCH(PP_Language,labels!$A$1:$C$1,0))","v":"Inventories"}]
[null,{"$f":"INDEX(labels!$A$107:$C$107,1,MATCH(PP_Language,labels!$A$1:$C$1,0))","v":"Construction contracts (assets)"}]
[null,{"$f":"INDEX(labels!$A$63:$C$63,1,MATCH(PP_Language,labels!$A$1:$C$1,0))","v":"Receivables"}]
[null,{"$f":"INDEX(labels!$A$64:$C$64,1,MATCH(PP_Language,labels!$A$1:$C$1,0))","v":"Securities"}]
[null,{"$f":"INDEX(labels!$A$65:$C$65,1,MATCH(PP_Language,labels!$A$1:$C$1,0))","v":"Cash and cash equivalents"}]
[null,{"$f":"INDEX(labels!$A$108:$C$108,1,MATCH(PP_Language,labels!$A$1:$C$1,0))","v":"Total of current assets"},null,{"$f":"IF(OR(NOT(0=0),NOT(AND(Stamdata!$D$84=\"\",Stamdata!$D$85=\"\",Stamdata!$D$86=\"\",Stamdata!$D$87=\"\",Stamdata!$D$88=\"\"))), - 0+ SUM(Stamdata!$D$84,Stamdata!$D$85,Stamdata!$D$86,Stamdata!$D$87,Stamdata!$D$88),\"\")","v":""},null,{"$f":"IF(OR(NOT(0=0),NOT(AND(Stamdata!$F$84=\"\",Stamdata!$F$85=\"\",Stamdata!$F$86=\"\",Stamdata!$F$87=\"\",Stamdata!$F$88=\"\"))), - 0+ SUM(Stamdata!$F$84,Stamdata!$F$85,Stamdata!$F$86,Stamdata!$F$87,Stamdata!$F$88),\"\")","v":""}]
[]
[null,{"$f":"INDEX(labels!$A$109:$C$109,1,MATCH(PP_Language,labels!$A$1:$C$1,0))","v":"Total of assets"},null,{"$f":"IF(OR(NOT(0=0),NOT(AND(Stamdata!$D$82=\"\",Stamdata!$D$89=\"\"))), - 0+ SUM(Stamdata!$D$82,Stamdata!$D$89),\"\")","v":""},null,{"$f":"IF(OR(NOT(0=0),NOT(AND(Stamdata!$F$82=\"\",Stamdata!$F$89=\"\"))), - 0+ SUM(Stamdata!$F$82,Stamdata!$F$89),\"\")","v":""}]
[]
[null,{"$f":"INDEX(labels!$A$110:$C$110,1,MATCH(PP_Language,labels!$A$1:$C$1,0))","v":"Share capital paid called up"}]
[null,{"$f":"INDEX(labels!$A$111:$C$111,1,MATCH(PP_Language,labels!$A$1:$C$1,0))","v":"Share premium"}]
[null,{"$f":"INDEX(labels!$A$112:$C$112,1,MATCH(PP_Language,labels!$A$1:$C$1,0))","v":"Revaluation reserves"}]
[null,{"$f":"INDEX(labels!$A$113:$C$113,1,MATCH(PP_Language,labels!$A$1:$C$1,0))","v":"Other legal reserves"}]
[null,{"$f":"INDEX(labels!$A$114:$C$114,1,MATCH(PP_Language,labels!$A$1:$C$1,0))","v":"Statutory reserves"}]
[null,{"$f":"INDEX(labels!$A$115:$C$115,1,MATCH(PP_Language,labels!$A$1:$C$1,0))","v":"Fiscal reinvestment reserve"}]
[null,{"$f":"INDEX(labels!$A$116:$C$116,1,MATCH(PP_Language,labels!$A$1:$C$1,0))","v":"Other reserves"}]
[null,{"$f":"INDEX(labels!$A$117:$C$117,1,MATCH(PP_Language,labels!$A$1:$C$1,0))","v":"Other fiscal reserves"}]
[null,{"$f":"INDEX(labels!$A$118:$C$118,1,MATCH(PP_Language,labels!$A$1:$C$1,0))","v":"Result after taxes for the year"}]
[null,{"$f":"INDEX(labels!$A$119:$C$119,1,MATCH(PP_Language,labels!$A$1:$C$1,0))","v":"Undistributed profit"}]
[null,{"$f":"INDEX(labels!$A$120:$C$120,1,MATCH(PP_Language,labels!$A$1:$C$1,0))","v":"Total of equity"},null,{"$f":"IF(OR(NOT(AND(Stamdata!$D$93=\"\",Stamdata!$D$94=\"\",Stamdata!$D$95=\"\",Stamdata!$D$96=\"\",Stamdata!$D$97=\"\",Stamdata!$D$98=\"\",Stamdata!$D$99=\"\",Stamdata!$D$100=\"\",Stamdata!$D$101=\"\",Stamdata!$D$102=\"\")),NOT(0=0)), SUM(Stamdata!$D$93,Stamdata!$D$94,Stamdata!$D$95,Stamdata!$D$96,Stamdata!$D$97,Stamdata!$D$98,Stamdata!$D$99,Stamdata!$D$100,Stamdata!$D$101,Stamdata!$D$102)- 0,\"\")","v":""},null,{"$f":"IF(OR(NOT(AND(Stamdata!$F$93=\"\",Stamdata!$F$94=\"\",Stamdata!$F$95=\"\",Stamdata!$F$96=\"\",Stamdata!$F$97=\"\",Stamdata!$F$98=\"\",Stamdata!$F$99=\"\",Stamdata!$F$100=\"\",Stamdata!$F$101=\"\",Stamdata!$F$102=\"\")),NOT(0=0)), SUM(Stamdata!$F$93,Stamdata!$F$94,Stamdata!$F$95,Stamdata!$F$96,Stamdata!$F$97,Stamdata!$F$98,Stamdata!$F$99,Stamdata!$F$100,Stamdata!$F$101,Stamdata!$F$102)- 0,\"\")","v":""}]
[]
[null,{"$f":"INDEX(labels!$A$67:$C$67,1,MATCH(PP_Language,labels!$A$1:$C$1,0))","v":"Provisions"}]
[null,{"$f":"INDEX(labels!$A$68:$C$68,1,MATCH(PP_Language,labels!$A$1:$C$1,0))","v":"Non-current liabilities"}]
[null,{"$f":"INDEX(labels!$A$69:$C$69,1,MATCH(PP_Language,labels!$A$1:$C$1,0))","v":"Current liabilities"}]
[null,{"$f":"INDEX(labels!$A$121:$C$121,1,MATCH(PP_Language,labels!$A$1:$C$1,0))","v":"Total of equity and liabilities"},null,{"$f":"IF(OR(NOT(AND(Stamdata!$D$103=\"\",Stamdata!$D$105=\"\",Stamdata!$D$106=\"\",Stamdata!$D$107=\"\")),NOT(0=0)), SUM(Stamdata!$D$103,Stamdata!$D$105,Stamdata!$D$106,Stamdata!$D$107)- 0,\"\")","v":""},null,{"$f":"IF(OR(NOT(AND(Stamdata!$F$103=\"\",Stamdata!$F$105=\"\",Stamdata!$F$106=\"\",Stamdata!$F$107=\"\")),NOT(0=0)), SUM(Stamdata!$F$103,Stamdata!$F$105,Stamdata!$F$106,Stamdata!$F$107)- 0,\"\")","v":""}]
[null,null,null,null,null,null,null,null,null,null,null,null,null,null,null,null,null,null,null,null,null,null,null,null,null,{"$f":"\"//balance-sheet label {\"&COLUMN($B$109)&\"}\"","v":"//balance-sheet label {2}"},null,{"$f":"\"//balance-sheet \" & BasisOfPreparationAxis & \" \"  & INDEX(labels!$A$103:$C$103,1,MATCH(PP_Language,labels!$A$1:$C$1,0)) &  \" \"  & INDEX(labels!$A$102:$C$102,1,MATCH(PP_Language,labels!$A$1:$C$1,0)) &  \" {\"&COLUMN($D$109)&\"}\"","v":"//balance-sheet Commercial Separate Current {4}"},null,{"$f":"\"//balance-sheet \" & BasisOfPreparationAxis & \" \"  & INDEX(labels!$A$103:$C$103,1,MATCH(PP_Language,labels!$A$1:$C$1,0)) &  \" \"  & INDEX(labels!$A$104:$C$104,1,MATCH(PP_Language,labels!$A$1:$C$1,0)) &  \" {\"&COLUMN($F$109)&\"}\"","v":"//balance-sheet Commercial Separate Previous {6}"}]
[null,{"$f":"INDEX(labels!$A$122:$C$122,1,MATCH(PP_Language,labels!$A$1:$C$1,0))","v":"Notes to the financial statements"}]
[null,{"$f":"INDEX(labels!$A$53:$C$53,1,MATCH(PP_Language,labels!$A$1:$C$1,0))","v":"General notes"}]
[null,{"$f":"INDEX(labels!$A$123:$C$123,1,MATCH(PP_Language,labels!$A$1:$C$1,0))","v":"Notes to the financial statements - General notes"}]
[null,null,null,null,null,null,null,null,null,null,null,null,null,null,null,null,null,null,null,null,null,null,null,null,null,{"$f":"\"/notes-general-notes label {\"&COLUMN($B$113)&\"}\"","v":"/notes-general-notes label {2}"},null,{"$f":"\"/notes-general-notes \" & BasisOfPreparationAxis & \" \"  & INDEX(labels!$A$103:$C$103,1,MATCH(PP_Language,labels!$A$1:$C$1,0)) &  \" \"  &  \" {\"&COLUMN($D$113)&\"}\"","v":"/notes-general-notes Commercial Separate  {4}"}]
[null,{"$f":"INDEX(labels!$A$124:$C$124,1,MATCH(PP_Language,labels!$A$1:$C$1,0))","v":"Description of the most important activities of the entity"}]
[null,{"$f":"INDEX(labels!$A$125:$C$125,1,MATCH(PP_Language,labels!$A$1:$C$1,0))","v":"Description of the location of the actual activities"}]
[null,null,null,null,null,null,null,null,null,null,null,null,null,null,null,null,null,null,null,null,null,null,null,null,null,{"$f":"\"//notes-general-notes label {\"&COLUMN($B$116)&\"}\"","v":"//notes-general-notes label {2}"},null,{"$f":"\"//notes-general-notes \" & BasisOfPreparationAxis & \" \"  & INDEX(labels!$A$103:$C$103,1,MATCH(PP_Language,labels!$A$1:$C$1,0)) &  \" \"  &  \" {\"&COLUMN($D$116)&\"}\"","v":"//notes-general-notes Commercial Separate  {4}"}]
[null,{"$f":"INDEX(labels!$A$126:$C$126,1,MATCH(PP_Language,labels!$A$1:$C$1,0))","v":"Notes to the financial statements - General notes: Going concern"}]
[null,null,null,null,null,null,null,null,null,null,null,null,null,null,null,null,null,null,null,null,null,null,null,null,null,{"$f":"\"/notes-general-notes-going-concern label {\"&COLUMN($B$118)&\"}\"","v":"/notes-general-notes-going-concern label {2}"},null,{"$f":"\"/notes-general-notes-going-concern \" & BasisOfPreparationAxis & \" \"  & INDEX(labels!$A$103:$C$103,1,MATCH(PP_Language,labels!$A$1:$C$1,0)) &  \" \"  &  \" {\"&COLUMN($D$118)&\"}\"","v":"/notes-general-notes-going-concern Commercial Separate  {4}"}]
[null,{"$f":"INDEX(labels!$A$127:$C$127,1,MATCH(PP_Language,labels!$A$1:$C$1,0))","v":"Disclosure of going concern"}]
[null,{"$f":"INDEX(labels!$A$128:$C$128,1,MATCH(PP_Language,labels!$A$1:$C$1,0))","v":"Description of the uncertainties relating to the ability of the entity to continue as going concern"}]
[null,{"$f":"INDEX(labels!$A$129:$C$129,1,MATCH(PP_Language,labels!$A$1:$C$1,0))","v":"Description of the basis of preparation of the financial statements when not going concern basis"}]
[null,{"$f":"INDEX(labels!$A$130:$C$130,1,MATCH(PP_Language,labels!$A$1:$C$1,0))","v":"Description of the effect of not applying going concern basis on equity and results"}]
[null,null,null,null,null,null,null,null,null,null,null,null,null,null,null,null,null,null,null,null,null,null,null,null,null,{"$f":"\"//notes-general-notes-going-concern label {\"&COLUMN($B$123)&\"}\"","v":"//notes-general-notes-going-concern label {2}"},null,{"$f":"\"//notes-general-notes-going-concern \" & BasisOfPreparationAxis & \" \"  & INDEX(labels!$A$103:$C$103,1,MATCH(PP_Language,labels!$A$1:$C$1,0)) &  \" \"  &  \" {\"&COLUMN($D$123)&\"}\"","v":"//notes-general-notes-going-concern Commercial Separate  {4}"}]
[null,{"$f":"INDEX(labels!$A$131:$C$131,1,MATCH(PP_Language,labels!$A$1:$C$1,0))","v":"Notes to the financial statements - General notes: Group structure"}]
[null,null,null,null,null,null,null,null,null,null,null,null,null,null,null,null,null,null,null,null,null,null,null,null,null,{"$f":"\"/notes-general-notes-group-structure label {\"&COLUMN($B$125)&\"}\"","v":"/notes-general-notes-group-structure label {2}"},null,{"$f":"\"/notes-general-notes-group-structure \" & BasisOfPreparationAxis & \" \"  & INDEX(labels!$A$103:$C$103,1,MATCH(PP_Language,labels!$A$1:$C$1,0)) &  \" \"  &  \" {\"&COLUMN($D$125)&\"}\"","v":"/notes-general-notes-group-structure Commercial Separate  {4}"}]
[null,{"$f":"INDEX(labels!$A$132:$C$132,1,MATCH(PP_Language,labels!$A$1:$C$1,0))","v":"Disclosure of group structure"}]
[null,{"$f":"INDEX(labels!$A$133:$C$133,1,MATCH(PP_Language,labels!$A$1:$C$1,0))","v":"Name of the entity which prepares the consolidated financial statements of the group to which the legal entity belongs"}]
[null,{"$f":"INDEX(labels!$A$134:$C$134,1,MATCH(PP_Language,labels!$A$1:$C$1,0))","v":"Location of the entity which prepares the consolidated financial statements of the group to which the legal entity belongs"}]
[null,null,null,null,null,null,null,null,null,null,null,null,null,null,null,null,null,null,null,null,null,null,null,null,null,{"$f":"\"//notes-general-notes-group-structure label {\"&COLUMN($B$129)&\"}\"","v":"//notes-general-notes-group-structure label {2}"},null,{"$f":"\"//notes-general-notes-group-structure \" & BasisOfPreparationAxis & \" \"  & INDEX(labels!$A$103:$C$103,1,MATCH(PP_Language,labels!$A$1:$C$1,0)) &  \" \"  &  \" {\"&COLUMN($D$129)&\"}\"","v":"//notes-general-notes-group-structure Commercial Separate  {4}"}]
[null,{"$f":"INDEX(labels!$A$135:$C$135,1,MATCH(PP_Language,labels!$A$1:$C$1,0))","v":"Notes to the financial statements - General notes: Estimates"}]
[null,null,null,null,null,null,null,null,null,null,null,null,null,null,null,null,null,null,null,null,null,null,null,null,null,{"$f":"\"/notes-general-notes-estimates label {\"&COLUMN($B$131)&\"}\"","v":"/notes-general-notes-estimates label {2}"},null,{"$f":"\"/notes-general-notes-estimates \" & BasisOfPreparationAxis & \" \"  & INDEX(labels!$A$103:$C$103,1,MATCH(PP_Language,labels!$A$1:$C$1,0)) &  \" \"  &  \" {\"&COLUMN($D$131)&\"}\"","v":"/notes-general-notes-estimates Commercial Separate  {4}"}]
[null,{"$f":"INDEX(labels!$A$136:$C$136,1,MATCH(PP_Language,labels!$A$1:$C$1,0))","v":"Disclosure of estimates"}]
[null,null,null,null,null,null,null,null,null,null,null,null,null,null,null,null,null,null,null,null,null,null,null,null,null,{"$f":"\"//notes-general-notes-estimates label {\"&COLUMN($B$133)&\"}\"","v":"//notes-general-notes-estimates label {2}"},null,{"$f":"\"//notes-general-notes-estimates \" & BasisOfPreparationAxis & \" \"  & INDEX(labels!$A$103:$C$103,1,MATCH(PP_Language,labels!$A$1:$C$1,0)) &  \" \"  &  \" {\"&COLUMN($D$133)&\"}\"","v":"//notes-general-notes-estimates Commercial Separate  {4}"}]
[null,{"$f":"INDEX(labels!$A$137:$C$137,1,MATCH(PP_Language,labels!$A$1:$C$1,0))","v":"Notes to the financial statements - General notes: Consolidation"}]
[null,null,null,null,null,null,null,null,null,null,null,null,null,null,null,null,null,null,null,null,null,null,null,null,null,{"$f":"\"/notes-general-notes-consolidation label {\"&COLUMN($B$135)&\"}\"","v":"/notes-general-notes-consolidation label {2}"},null,{"$f":"\"/notes-general-notes-consolidation \" & BasisOfPreparationAxis & \" \"  & INDEX(labels!$A$103:$C$103,1,MATCH(PP_Language,labels!$A$1:$C$1,0)) &  \" \"  &  \" {\"&COLUMN($D$135)&\"}\"","v":"/notes-general-notes-consolidation Commercial Separate  {4}"}]
[null,{"$f":"INDEX(labels!$A$138:$C$138,1,MATCH(PP_Language,labels!$A$1:$C$1,0))","v":"Disclosure of consolidation"}]
[null,{"$f":"INDEX(labels!$A$139:$C$139,1,MATCH(PP_Language,labels!$A$1:$C$1,0))","v":"Description of the exemption of consolidation in connection with the application of Section 2:408"}]
[null,{"$f":"INDEX(labels!$A$140:$C$140,1,MATCH(PP_Language,labels!$A$1:$C$1,0))","v":"Description of the reason for not consolidating a subsidiary"}]
[null,{"$f":"INDEX(labels!$A$141:$C$141,1,MATCH(PP_Language,labels!$A$1:$C$1,0))","v":"Description of application and reason for application consolidation exemption for venture capital investment company"}]
[null,{"$f":"INDEX(labels!$A$142:$C$142,1,MATCH(PP_Language,labels!$A$1:$C$1,0))","v":"Notification of legal entity for which legal entity issued a liability claim in accordance with article 403"}]
[null,null,null,null,null,null,null,null,null,null,null,null,null,null,null,null,null,null,null,null,null,null,null,null,null,{"$f":"\"//notes-general-notes-consolidation label {\"&COLUMN($B$141)&\"}\"","v":"//notes-general-notes-consolidation label {2}"},null,{"$f":"\"//notes-general-notes-consolidation \" & BasisOfPreparationAxis & \" \"  & INDEX(labels!$A$103:$C$103,1,MATCH(PP_Language,labels!$A$1:$C$1,0)) &  \" \"  &  \" {\"&COLUMN($D$141)&\"}\"","v":"//notes-general-notes-consolidation Commercial Separate  {4}"}]
[null,{"$f":"INDEX(labels!$A$143:$C$143,1,MATCH(PP_Language,labels!$A$1:$C$1,0))","v":"Notes to the financial statements - General notes: Mergers and acquisitions"}]
[null,null,null,null,null,null,null,null,null,null,null,null,null,null,null,null,null,null,null,null,null,null,null,null,null,{"$f":"\"/notes-general-notes-mergers-acquisitions label {\"&COLUMN($B$143)&\"}\"","v":"/notes-general-notes-mergers-acquisitions label {2}"},null,{"$f":"\"/notes-general-notes-mergers-acquisitions \" & BasisOfPreparationAxis & \" \"  & INDEX(labels!$A$103:$C$103,1,MATCH(PP_Language,labels!$A$1:$C$1,0)) &  \" \"  &  \" {\"&COLUMN($D$143)&\"}\"","v":"/notes-general-notes-mergers-acquisitions Commercial Separate  {4}"}]
[null,{"$f":"INDEX(labels!$A$144:$C$144,1,MATCH(PP_Language,labels!$A$1:$C$1,0))","v":"Disclosure of mergers and acquisitions"}]
[null,null,null,null,null,null,null,null,null,null,null,null,null,null,null,null,null,null,null,null,null,null,null,null,null,{"$f":"\"//notes-general-notes-mergers-acquisitions label {\"&COLUMN($B$145)&\"}\"","v":"//notes-general-notes-mergers-acquisitions label {2}"},null,{"$f":"\"//notes-general-notes-mergers-acquisitions \" & BasisOfPreparationAxis & \" \"  & INDEX(labels!$A$103:$C$103,1,MATCH(PP_Language,labels!$A$1:$C$1,0)) &  \" \"  &  \" {\"&COLUMN($D$145)&\"}\"","v":"//notes-general-notes-mergers-acquisitions Commercial Separate  {4}"}]
[null,{"$f":"INDEX(labels!$A$145:$C$145,1,MATCH(PP_Language,labels!$A$1:$C$1,0))","v":"Notes to the financial statements - General notes: Business activities that are not continued sustainably"}]
[null,null,null,null,null,null,null,null,null,null,null,null,null,null,null,null,null,null,null,null,null,null,null,null,null,{"$f":"\"/notes-general-notes-discontinued-operations label {\"&COLUMN($B$147)&\"}\"","v":"/notes-general-notes-discontinued-operations label {2}"},null,{"$f":"\"/notes-general-notes-discontinued-operations \" & BasisOfPreparationAxis & \" \"  & INDEX(labels!$A$103:$C$103,1,MATCH(PP_Language,labels!$A$1:$C$1,0)) &  \" \"  &  \" {\"&COLUMN($D$147)&\"}\"","v":"/notes-general-notes-discontinued-operations Commercial Separate  {4}"}]
[null,{"$f":"INDEX(labels!$A$146:$C$146,1,MATCH(PP_Language,labels!$A$1:$C$1,0))","v":"Disclosure of discontinued business activities that are not continued sustainably"}]
[null,{"$f":"INDEX(labels!$A$147:$C$147,1,MATCH(PP_Language,labels!$A$1:$C$1,0))","v":"Description of the result before taxes that is achieved with the sale of assets of a business activity that is not continued on a sustainable basis"}]
[null,{"$f":"INDEX(labels!$A$148:$C$148,1,MATCH(PP_Language,labels!$A$1:$C$1,0))","v":"Description of the nature of the initial event of business activities that are not continued sustainablys"}]
[null,{"$f":"INDEX(labels!$A$149:$C$149,1,MATCH(PP_Language,labels!$A$1:$C$1,0))","v":"Description of the time of the initial event of business activities that are not continued sustainably"}]
[null,{"$f":"INDEX(labels!$A$150:$C$150,1,MATCH(PP_Language,labels!$A$1:$C$1,0))","v":"Description of the time or time period when the discontinuation of operations will be finalised"}]
[null,{"$f":"INDEX(labels!$A$151:$C$151,1,MATCH(PP_Language,labels!$A$1:$C$1,0))","v":"Expected time of receipt of net proceeds from the sale of assets for which the legal person has entered into a binding agreement for a business activities that are not continued sustainably"}]
[null,{"$f":"INDEX(labels!$A$152:$C$152,1,MATCH(PP_Language,labels!$A$1:$C$1,0))","v":"Expected time of receipt of net proceeds from the sale of debt capital for which the legal person has entered into a binding agreement for a business activities that are not continued sustainably"}]
[null,{"$f":"INDEX(labels!$A$153:$C$153,1,MATCH(PP_Language,labels!$A$1:$C$1,0))","v":"Description of the result before taxes that is achieved with the settlement of items of the loan capital of a business activity that is not continued sustainably"}]
[null,null,null,null,null,null,null,null,null,null,null,null,null,null,null,null,null,null,null,null,null,null,null,null,null,{"$f":"\"//notes-general-notes-discontinued-operations label {\"&COLUMN($B$156)&\"}\"","v":"//notes-general-notes-discontinued-operations label {2}"},null,{"$f":"\"//notes-general-notes-discontinued-operations \" & BasisOfPreparationAxis & \" \"  & INDEX(labels!$A$103:$C$103,1,MATCH(PP_Language,labels!$A$1:$C$1,0)) &  \" \"  &  \" {\"&COLUMN($D$156)&\"}\"","v":"//notes-general-notes-discontinued-operations Commercial Separate  {4}"}]
[null,{"$f":"INDEX(labels!$A$54:$C$54,1,MATCH(PP_Language,labels!$A$1:$C$1,0))","v":"General accounting principles"}]
[null,{"$f":"INDEX(labels!$A$154:$C$154,1,MATCH(PP_Language,labels!$A$1:$C$1,0))","v":"Notes to the financial statements - General accounting principles"}]
[null,null,null,null,null,null,null,null,null,null,null,null,null,null,null,null,null,null,null,null,null,null,null,null,null,{"$f":"\"/notes-general-accounting-principles label {\"&COLUMN($B$159)&\"}\"","v":"/notes-general-accounting-principles label {2}"},null,{"$f":"\"/notes-general-accounting-principles \" & BasisOfPreparationAxis & \" \"  & INDEX(labels!$A$103:$C$103,1,MATCH(PP_Language,labels!$A$1:$C$1,0)) &  \" \"  &  \" {\"&COLUMN($D$159)&\"}\"","v":"/notes-general-accounting-principles Commercial Separate  {4}"}]
[null,{"$f":"INDEX(labels!$A$155:$C$155,1,MATCH(PP_Language,labels!$A$1:$C$1,0))","v":"Description of the accounting standards used to prepare the financial statements"}]
[null,{"$f":"INDEX(labels!$A$156:$C$156,1,MATCH(PP_Language,labels!$A$1:$C$1,0))","v":"Description of the standards applied earlier than the latest entry dates according to the new Guidelines"}]
[null,{"$f":"INDEX(labels!$A$157:$C$157,1,MATCH(PP_Language,labels!$A$1:$C$1,0))","v":"Explanation of comparability with the previous year"}]
[null,{"$f":"INDEX(labels!$A$158:$C$158,1,MATCH(PP_Language,labels!$A$1:$C$1,0))","v":"Disclosure of fair value information when the report is prepared on historical cost basis"}]
[null,{"$f":"INDEX(labels!$A$159:$C$159,1,MATCH(PP_Language,labels!$A$1:$C$1,0))","v":"Disclosure of the differences in valuation between fiscal and commercial accounting principles"}]
[null,{"$f":"INDEX(labels!$A$160:$C$160,1,MATCH(PP_Language,labels!$A$1:$C$1,0))","v":"Description of the extent to which indirect costs have been taken into account when determining the manufacturing price"}]
[null,{"$f":"INDEX(labels!$A$161:$C$161,1,MATCH(PP_Language,labels!$A$1:$C$1,0))","v":"Description of the functional currency"}]
[null,{"$f":"INDEX(labels!$A$162:$C$162,1,MATCH(PP_Language,labels!$A$1:$C$1,0))","v":"Description of the reason why the presentation currency is different from the functional currency"}]
[null,{"$f":"INDEX(labels!$A$163:$C$163,1,MATCH(PP_Language,labels!$A$1:$C$1,0))","v":"Description of the reason for changing the presentation currency"}]
[null,{"$f":"INDEX(labels!$A$164:$C$164,1,MATCH(PP_Language,labels!$A$1:$C$1,0))","v":"Disclosure of deviation in prior period figures due to a revision"}]
[null,null,null,null,null,null,null,null,null,null,null,null,null,null,null,null,null,null,null,null,null,null,null,null,null,{"$f":"\"//notes-general-accounting-principles label {\"&COLUMN($B$170)&\"}\"","v":"//notes-general-accounting-principles label {2}"},null,{"$f":"\"//notes-general-accounting-principles \" & BasisOfPreparationAxis & \" \"  & INDEX(labels!$A$103:$C$103,1,MATCH(PP_Language,labels!$A$1:$C$1,0)) &  \" \"  &  \" {\"&COLUMN($D$170)&\"}\"","v":"//notes-general-accounting-principles Commercial Separate  {4}"}]
[null,{"$f":"INDEX(labels!$A$165:$C$165,1,MATCH(PP_Language,labels!$A$1:$C$1,0))","v":"Notes to the financial statements - General accounting principles: Changes in accounting estimates"}]
[null,null,null,null,null,null,null,null,null,null,null,null,null,null,null,null,null,null,null,null,null,null,null,null,null,{"$f":"\"/notes-general-accounting-principles-change-accounting-estimates label {\"&COLUMN($B$172)&\"}\"","v":"/notes-general-accounting-principles-change-accounting-estimates label {2}"},null,{"$f":"\"/notes-general-accounting-principles-change-accounting-estimates \" & BasisOfPreparationAxis & \" \"  & INDEX(labels!$A$103:$C$103,1,MATCH(PP_Language,labels!$A$1:$C$1,0)) &  \" \"  &  \" {\"&COLUMN($D$172)&\"}\"","v":"/notes-general-accounting-principles-change-accounting-estimates Commercial Separate  {4}"}]
[null,{"$f":"INDEX(labels!$A$166:$C$166,1,MATCH(PP_Language,labels!$A$1:$C$1,0))","v":"Notes to the types and quantitative effects of changes in accounting estimates if of importance in the reporting period or subsequent periods"}]
[null,null,null,null,null,null,null,null,null,null,null,null,null,null,null,null,null,null,null,null,null,null,null,null,null,{"$f":"\"//notes-general-accounting-principles-change-accounting-estimates label {\"&COLUMN($B$174)&\"}\"","v":"//notes-general-accounting-principles-change-accounting-estimates label {2}"},null,{"$f":"\"//notes-general-accounting-principles-change-accounting-estimates \" & BasisOfPreparationAxis & \" \"  & INDEX(labels!$A$103:$C$103,1,MATCH(PP_Language,labels!$A$1:$C$1,0)) &  \" \"  &  \" {\"&COLUMN($D$174)&\"}\"","v":"//notes-general-accounting-principles-change-accounting-estimates Commercial Separate  {4}"}]
[null,{"$f":"INDEX(labels!$A$167:$C$167,1,MATCH(PP_Language,labels!$A$1:$C$1,0))","v":"Notes to the financial statements - General accounting principles: Change in accounting estimates: Specification"}]
[]
[]
[null,null,null,{"$f":"INDEX(labels!$A$168:$C$168,1,MATCH(PP_Language,labels!$A$1:$C$1,0))","v":"Change in accounting estimates"},{"$f":"INDEX(labels!$A$168:$C$168,1,MATCH(PP_Language,labels!$A$1:$C$1,0))","v":"Change in accounting estimates"},{"$f":"INDEX(labels!$A$168:$C$168,1,MATCH(PP_Language,labels!$A$1:$C$1,0))","v":"Change in accounting estimates"},{"$f":"INDEX(labels!$A$168:$C$168,1,MATCH(PP_Language,labels!$A$1:$C$1,0))","v":"Change in accounting estimates"},{"$f":"INDEX(labels!$A$168:$C$168,1,MATCH(PP_Language,labels!$A$1:$C$1,0))","v":"Change in accounting estimates"},null,null,null,null,null,null,null,null,null,null,null,null,null,null,null,null,null,{"$f":"\"/notes-general-accounting-principles-change-accounting-estimates-specification label {\"&COLUMN($B$178)&\"}\"","v":"/notes-general-accounting-principles-change-accounting-estimates-specification label {2}"},null,{"$f":"\"/notes-general-accounting-principles-change-accounting-estimates-specification \" & BasisOfPreparationAxis & \" \"  & INDEX(labels!$A$168:$C$168,1,MATCH(PP_Language,labels!$A$1:$C$1,0)) &  \" \"  & INDEX(labels!$A$103:$C$103,1,MATCH(PP_Language,labels!$A$1:$C$1,0)) &  \" {\"&COLUMN($D$178)&\"}\"","v":"/notes-general-accounting-principles-change-accounting-estimates-specification Commercial Change in accounting estimates Separate {4}"},{"$f":"\"/notes-general-accounting-principles-change-accounting-estimates-specification \" & BasisOfPreparationAxis & \" \"  & INDEX(labels!$A$168:$C$168,1,MATCH(PP_Language,labels!$A$1:$C$1,0)) &  \" \"  & INDEX(labels!$A$103:$C$103,1,MATCH(PP_Language,labels!$A$1:$C$1,0)) &  \" {\"&COLUMN($E$178)&\"}\"","v":"/notes-general-accounting-principles-change-accounting-estimates-specification Commercial Change in accounting estimates Separate {5}"},{"$f":"\"/notes-general-accounting-principles-change-accounting-estimates-specification \" & BasisOfPreparationAxis & \" \"  & INDEX(labels!$A$168:$C$168,1,MATCH(PP_Language,labels!$A$1:$C$1,0)) &  \" \"  & INDEX(labels!$A$103:$C$103,1,MATCH(PP_Language,labels!$A$1:$C$1,0)) &  \" {\"&COLUMN($F$178)&\"}\"","v":"/notes-general-accounting-principles-change-accounting-estimates-specification Commercial Change in accounting estimates Separate {6}"},{"$f":"\"/notes-general-accounting-principles-change-accounting-estimates-specification \" & BasisOfPreparationAxis & \" \"  & INDEX(labels!$A$168:$C$168,1,MATCH(PP_Language,labels!$A$1:$C$1,0)) &  \" \"  & INDEX(labels!$A$103:$C$103,1,MATCH(PP_Language,labels!$A$1:$C$1,0)) &  \" {\"&COLUMN($G$178)&\"}\"","v":"/notes-general-accounting-principles-change-accounting-estimates-specification Commercial Change in accounting estimates Separate {7}"},{"$f":"\"/notes-general-accounting-principles-change-accounting-estimates-specification \" & BasisOfPreparationAxis & \" \"  & INDEX(labels!$A$168:$C$168,1,MATCH(PP_Language,labels!$A$1:$C$1,0)) &  \" \"  & INDEX(labels!$A$103:$C$103,1,MATCH(PP_Language,labels!$A$1:$C$1,0)) &  \" {\"&COLUMN($H$178)&\"}\"","v":"/notes-general-accounting-principles-change-accounting-estimates-specification Commercial Change in accounting estimates Separate {8}"}]
[null,{"$f":"INDEX(labels!$A$169:$C$169,1,MATCH(PP_Language,labels!$A$1:$C$1,0))","v":"Description Change in accounting estimates"}]
[null,{"$f":"INDEX(labels!$A$170:$C$170,1,MATCH(PP_Language,labels!$A$1:$C$1,0))","v":"Description of the change in accounting estimates"}]
[null,{"$f":"INDEX(labels!$A$171:$C$171,1,MATCH(PP_Language,labels!$A$1:$C$1,0))","v":"Description of the change in accounting estimates on the current period"}]
[null,{"$f":"INDEX(labels!$A$172:$C$172,1,MATCH(PP_Language,labels!$A$1:$C$1,0))","v":"Presentation order"}]
[null,null,null,null,null,null,null,null,null,null,null,null,null,null,null,null,null,null,null,null,null,null,null,null,null,{"$f":"\"//notes-general-accounting-principles-change-accounting-estimates-specification label {\"&COLUMN($B$183)&\"}\"","v":"//notes-general-accounting-principles-change-accounting-estimates-specification label {2}"},null,{"$f":"\"//notes-general-accounting-principles-change-accounting-estimates-specification \" & BasisOfPreparationAxis & \" \"  & INDEX(labels!$A$168:$C$168,1,MATCH(PP_Language,labels!$A$1:$C$1,0)) &  \" \"  & INDEX(labels!$A$103:$C$103,1,MATCH(PP_Language,labels!$A$1:$C$1,0)) &  \" {\"&COLUMN($D$183)&\"}\"","v":"//notes-general-accounting-principles-change-accounting-estimates-specification Commercial Change in accounting estimates Separate {4}"},{"$f":"\"//notes-general-accounting-principles-change-accounting-estimates-specification \" & BasisOfPreparationAxis & \" \"  & INDEX(labels!$A$168:$C$168,1,MATCH(PP_Language,labels!$A$1:$C$1,0)) &  \" \"  & INDEX(labels!$A$103:$C$103,1,MATCH(PP_Language,labels!$A$1:$C$1,0)) &  \" {\"&COLUMN($E$183)&\"}\"","v":"//notes-general-accounting-principles-change-accounting-estimates-specification Commercial Change in accounting estimates Separate {5}"},{"$f":"\"//notes-general-accounting-principles-change-accounting-estimates-specification \" & BasisOfPreparationAxis & \" \"  & INDEX(labels!$A$168:$C$168,1,MATCH(PP_Language,labels!$A$1:$C$1,0)) &  \" \"  & INDEX(labels!$A$103:$C$103,1,MATCH(PP_Language,labels!$A$1:$C$1,0)) &  \" {\"&COLUMN($F$183)&\"}\"","v":"//notes-general-accounting-principles-change-accounting-estimates-specification Commercial Change in accounting estimates Separate {6}"},{"$f":"\"//notes-general-accounting-principles-change-accounting-estimates-specification \" & BasisOfPreparationAxis & \" \"  & INDEX(labels!$A$168:$C$168,1,MATCH(PP_Language,labels!$A$1:$C$1,0)) &  \" \"  & INDEX(labels!$A$103:$C$103,1,MATCH(PP_Language,labels!$A$1:$C$1,0)) &  \" {\"&COLUMN($G$183)&\"}\"","v":"//notes-general-accounting-principles-change-accounting-estimates-specification Commercial Change in accounting estimates Separate {7}"},{"$f":"\"//notes-general-accounting-principles-change-accounting-estimates-specification \" & BasisOfPreparationAxis & \" \"  & INDEX(labels!$A$168:$C$168,1,MATCH(PP_Language,labels!$A$1:$C$1,0)) &  \" \"  & INDEX(labels!$A$103:$C$103,1,MATCH(PP_Language,labels!$A$1:$C$1,0)) &  \" {\"&COLUMN($H$183)&\"}\"","v":"//notes-general-accounting-principles-change-accounting-estimates-specification Commercial Change in accounting estimates Separate {8}"}]
[null,{"$f":"INDEX(labels!$A$173:$C$173,1,MATCH(PP_Language,labels!$A$1:$C$1,0))","v":"Notes to the financial statements - General accounting principles: Changes in accounting policies"}]
[null,null,null,null,null,null,null,null,null,null,null,null,null,null,null,null,null,null,null,null,null,null,null,null,null,{"$f":"\"/notes-general-accounting-principles-change-accounting-policies label {\"&COLUMN($B$185)&\"}\"","v":"/notes-general-accounting-principles-change-accounting-policies label {2}"},null,{"$f":"\"/notes-general-accounting-principles-change-accounting-policies \" & BasisOfPreparationAxis & \" \"  & INDEX(labels!$A$103:$C$103,1,MATCH(PP_Language,labels!$A$1:$C$1,0)) &  \" \"  &  \" {\"&COLUMN($D$185)&\"}\"","v":"/notes-general-accounting-principles-change-accounting-policies Commercial Separate  {4}"}]
[null,{"$f":"INDEX(labels!$A$174:$C$174,1,MATCH(PP_Language,labels!$A$1:$C$1,0))","v":"Disclosure of changes in accounting policies"}]
[null,null,null,null,null,null,null,null,null,null,null,null,null,null,null,null,null,null,null,null,null,null,null,null,null,{"$f":"\"//notes-general-accounting-principles-change-accounting-policies label {\"&COLUMN($B$187)&\"}\"","v":"//notes-general-accounting-principles-change-accounting-policies label {2}"},null,{"$f":"\"//notes-general-accounting-principles-change-accounting-policies \" & BasisOfPreparationAxis & \" \"  & INDEX(labels!$A$103:$C$103,1,MATCH(PP_Language,labels!$A$1:$C$1,0)) &  \" \"  &  \" {\"&COLUMN($D$187)&\"}\"","v":"//notes-general-accounting-principles-change-accounting-policies Commercial Separate  {4}"}]
[null,{"$f":"INDEX(labels!$A$175:$C$175,1,MATCH(PP_Language,labels!$A$1:$C$1,0))","v":"Notes to the financial statements - General accounting principles: Change in accounting policies: Specification"}]
[]
[]
[null,null,null,{"$f":"INDEX(labels!$A$176:$C$176,1,MATCH(PP_Language,labels!$A$1:$C$1,0))","v":"Change in accounting policies"},{"$f":"INDEX(labels!$A$176:$C$176,1,MATCH(PP_Language,labels!$A$1:$C$1,0))","v":"Change in accounting policies"},{"$f":"INDEX(labels!$A$176:$C$176,1,MATCH(PP_Language,labels!$A$1:$C$1,0))","v":"Change in accounting policies"},{"$f":"INDEX(labels!$A$176:$C$176,1,MATCH(PP_Language,labels!$A$1:$C$1,0))","v":"Change in accounting policies"},{"$f":"INDEX(labels!$A$176:$C$176,1,MATCH(PP_Language,labels!$A$1:$C$1,0))","v":"Change in accounting policies"},null,null,null,null,null,null,null,null,null,null,null,null,null,null,null,null,null,{"$f":"\"/notes-general-accounting-principles-change-accounting-policies-specification label {\"&COLUMN($B$191)&\"}\"","v":"/notes-general-accounting-principles-change-accounting-policies-specification label {2}"},null,{"$f":"\"/notes-general-accounting-principles-change-accounting-policies-specification \" & BasisOfPreparationAxis & \" \"  & INDEX(labels!$A$176:$C$176,1,MATCH(PP_Language,labels!$A$1:$C$1,0)) &  \" \"  & INDEX(labels!$A$103:$C$103,1,MATCH(PP_Language,labels!$A$1:$C$1,0)) &  \" {\"&COLUMN($D$191)&\"}\"","v":"/notes-general-accounting-principles-change-accounting-policies-specification Commercial Change in accounting policies Separate {4}"},{"$f":"\"/notes-general-accounting-principles-change-accounting-policies-specification \" & BasisOfPreparationAxis & \" \"  & INDEX(labels!$A$176:$C$176,1,MATCH(PP_Language,labels!$A$1:$C$1,0)) &  \" \"  & INDEX(labels!$A$103:$C$103,1,MATCH(PP_Language,labels!$A$1:$C$1,0)) &  \" {\"&COLUMN($E$191)&\"}\"","v":"/notes-general-accounting-principles-change-accounting-policies-specification Commercial Change in accounting policies Separate {5}"},{"$f":"\"/notes-general-accounting-principles-change-accounting-policies-specification \" & BasisOfPreparationAxis & \" \"  & INDEX(labels!$A$176:$C$176,1,MATCH(PP_Language,labels!$A$1:$C$1,0)) &  \" \"  & INDEX(labels!$A$103:$C$103,1,MATCH(PP_Language,labels!$A$1:$C$1,0)) &  \" {\"&COLUMN($F$191)&\"}\"","v":"/notes-general-accounting-principles-change-accounting-policies-specification Commercial Change in accounting policies Separate {6}"},{"$f":"\"/notes-general-accounting-principles-change-accounting-policies-specification \" & BasisOfPreparationAxis & \" \"  & INDEX(labels!$A$176:$C$176,1,MATCH(PP_Language,labels!$A$1:$C$1,0)) &  \" \"  & INDEX(labels!$A$103:$C$103,1,MATCH(PP_Language,labels!$A$1:$C$1,0)) &  \" {\"&COLUMN($G$191)&\"}\"","v":"/notes-general-accounting-principles-change-accounting-policies-specification Commercial Change in accounting policies Separate {7}"},{"$f":"\"/notes-general-accounting-principles-change-accounting-policies-specification \" & BasisOfPreparationAxis & \" \"  & INDEX(labels!$A$176:$C$176,1,MATCH(PP_Language,labels!$A$1:$C$1,0)) &  \" \"  & INDEX(labels!$A$103:$C$103,1,MATCH(PP_Language,labels!$A$1:$C$1,0)) &  \" {\"&COLUMN($H$191)&\"}\"","v":"/notes-general-accounting-principles-change-accounting-policies-specification Commercial Change in accounting policies Separate {8}"}]
[null,{"$f":"INDEX(labels!$A$177:$C$177,1,MATCH(PP_Language,labels!$A$1:$C$1,0))","v":"Description Change in accounting policies"}]
[null,{"$f":"INDEX(labels!$A$178:$C$178,1,MATCH(PP_Language,labels!$A$1:$C$1,0))","v":"Description of the reason for change in accounting policies"}]
[null,{"$f":"INDEX(labels!$A$179:$C$179,1,MATCH(PP_Language,labels!$A$1:$C$1,0))","v":"Description of the method of processing the effects of the change in accounting policies"}]
[null,{"$f":"INDEX(labels!$A$180:$C$180,1,MATCH(PP_Language,labels!$A$1:$C$1,0))","v":"Description of the meaning of the system change for capital and result"}]
[null,{"$f":"INDEX(labels!$A$181:$C$181,1,MATCH(PP_Language,labels!$A$1:$C$1,0))","v":"Description of the effect of the change in accounting policies on individual items"}]
[null,{"$f":"INDEX(labels!$A$172:$C$172,1,MATCH(PP_Language,labels!$A$1:$C$1,0))","v":"Presentation order"}]
[null,null,null,null,null,null,null,null,null,null,null,null,null,null,null,null,null,null,null,null,null,null,null,null,null,{"$f":"\"//notes-general-accounting-principles-change-accounting-policies-specification label {\"&COLUMN($B$198)&\"}\"","v":"//notes-general-accounting-principles-change-accounting-policies-specification label {2}"},null,{"$f":"\"//notes-general-accounting-principles-change-accounting-policies-specification \" & BasisOfPreparationAxis & \" \"  & INDEX(labels!$A$176:$C$176,1,MATCH(PP_Language,labels!$A$1:$C$1,0)) &  \" \"  & INDEX(labels!$A$103:$C$103,1,MATCH(PP_Language,labels!$A$1:$C$1,0)) &  \" {\"&COLUMN($D$198)&\"}\"","v":"//notes-general-accounting-principles-change-accounting-policies-specification Commercial Change in accounting policies Separate {4}"},{"$f":"\"//notes-general-accounting-principles-change-accounting-policies-specification \" & BasisOfPreparationAxis & \" \"  & INDEX(labels!$A$176:$C$176,1,MATCH(PP_Language,labels!$A$1:$C$1,0)) &  \" \"  & INDEX(labels!$A$103:$C$103,1,MATCH(PP_Language,labels!$A$1:$C$1,0)) &  \" {\"&COLUMN($E$198)&\"}\"","v":"//notes-general-accounting-principles-change-accounting-policies-specification Commercial Change in accounting policies Separate {5}"},{"$f":"\"//notes-general-accounting-principles-change-accounting-policies-specification \" & BasisOfPreparationAxis & \" \"  & INDEX(labels!$A$176:$C$176,1,MATCH(PP_Language,labels!$A$1:$C$1,0)) &  \" \"  & INDEX(labels!$A$103:$C$103,1,MATCH(PP_Language,labels!$A$1:$C$1,0)) &  \" {\"&COLUMN($F$198)&\"}\"","v":"//notes-general-accounting-principles-change-accounting-policies-specification Commercial Change in accounting policies Separate {6}"},{"$f":"\"//notes-general-accounting-principles-change-accounting-policies-specification \" & BasisOfPreparationAxis & \" \"  & INDEX(labels!$A$176:$C$176,1,MATCH(PP_Language,labels!$A$1:$C$1,0)) &  \" \"  & INDEX(labels!$A$103:$C$103,1,MATCH(PP_Language,labels!$A$1:$C$1,0)) &  \" {\"&COLUMN($G$198)&\"}\"","v":"//notes-general-accounting-principles-change-accounting-policies-specification Commercial Change in accounting policies Separate {7}"},{"$f":"\"//notes-general-accounting-principles-change-accounting-policies-specification \" & BasisOfPreparationAxis & \" \"  & INDEX(labels!$A$176:$C$176,1,MATCH(PP_Language,labels!$A$1:$C$1,0)) &  \" \"  & INDEX(labels!$A$103:$C$103,1,MATCH(PP_Language,labels!$A$1:$C$1,0)) &  \" {\"&COLUMN($H$198)&\"}\"","v":"//notes-general-accounting-principles-change-accounting-policies-specification Commercial Change in accounting policies Separate {8}"}]
[null,{"$f":"INDEX(labels!$A$182:$C$182,1,MATCH(PP_Language,labels!$A$1:$C$1,0))","v":"Notes to the financial statements - General accounting principles: Prior period errors"}]
[null,null,null,null,null,null,null,null,null,null,null,null,null,null,null,null,null,null,null,null,null,null,null,null,null,{"$f":"\"/notes-general-accounting-principles-prior-period-errors label {\"&COLUMN($B$200)&\"}\"","v":"/notes-general-accounting-principles-prior-period-errors label {2}"},null,{"$f":"\"/notes-general-accounting-principles-prior-period-errors \" & BasisOfPreparationAxis & \" \"  & INDEX(labels!$A$103:$C$103,1,MATCH(PP_Language,labels!$A$1:$C$1,0)) &  \" \"  &  \" {\"&COLUMN($D$200)&\"}\"","v":"/notes-general-accounting-principles-prior-period-errors Commercial Separate  {4}"}]
[null,{"$f":"INDEX(labels!$A$183:$C$183,1,MATCH(PP_Language,labels!$A$1:$C$1,0))","v":"Disclosure of prior period errors"}]
[null,null,null,null,null,null,null,null,null,null,null,null,null,null,null,null,null,null,null,null,null,null,null,null,null,{"$f":"\"//notes-general-accounting-principles-prior-period-errors label {\"&COLUMN($B$202)&\"}\"","v":"//notes-general-accounting-principles-prior-period-errors label {2}"},null,{"$f":"\"//notes-general-accounting-principles-prior-period-errors \" & BasisOfPreparationAxis & \" \"  & INDEX(labels!$A$103:$C$103,1,MATCH(PP_Language,labels!$A$1:$C$1,0)) &  \" \"  &  \" {\"&COLUMN($D$202)&\"}\"","v":"//notes-general-accounting-principles-prior-period-errors Commercial Separate  {4}"}]
[null,{"$f":"INDEX(labels!$A$184:$C$184,1,MATCH(PP_Language,labels!$A$1:$C$1,0))","v":"Notes to the financial statements - General accounting principles: Prior period errors: Specification"}]
[]
[]
[null,null,null,{"$f":"INDEX(labels!$A$185:$C$185,1,MATCH(PP_Language,labels!$A$1:$C$1,0))","v":"Prior period errors"},{"$f":"INDEX(labels!$A$185:$C$185,1,MATCH(PP_Language,labels!$A$1:$C$1,0))","v":"Prior period errors"},{"$f":"INDEX(labels!$A$185:$C$185,1,MATCH(PP_Language,labels!$A$1:$C$1,0))","v":"Prior period errors"},{"$f":"INDEX(labels!$A$185:$C$185,1,MATCH(PP_Language,labels!$A$1:$C$1,0))","v":"Prior period errors"},{"$f":"INDEX(labels!$A$185:$C$185,1,MATCH(PP_Language,labels!$A$1:$C$1,0))","v":"Prior period errors"},null,null,null,null,null,null,null,null,null,null,null,null,null,null,null,null,null,{"$f":"\"/notes-general-accounting-principles-prior-period-errors-specification label {\"&COLUMN($B$206)&\"}\"","v":"/notes-general-accounting-principles-prior-period-errors-specification label {2}"},null,{"$f":"\"/notes-general-accounting-principles-prior-period-errors-specification \" & BasisOfPreparationAxis & \" \"  & INDEX(labels!$A$185:$C$185,1,MATCH(PP_Language,labels!$A$1:$C$1,0)) &  \" \"  & INDEX(labels!$A$103:$C$103,1,MATCH(PP_Language,labels!$A$1:$C$1,0)) &  \" {\"&COLUMN($D$206)&\"}\"","v":"/notes-general-accounting-principles-prior-period-errors-specification Commercial Prior period errors Separate {4}"},{"$f":"\"/notes-general-accounting-principles-prior-period-errors-specification \" & BasisOfPreparationAxis & \" \"  & INDEX(labels!$A$185:$C$185,1,MATCH(PP_Language,labels!$A$1:$C$1,0)) &  \" \"  & INDEX(labels!$A$103:$C$103,1,MATCH(PP_Language,labels!$A$1:$C$1,0)) &  \" {\"&COLUMN($E$206)&\"}\"","v":"/notes-general-accounting-principles-prior-period-errors-specification Commercial Prior period errors Separate {5}"},{"$f":"\"/notes-general-accounting-principles-prior-period-errors-specification \" & BasisOfPreparationAxis & \" \"  & INDEX(labels!$A$185:$C$185,1,MATCH(PP_Language,labels!$A$1:$C$1,0)) &  \" \"  & INDEX(labels!$A$103:$C$103,1,MATCH(PP_Language,labels!$A$1:$C$1,0)) &  \" {\"&COLUMN($F$206)&\"}\"","v":"/notes-general-accounting-principles-prior-period-errors-specification Commercial Prior period errors Separate {6}"},{"$f":"\"/notes-general-accounting-principles-prior-period-errors-specification \" & BasisOfPreparationAxis & \" \"  & INDEX(labels!$A$185:$C$185,1,MATCH(PP_Language,labels!$A$1:$C$1,0)) &  \" \"  & INDEX(labels!$A$103:$C$103,1,MATCH(PP_Language,labels!$A$1:$C$1,0)) &  \" {\"&COLUMN($G$206)&\"}\"","v":"/notes-general-accounting-principles-prior-period-errors-specification Commercial Prior period errors Separate {7}"},{"$f":"\"/notes-general-accounting-principles-prior-period-errors-specification \" & BasisOfPreparationAxis & \" \"  & INDEX(labels!$A$185:$C$185,1,MATCH(PP_Language,labels!$A$1:$C$1,0)) &  \" \"  & INDEX(labels!$A$103:$C$103,1,MATCH(PP_Language,labels!$A$1:$C$1,0)) &  \" {\"&COLUMN($H$206)&\"}\"","v":"/notes-general-accounting-principles-prior-period-errors-specification Commercial Prior period errors Separate {8}"}]
[null,{"$f":"INDEX(labels!$A$186:$C$186,1,MATCH(PP_Language,labels!$A$1:$C$1,0))","v":"Description Prior period errors"}]
[null,{"$f":"INDEX(labels!$A$187:$C$187,1,MATCH(PP_Language,labels!$A$1:$C$1,0))","v":"Description of nature and extent of the material error"}]
[null,{"$f":"INDEX(labels!$A$188:$C$188,1,MATCH(PP_Language,labels!$A$1:$C$1,0))","v":"Description of the effect of the correction of the material error"}]
[null,{"$f":"INDEX(labels!$A$172:$C$172,1,MATCH(PP_Language,labels!$A$1:$C$1,0))","v":"Presentation order"}]
[null,null,null,null,null,null,null,null,null,null,null,null,null,null,null,null,null,null,null,null,null,null,null,null,null,{"$f":"\"//notes-general-accounting-principles-prior-period-errors-specification label {\"&COLUMN($B$211)&\"}\"","v":"//notes-general-accounting-principles-prior-period-errors-specification label {2}"},null,{"$f":"\"//notes-general-accounting-principles-prior-period-errors-specification \" & BasisOfPreparationAxis & \" \"  & INDEX(labels!$A$185:$C$185,1,MATCH(PP_Language,labels!$A$1:$C$1,0)) &  \" \"  & INDEX(labels!$A$103:$C$103,1,MATCH(PP_Language,labels!$A$1:$C$1,0)) &  \" {\"&COLUMN($D$211)&\"}\"","v":"//notes-general-accounting-principles-prior-period-errors-specification Commercial Prior period errors Separate {4}"},{"$f":"\"//notes-general-accounting-principles-prior-period-errors-specification \" & BasisOfPreparationAxis & \" \"  & INDEX(labels!$A$185:$C$185,1,MATCH(PP_Language,labels!$A$1:$C$1,0)) &  \" \"  & INDEX(labels!$A$103:$C$103,1,MATCH(PP_Language,labels!$A$1:$C$1,0)) &  \" {\"&COLUMN($E$211)&\"}\"","v":"//notes-general-accounting-principles-prior-period-errors-specification Commercial Prior period errors Separate {5}"},{"$f":"\"//notes-general-accounting-principles-prior-period-errors-specification \" & BasisOfPreparationAxis & \" \"  & INDEX(labels!$A$185:$C$185,1,MATCH(PP_Language,labels!$A$1:$C$1,0)) &  \" \"  & INDEX(labels!$A$103:$C$103,1,MATCH(PP_Language,labels!$A$1:$C$1,0)) &  \" {\"&COLUMN($F$211)&\"}\"","v":"//notes-general-accounting-principles-prior-period-errors-specification Commercial Prior period errors Separate {6}"},{"$f":"\"//notes-general-accounting-principles-prior-period-errors-specification \" & BasisOfPreparationAxis & \" \"  & INDEX(labels!$A$185:$C$185,1,MATCH(PP_Language,labels!$A$1:$C$1,0)) &  \" \"  & INDEX(labels!$A$103:$C$103,1,MATCH(PP_Language,labels!$A$1:$C$1,0)) &  \" {\"&COLUMN($G$211)&\"}\"","v":"//notes-general-accounting-principles-prior-period-errors-specification Commercial Prior period errors Separate {7}"},{"$f":"\"//notes-general-accounting-principles-prior-period-errors-specification \" & BasisOfPreparationAxis & \" \"  & INDEX(labels!$A$185:$C$185,1,MATCH(PP_Language,labels!$A$1:$C$1,0)) &  \" \"  & INDEX(labels!$A$103:$C$103,1,MATCH(PP_Language,labels!$A$1:$C$1,0)) &  \" {\"&COLUMN($H$211)&\"}\"","v":"//notes-general-accounting-principles-prior-period-errors-specification Commercial Prior period errors Separate {8}"}]
[null,{"$f":"INDEX(labels!$A$189:$C$189,1,MATCH(PP_Language,labels!$A$1:$C$1,0))","v":"Notes to the financial statements - General accounting principles: Foreign currency translation"}]
[null,null,null,null,null,null,null,null,null,null,null,null,null,null,null,null,null,null,null,null,null,null,null,null,null,{"$f":"\"/notes-general-accounting-principles-foreign-currency-translation label {\"&COLUMN($B$213)&\"}\"","v":"/notes-general-accounting-principles-foreign-currency-translation label {2}"},null,{"$f":"\"/notes-general-accounting-principles-foreign-currency-translation \" & BasisOfPreparationAxis & \" \"  & INDEX(labels!$A$103:$C$103,1,MATCH(PP_Language,labels!$A$1:$C$1,0)) &  \" \"  &  \" {\"&COLUMN($D$213)&\"}\"","v":"/notes-general-accounting-principles-foreign-currency-translation Commercial Separate  {4}"}]
[null,{"$f":"INDEX(labels!$A$190:$C$190,1,MATCH(PP_Language,labels!$A$1:$C$1,0))","v":"Policy of conversion of amounts denominated in foreign currency"}]
[null,{"$f":"INDEX(labels!$A$191:$C$191,1,MATCH(PP_Language,labels!$A$1:$C$1,0))","v":"Basis of Conversion and Processing of Exchange Rate Differences Relating to Foreign Currency Transactions for the Balance Sheet"}]
[null,{"$f":"INDEX(labels!$A$192:$C$192,1,MATCH(PP_Language,labels!$A$1:$C$1,0))","v":"Policy of translation for hyperinflation in business operations abroad"}]
[null,{"$f":"INDEX(labels!$A$193:$C$193,1,MATCH(PP_Language,labels!$A$1:$C$1,0))","v":"Policy of foreign currency translation and the processing of foreign currency translation differences in foreign currency transactions"}]
[null,{"$f":"INDEX(labels!$A$194:$C$194,1,MATCH(PP_Language,labels!$A$1:$C$1,0))","v":"Policy of foreign currency translation and the processing of foreign currency translation differences with regard to business activities abroad"}]
[null,{"$f":"INDEX(labels!$A$195:$C$195,1,MATCH(PP_Language,labels!$A$1:$C$1,0))","v":"Accounting policies for the calculation and processing of exchange rate differences relating to business operations abroad for the balance sheet"}]
[null,{"$f":"INDEX(labels!$A$196:$C$196,1,MATCH(PP_Language,labels!$A$1:$C$1,0))","v":"Principles of the method of calculating and accounting for foreign exchange differences related to the conduct of business abroad for the profit and loss account"}]
[null,{"$f":"INDEX(labels!$A$197:$C$197,1,MATCH(PP_Language,labels!$A$1:$C$1,0))","v":"Accounting policies for the translation and treatment of exchange rate differences relating to goodwill and the fair value adjustment for the acquisition of a business abroad for the balance sheet"}]
[null,{"$f":"INDEX(labels!$A$198:$C$198,1,MATCH(PP_Language,labels!$A$1:$C$1,0))","v":"Accounting policies for the translation and treatment of exchange rate differences relating to goodwill and the fair value adjustment for the acquisition of a business abroad for the profit and loss account"}]
[null,{"$f":"INDEX(labels!$A$199:$C$199,1,MATCH(PP_Language,labels!$A$1:$C$1,0))","v":"Principles for the method of conversion and the treatment of exchange rate differences relating to goodwill and the adjustment to fair value for the acquisition of a business activity abroad"}]
[null,null,null,null,null,null,null,null,null,null,null,null,null,null,null,null,null,null,null,null,null,null,null,null,null,{"$f":"\"//notes-general-accounting-principles-foreign-currency-translation label {\"&COLUMN($B$224)&\"}\"","v":"//notes-general-accounting-principles-foreign-currency-translation label {2}"},null,{"$f":"\"//notes-general-accounting-principles-foreign-currency-translation \" & BasisOfPreparationAxis & \" \"  & INDEX(labels!$A$103:$C$103,1,MATCH(PP_Language,labels!$A$1:$C$1,0)) &  \" \"  &  \" {\"&COLUMN($D$224)&\"}\"","v":"//notes-general-accounting-principles-foreign-currency-translation Commercial Separate  {4}"}]
[null,{"$f":"INDEX(labels!$A$200:$C$200,1,MATCH(PP_Language,labels!$A$1:$C$1,0))","v":"Notes to the financial statements - General accounting principles: Leases"}]
[null,null,null,null,null,null,null,null,null,null,null,null,null,null,null,null,null,null,null,null,null,null,null,null,null,{"$f":"\"/notes-general-accounting-principles-leases label {\"&COLUMN($B$226)&\"}\"","v":"/notes-general-accounting-principles-leases label {2}"},null,{"$f":"\"/notes-general-accounting-principles-leases \" & BasisOfPreparationAxis & \" \"  & INDEX(labels!$A$103:$C$103,1,MATCH(PP_Language,labels!$A$1:$C$1,0)) &  \" \"  &  \" {\"&COLUMN($D$226)&\"}\"","v":"/notes-general-accounting-principles-leases Commercial Separate  {4}"}]
[null,{"$f":"INDEX(labels!$A$201:$C$201,1,MATCH(PP_Language,labels!$A$1:$C$1,0))","v":"Policy of leases"}]
[null,{"$f":"INDEX(labels!$A$202:$C$202,1,MATCH(PP_Language,labels!$A$1:$C$1,0))","v":"Policy of finance leases"}]
[null,{"$f":"INDEX(labels!$A$203:$C$203,1,MATCH(PP_Language,labels!$A$1:$C$1,0))","v":"Policy of operating leases"}]
[null,null,null,null,null,null,null,null,null,null,null,null,null,null,null,null,null,null,null,null,null,null,null,null,null,{"$f":"\"//notes-general-accounting-principles-leases label {\"&COLUMN($B$230)&\"}\"","v":"//notes-general-accounting-principles-leases label {2}"},null,{"$f":"\"//notes-general-accounting-principles-leases \" & BasisOfPreparationAxis & \" \"  & INDEX(labels!$A$103:$C$103,1,MATCH(PP_Language,labels!$A$1:$C$1,0)) &  \" \"  &  \" {\"&COLUMN($D$230)&\"}\"","v":"//notes-general-accounting-principles-leases Commercial Separate  {4}"}]
[null,{"$f":"INDEX(labels!$A$204:$C$204,1,MATCH(PP_Language,labels!$A$1:$C$1,0))","v":"Notes to the financial statements - General accounting principles: Share based payments"}]
[null,null,null,null,null,null,null,null,null,null,null,null,null,null,null,null,null,null,null,null,null,null,null,null,null,{"$f":"\"/notes-general-accounting-principles-share-based-payments label {\"&COLUMN($B$232)&\"}\"","v":"/notes-general-accounting-principles-share-based-payments label {2}"},null,{"$f":"\"/notes-general-accounting-principles-share-based-payments \" & BasisOfPreparationAxis & \" \"  & INDEX(labels!$A$103:$C$103,1,MATCH(PP_Language,labels!$A$1:$C$1,0)) &  \" \"  &  \" {\"&COLUMN($D$232)&\"}\"","v":"/notes-general-accounting-principles-share-based-payments Commercial Separate  {4}"}]
[null,{"$f":"INDEX(labels!$A$205:$C$205,1,MATCH(PP_Language,labels!$A$1:$C$1,0))","v":"Policy of share based payments"}]
[null,null,null,null,null,null,null,null,null,null,null,null,null,null,null,null,null,null,null,null,null,null,null,null,null,{"$f":"\"//notes-general-accounting-principles-share-based-payments label {\"&COLUMN($B$234)&\"}\"","v":"//notes-general-accounting-principles-share-based-payments label {2}"},null,{"$f":"\"//notes-general-accounting-principles-share-based-payments \" & BasisOfPreparationAxis & \" \"  & INDEX(labels!$A$103:$C$103,1,MATCH(PP_Language,labels!$A$1:$C$1,0)) &  \" \"  &  \" {\"&COLUMN($D$234)&\"}\"","v":"//notes-general-accounting-principles-share-based-payments Commercial Separate  {4}"}]
[null,{"$f":"INDEX(labels!$A$206:$C$206,1,MATCH(PP_Language,labels!$A$1:$C$1,0))","v":"Notes to the financial statements - General accounting principles: Exceptional items"}]
[null,null,null,null,null,null,null,null,null,null,null,null,null,null,null,null,null,null,null,null,null,null,null,null,null,{"$f":"\"/notes-general-accounting-principles-exceptional-items label {\"&COLUMN($B$236)&\"}\"","v":"/notes-general-accounting-principles-exceptional-items label {2}"},null,{"$f":"\"/notes-general-accounting-principles-exceptional-items \" & BasisOfPreparationAxis & \" \"  & INDEX(labels!$A$103:$C$103,1,MATCH(PP_Language,labels!$A$1:$C$1,0)) &  \" \"  &  \" {\"&COLUMN($D$236)&\"}\"","v":"/notes-general-accounting-principles-exceptional-items Commercial Separate  {4}"}]
[null,{"$f":"INDEX(labels!$A$207:$C$207,1,MATCH(PP_Language,labels!$A$1:$C$1,0))","v":"Policy of exceptional items"}]
[null,null,null,null,null,null,null,null,null,null,null,null,null,null,null,null,null,null,null,null,null,null,null,null,null,{"$f":"\"//notes-general-accounting-principles-exceptional-items label {\"&COLUMN($B$238)&\"}\"","v":"//notes-general-accounting-principles-exceptional-items label {2}"},null,{"$f":"\"//notes-general-accounting-principles-exceptional-items \" & BasisOfPreparationAxis & \" \"  & INDEX(labels!$A$103:$C$103,1,MATCH(PP_Language,labels!$A$1:$C$1,0)) &  \" \"  &  \" {\"&COLUMN($D$238)&\"}\"","v":"//notes-general-accounting-principles-exceptional-items Commercial Separate  {4}"}]
[null,{"$f":"INDEX(labels!$A$208:$C$208,1,MATCH(PP_Language,labels!$A$1:$C$1,0))","v":"Notes to the financial statements - General accounting principles: Pension arrangements"}]
[null,null,null,null,null,null,null,null,null,null,null,null,null,null,null,null,null,null,null,null,null,null,null,null,null,{"$f":"\"/notes-general-accounting-principles-pension-arrangements label {\"&COLUMN($B$240)&\"}\"","v":"/notes-general-accounting-principles-pension-arrangements label {2}"},null,{"$f":"\"/notes-general-accounting-principles-pension-arrangements \" & BasisOfPreparationAxis & \" \"  & INDEX(labels!$A$103:$C$103,1,MATCH(PP_Language,labels!$A$1:$C$1,0)) &  \" \"  &  \" {\"&COLUMN($D$240)&\"}\"","v":"/notes-general-accounting-principles-pension-arrangements Commercial Separate  {4}"}]
[null,{"$f":"INDEX(labels!$A$209:$C$209,1,MATCH(PP_Language,labels!$A$1:$C$1,0))","v":"Policy of pension arrangements"}]
[null,null,null,null,null,null,null,null,null,null,null,null,null,null,null,null,null,null,null,null,null,null,null,null,null,{"$f":"\"//notes-general-accounting-principles-pension-arrangements label {\"&COLUMN($B$242)&\"}\"","v":"//notes-general-accounting-principles-pension-arrangements label {2}"},null,{"$f":"\"//notes-general-accounting-principles-pension-arrangements \" & BasisOfPreparationAxis & \" \"  & INDEX(labels!$A$103:$C$103,1,MATCH(PP_Language,labels!$A$1:$C$1,0)) &  \" \"  &  \" {\"&COLUMN($D$242)&\"}\"","v":"//notes-general-accounting-principles-pension-arrangements Commercial Separate  {4}"}]
[null,{"$f":"INDEX(labels!$A$210:$C$210,1,MATCH(PP_Language,labels!$A$1:$C$1,0))","v":"Notes to the financial statements - General accounting principles: Financial instruments"}]
[null,null,null,null,null,null,null,null,null,null,null,null,null,null,null,null,null,null,null,null,null,null,null,null,null,{"$f":"\"/notes-general-accounting-principles-financial-instruments label {\"&COLUMN($B$244)&\"}\"","v":"/notes-general-accounting-principles-financial-instruments label {2}"},null,{"$f":"\"/notes-general-accounting-principles-financial-instruments \" & BasisOfPreparationAxis & \" \"  & INDEX(labels!$A$103:$C$103,1,MATCH(PP_Language,labels!$A$1:$C$1,0)) &  \" \"  &  \" {\"&COLUMN($D$244)&\"}\"","v":"/notes-general-accounting-principles-financial-instruments Commercial Separate  {4}"}]
[null,{"$f":"INDEX(labels!$A$211:$C$211,1,MATCH(PP_Language,labels!$A$1:$C$1,0))","v":"Policy of financial instruments"}]
[null,{"$f":"INDEX(labels!$A$212:$C$212,1,MATCH(PP_Language,labels!$A$1:$C$1,0))","v":"Policy of current value of financial instruments"}]
[null,null,null,null,null,null,null,null,null,null,null,null,null,null,null,null,null,null,null,null,null,null,null,null,null,{"$f":"\"//notes-general-accounting-principles-financial-instruments label {\"&COLUMN($B$247)&\"}\"","v":"//notes-general-accounting-principles-financial-instruments label {2}"},null,{"$f":"\"//notes-general-accounting-principles-financial-instruments \" & BasisOfPreparationAxis & \" \"  & INDEX(labels!$A$103:$C$103,1,MATCH(PP_Language,labels!$A$1:$C$1,0)) &  \" \"  &  \" {\"&COLUMN($D$247)&\"}\"","v":"//notes-general-accounting-principles-financial-instruments Commercial Separate  {4}"}]
[null,{"$f":"INDEX(labels!$A$55:$C$55,1,MATCH(PP_Language,labels!$A$1:$C$1,0))","v":"Accounting principles"}]
[null,{"$f":"INDEX(labels!$A$213:$C$213,1,MATCH(PP_Language,labels!$A$1:$C$1,0))","v":"Notes to the financial statements - Accounting principles applied to the valuation of assets and liabilities"}]
[null,null,null,null,null,null,null,null,null,null,null,null,null,null,null,null,null,null,null,null,null,null,null,null,null,{"$f":"\"/notes-accounting-principles-assets-liabilities label {\"&COLUMN($B$250)&\"}\"","v":"/notes-accounting-principles-assets-liabilities label {2}"},null,{"$f":"\"/notes-accounting-principles-assets-liabilities \" & BasisOfPreparationAxis & \" \"  & INDEX(labels!$A$103:$C$103,1,MATCH(PP_Language,labels!$A$1:$C$1,0)) &  \" \"  &  \" {\"&COLUMN($D$250)&\"}\"","v":"/notes-accounting-principles-assets-liabilities Commercial Separate  {4}"}]
[null,{"$f":"INDEX(labels!$A$214:$C$214,1,MATCH(PP_Language,labels!$A$1:$C$1,0))","v":"Policy of intangible assets"}]
[null,{"$f":"INDEX(labels!$A$215:$C$215,1,MATCH(PP_Language,labels!$A$1:$C$1,0))","v":"Policy of impairment of intangible assets"}]
[null,{"$f":"INDEX(labels!$A$216:$C$216,1,MATCH(PP_Language,labels!$A$1:$C$1,0))","v":"Policy of reversal of impairment of intangible assets"}]
[null,{"$f":"INDEX(labels!$A$217:$C$217,1,MATCH(PP_Language,labels!$A$1:$C$1,0))","v":"Policy of costs relating to the incorporation and issuance of shares"}]
[null,{"$f":"INDEX(labels!$A$218:$C$218,1,MATCH(PP_Language,labels!$A$1:$C$1,0))","v":"Policy of development costs"}]
[null,{"$f":"INDEX(labels!$A$219:$C$219,1,MATCH(PP_Language,labels!$A$1:$C$1,0))","v":"Policy of costs of acquisition of patents, trademarks and other rights"}]
[null,{"$f":"INDEX(labels!$A$220:$C$220,1,MATCH(PP_Language,labels!$A$1:$C$1,0))","v":"Policy of costs of goodwill acquired from third party"}]
[null,{"$f":"INDEX(labels!$A$221:$C$221,1,MATCH(PP_Language,labels!$A$1:$C$1,0))","v":"Policy of prepayments of intangible assets"}]
[null,{"$f":"INDEX(labels!$A$222:$C$222,1,MATCH(PP_Language,labels!$A$1:$C$1,0))","v":"Policy of intangible assets other"}]
[null,{"$f":"INDEX(labels!$A$223:$C$223,1,MATCH(PP_Language,labels!$A$1:$C$1,0))","v":"Policy of property, plant and equipment"}]
[null,{"$f":"INDEX(labels!$A$224:$C$224,1,MATCH(PP_Language,labels!$A$1:$C$1,0))","v":"Policy of impairment of property, plant and equipment"}]
[null,{"$f":"INDEX(labels!$A$225:$C$225,1,MATCH(PP_Language,labels!$A$1:$C$1,0))","v":"Policy of reversal of impairment of property, plant and equipment"}]
[null,{"$f":"INDEX(labels!$A$226:$C$226,1,MATCH(PP_Language,labels!$A$1:$C$1,0))","v":"Policy of land and buildings"}]
[null,{"$f":"INDEX(labels!$A$227:$C$227,1,MATCH(PP_Language,labels!$A$1:$C$1,0))","v":"Policy of machinery"}]
[null,{"$f":"INDEX(labels!$A$228:$C$228,1,MATCH(PP_Language,labels!$A$1:$C$1,0))","v":"Policy of other tangible assets"}]
[null,{"$f":"INDEX(labels!$A$229:$C$229,1,MATCH(PP_Language,labels!$A$1:$C$1,0))","v":"Policy of Property, plant and equipment in progress and prepayments of property, plant and equipment"}]
[null,{"$f":"INDEX(labels!$A$230:$C$230,1,MATCH(PP_Language,labels!$A$1:$C$1,0))","v":"Policy of property, plant and equipment not used in the production process"}]
[null,{"$f":"INDEX(labels!$A$231:$C$231,1,MATCH(PP_Language,labels!$A$1:$C$1,0))","v":"Policy of processing of repair and maintenance costs"}]
[null,{"$f":"INDEX(labels!$A$232:$C$232,1,MATCH(PP_Language,labels!$A$1:$C$1,0))","v":"Policy of investment properties"}]
[null,{"$f":"INDEX(labels!$A$233:$C$233,1,MATCH(PP_Language,labels!$A$1:$C$1,0))","v":"Policy of impairment of investment properties"}]
[null,{"$f":"INDEX(labels!$A$234:$C$234,1,MATCH(PP_Language,labels!$A$1:$C$1,0))","v":"Policy of real estate in development"}]
[null,{"$f":"INDEX(labels!$A$235:$C$235,1,MATCH(PP_Language,labels!$A$1:$C$1,0))","v":"Policy of financial assets"}]
[null,{"$f":"INDEX(labels!$A$236:$C$236,1,MATCH(PP_Language,labels!$A$1:$C$1,0))","v":"Policy of impairment of financial assets"}]
[null,{"$f":"INDEX(labels!$A$237:$C$237,1,MATCH(PP_Language,labels!$A$1:$C$1,0))","v":"Policy of reversal of impairment of financial assets"}]
[null,{"$f":"INDEX(labels!$A$238:$C$238,1,MATCH(PP_Language,labels!$A$1:$C$1,0))","v":"Policy of shares, certificates of shares and other types of participating interests in group companies"}]
[null,{"$f":"INDEX(labels!$A$239:$C$239,1,MATCH(PP_Language,labels!$A$1:$C$1,0))","v":"Policy of investments in participating interests in other affiliated companies"}]
[null,{"$f":"INDEX(labels!$A$240:$C$240,1,MATCH(PP_Language,labels!$A$1:$C$1,0))","v":"Policy of receivables from group companies"}]
[null,{"$f":"INDEX(labels!$A$241:$C$241,1,MATCH(PP_Language,labels!$A$1:$C$1,0))","v":"Policy of receivables from other affiliated companies"}]
[null,{"$f":"INDEX(labels!$A$242:$C$242,1,MATCH(PP_Language,labels!$A$1:$C$1,0))","v":"Policy of other investments in participating interests"}]
[null,{"$f":"INDEX(labels!$A$243:$C$243,1,MATCH(PP_Language,labels!$A$1:$C$1,0))","v":"Policy of receivables from other legal entities and companies with a participating interest in the legal entity or from participating interests of the legal entity"}]
[null,{"$f":"INDEX(labels!$A$244:$C$244,1,MATCH(PP_Language,labels!$A$1:$C$1,0))","v":"Policy of receivables from loans and advances to participants or registered shareholders"}]
[null,{"$f":"INDEX(labels!$A$245:$C$245,1,MATCH(PP_Language,labels!$A$1:$C$1,0))","v":"Policy of other securities"}]
[null,{"$f":"INDEX(labels!$A$246:$C$246,1,MATCH(PP_Language,labels!$A$1:$C$1,0))","v":"Policy of other receivables"}]
[null,{"$f":"INDEX(labels!$A$247:$C$247,1,MATCH(PP_Language,labels!$A$1:$C$1,0))","v":"Policy of deferred tax assets"}]
[null,{"$f":"INDEX(labels!$A$248:$C$248,1,MATCH(PP_Language,labels!$A$1:$C$1,0))","v":"Policy of other financial assets"}]
[null,{"$f":"INDEX(labels!$A$249:$C$249,1,MATCH(PP_Language,labels!$A$1:$C$1,0))","v":"Policy of non-current assets"}]
[null,{"$f":"INDEX(labels!$A$250:$C$250,1,MATCH(PP_Language,labels!$A$1:$C$1,0))","v":"Policy of impairment of non-current assets"}]
[null,{"$f":"INDEX(labels!$A$251:$C$251,1,MATCH(PP_Language,labels!$A$1:$C$1,0))","v":"Policy of reversal of impairment of non-current assets"}]
[null,{"$f":"INDEX(labels!$A$252:$C$252,1,MATCH(PP_Language,labels!$A$1:$C$1,0))","v":"Policy of changes in value of non-current securities and investments in participating interests (debit)"}]
[null,{"$f":"INDEX(labels!$A$253:$C$253,1,MATCH(PP_Language,labels!$A$1:$C$1,0))","v":"Policy of inventories"}]
[null,{"$f":"INDEX(labels!$A$254:$C$254,1,MATCH(PP_Language,labels!$A$1:$C$1,0))","v":"Policy of the realisable value of inventories"}]
[null,{"$f":"INDEX(labels!$A$255:$C$255,1,MATCH(PP_Language,labels!$A$1:$C$1,0))","v":"Policy of raw materials and consumables"}]
[null,{"$f":"INDEX(labels!$A$256:$C$256,1,MATCH(PP_Language,labels!$A$1:$C$1,0))","v":"Policy of work in progress"}]
[null,{"$f":"INDEX(labels!$A$257:$C$257,1,MATCH(PP_Language,labels!$A$1:$C$1,0))","v":"Policy of finished and trade goods"}]
[null,{"$f":"INDEX(labels!$A$258:$C$258,1,MATCH(PP_Language,labels!$A$1:$C$1,0))","v":"Policy of prepayments of inventories"}]
[null,{"$f":"INDEX(labels!$A$259:$C$259,1,MATCH(PP_Language,labels!$A$1:$C$1,0))","v":"Basis of the net realizable value of agricultural stocks"}]
[null,{"$f":"INDEX(labels!$A$260:$C$260,1,MATCH(PP_Language,labels!$A$1:$C$1,0))","v":"Policy of construction contracts"}]
[null,{"$f":"INDEX(labels!$A$261:$C$261,1,MATCH(PP_Language,labels!$A$1:$C$1,0))","v":"Policy of receivables"}]
[null,{"$f":"INDEX(labels!$A$262:$C$262,1,MATCH(PP_Language,labels!$A$1:$C$1,0))","v":"Policy of trade receivables"}]
[null,{"$f":"INDEX(labels!$A$263:$C$263,1,MATCH(PP_Language,labels!$A$1:$C$1,0))","v":"Policy of called-up contributions for issued share capital"}]
[null,{"$f":"INDEX(labels!$A$264:$C$264,1,MATCH(PP_Language,labels!$A$1:$C$1,0))","v":"Policy of pension receivables"}]
[null,{"$f":"INDEX(labels!$A$265:$C$265,1,MATCH(PP_Language,labels!$A$1:$C$1,0))","v":"Policy of tax receivables"}]
[null,{"$f":"INDEX(labels!$A$266:$C$266,1,MATCH(PP_Language,labels!$A$1:$C$1,0))","v":"Policy of prepayments and accrued income"}]
[null,{"$f":"INDEX(labels!$A$267:$C$267,1,MATCH(PP_Language,labels!$A$1:$C$1,0))","v":"Policy of current securities"}]
[null,{"$f":"INDEX(labels!$A$268:$C$268,1,MATCH(PP_Language,labels!$A$1:$C$1,0))","v":"Policy of cash and cash equivalents"}]
[null,{"$f":"INDEX(labels!$A$269:$C$269,1,MATCH(PP_Language,labels!$A$1:$C$1,0))","v":"Policy of current assets"}]
[null,{"$f":"INDEX(labels!$A$270:$C$270,1,MATCH(PP_Language,labels!$A$1:$C$1,0))","v":"Policy of equity"}]
[null,{"$f":"INDEX(labels!$A$271:$C$271,1,MATCH(PP_Language,labels!$A$1:$C$1,0))","v":"Policy of share capital paid called up"}]
[null,{"$f":"INDEX(labels!$A$272:$C$272,1,MATCH(PP_Language,labels!$A$1:$C$1,0))","v":"Policy of share premium"}]
[null,{"$f":"INDEX(labels!$A$273:$C$273,1,MATCH(PP_Language,labels!$A$1:$C$1,0))","v":"Policy of revaluation reserves"}]
[null,{"$f":"INDEX(labels!$A$274:$C$274,1,MATCH(PP_Language,labels!$A$1:$C$1,0))","v":"Policy of other legal reserves, distinguished by their nature"}]
[null,{"$f":"INDEX(labels!$A$275:$C$275,1,MATCH(PP_Language,labels!$A$1:$C$1,0))","v":"Policy of statutory reserves"}]
[null,{"$f":"INDEX(labels!$A$276:$C$276,1,MATCH(PP_Language,labels!$A$1:$C$1,0))","v":"Policy of fiscal reinvestment reserve"}]
[null,{"$f":"INDEX(labels!$A$277:$C$277,1,MATCH(PP_Language,labels!$A$1:$C$1,0))","v":"Policy of other reserves"}]
[null,{"$f":"INDEX(labels!$A$278:$C$278,1,MATCH(PP_Language,labels!$A$1:$C$1,0))","v":"Policy of other fiscal reserves"}]
[null,{"$f":"INDEX(labels!$A$279:$C$279,1,MATCH(PP_Language,labels!$A$1:$C$1,0))","v":"Policy of result after taxes for the year"}]
[null,{"$f":"INDEX(labels!$A$280:$C$280,1,MATCH(PP_Language,labels!$A$1:$C$1,0))","v":"Policy of undistributed profit"}]
[null,{"$f":"INDEX(labels!$A$281:$C$281,1,MATCH(PP_Language,labels!$A$1:$C$1,0))","v":"Policy of provisions"}]
[null,{"$f":"INDEX(labels!$A$282:$C$282,1,MATCH(PP_Language,labels!$A$1:$C$1,0))","v":"Policy of provision for repair costs"}]
[null,{"$f":"INDEX(labels!$A$283:$C$283,1,MATCH(PP_Language,labels!$A$1:$C$1,0))","v":"Policy of provision for tax liabilities"}]
[null,{"$f":"INDEX(labels!$A$284:$C$284,1,MATCH(PP_Language,labels!$A$1:$C$1,0))","v":"Policy of provisions for pension obligations"}]
[null,{"$f":"INDEX(labels!$A$285:$C$285,1,MATCH(PP_Language,labels!$A$1:$C$1,0))","v":"Policy of environmental provision"}]
[null,{"$f":"INDEX(labels!$A$286:$C$286,1,MATCH(PP_Language,labels!$A$1:$C$1,0))","v":"Policy of provision for legal proceedings"}]
[null,{"$f":"INDEX(labels!$A$287:$C$287,1,MATCH(PP_Language,labels!$A$1:$C$1,0))","v":"Policy of provision for major maintenance"}]
[null,{"$f":"INDEX(labels!$A$288:$C$288,1,MATCH(PP_Language,labels!$A$1:$C$1,0))","v":"Policy of provision for disposal obligations"}]
[null,{"$f":"INDEX(labels!$A$289:$C$289,1,MATCH(PP_Language,labels!$A$1:$C$1,0))","v":"Policy of provision for onerous contracts"}]
[null,{"$f":"INDEX(labels!$A$290:$C$290,1,MATCH(PP_Language,labels!$A$1:$C$1,0))","v":"Policy of restructuring provision"}]
[null,{"$f":"INDEX(labels!$A$291:$C$291,1,MATCH(PP_Language,labels!$A$1:$C$1,0))","v":"Policy of provision relating to participating interest"}]
[null,{"$f":"INDEX(labels!$A$292:$C$292,1,MATCH(PP_Language,labels!$A$1:$C$1,0))","v":"Policy of deferred tax liabilities"}]
[null,{"$f":"INDEX(labels!$A$293:$C$293,1,MATCH(PP_Language,labels!$A$1:$C$1,0))","v":"Policy of warranty provision"}]
[null,{"$f":"INDEX(labels!$A$294:$C$294,1,MATCH(PP_Language,labels!$A$1:$C$1,0))","v":"Policy of provision for jubilee benefits"}]
[null,{"$f":"INDEX(labels!$A$295:$C$295,1,MATCH(PP_Language,labels!$A$1:$C$1,0))","v":"Policy of provision for insurance of disability risks"}]
[null,{"$f":"INDEX(labels!$A$296:$C$296,1,MATCH(PP_Language,labels!$A$1:$C$1,0))","v":"Policy of provision for obligations due to illness or disability"}]
[null,{"$f":"INDEX(labels!$A$297:$C$297,1,MATCH(PP_Language,labels!$A$1:$C$1,0))","v":"Policy of provision of employee benefits"}]
[null,{"$f":"INDEX(labels!$A$298:$C$298,1,MATCH(PP_Language,labels!$A$1:$C$1,0))","v":"Policy of other provisions"}]
[null,{"$f":"INDEX(labels!$A$299:$C$299,1,MATCH(PP_Language,labels!$A$1:$C$1,0))","v":"Policy of non-current liabilities"}]
[null,{"$f":"INDEX(labels!$A$300:$C$300,1,MATCH(PP_Language,labels!$A$1:$C$1,0))","v":"Policy of subordinated liabilities"}]
[null,{"$f":"INDEX(labels!$A$301:$C$301,1,MATCH(PP_Language,labels!$A$1:$C$1,0))","v":"Policy of convertible borrowings"}]
[null,{"$f":"INDEX(labels!$A$302:$C$302,1,MATCH(PP_Language,labels!$A$1:$C$1,0))","v":"Policy of debentures, mortgage bonds and other loans"}]
[null,{"$f":"INDEX(labels!$A$303:$C$303,1,MATCH(PP_Language,labels!$A$1:$C$1,0))","v":"Policy of finance lease liabilities"}]
[null,{"$f":"INDEX(labels!$A$304:$C$304,1,MATCH(PP_Language,labels!$A$1:$C$1,0))","v":"Policy of payables to banks"}]
[null,{"$f":"INDEX(labels!$A$305:$C$305,1,MATCH(PP_Language,labels!$A$1:$C$1,0))","v":"Policy of advances received on orders not yet deducted for asset items"}]
[null,{"$f":"INDEX(labels!$A$306:$C$306,1,MATCH(PP_Language,labels!$A$1:$C$1,0))","v":"Policy of trade payables"}]
[null,{"$f":"INDEX(labels!$A$307:$C$307,1,MATCH(PP_Language,labels!$A$1:$C$1,0))","v":"Policy of cheques and bills of exchange payables"}]
[null,{"$f":"INDEX(labels!$A$308:$C$308,1,MATCH(PP_Language,labels!$A$1:$C$1,0))","v":"Policy of payables to group companies"}]
[null,{"$f":"INDEX(labels!$A$309:$C$309,1,MATCH(PP_Language,labels!$A$1:$C$1,0))","v":"Policy of payables to other affiliated companies"}]
[null,{"$f":"INDEX(labels!$A$310:$C$310,1,MATCH(PP_Language,labels!$A$1:$C$1,0))","v":"Policy of payables to other legal entities and companies with a participating interest in the legal entity or to participating interests of the legal entity"}]
[null,{"$f":"INDEX(labels!$A$311:$C$311,1,MATCH(PP_Language,labels!$A$1:$C$1,0))","v":"Policy of payables relating to income taxes"}]
[null,{"$f":"INDEX(labels!$A$312:$C$312,1,MATCH(PP_Language,labels!$A$1:$C$1,0))","v":"Policy of payables relating to taxes and social security contributions"}]
[null,{"$f":"INDEX(labels!$A$313:$C$313,1,MATCH(PP_Language,labels!$A$1:$C$1,0))","v":"Policy of pension related payables"}]
[null,{"$f":"INDEX(labels!$A$314:$C$314,1,MATCH(PP_Language,labels!$A$1:$C$1,0))","v":"Policy of old-age obligation"}]
[null,{"$f":"INDEX(labels!$A$315:$C$315,1,MATCH(PP_Language,labels!$A$1:$C$1,0))","v":"Policy of tax payables"}]
[null,{"$f":"INDEX(labels!$A$316:$C$316,1,MATCH(PP_Language,labels!$A$1:$C$1,0))","v":"Policy of negative goodwill"}]
[null,{"$f":"INDEX(labels!$A$317:$C$317,1,MATCH(PP_Language,labels!$A$1:$C$1,0))","v":"Policy of other payables"}]
[null,{"$f":"INDEX(labels!$A$318:$C$318,1,MATCH(PP_Language,labels!$A$1:$C$1,0))","v":"Policy of accruals and deferred income"}]
[null,{"$f":"INDEX(labels!$A$319:$C$319,1,MATCH(PP_Language,labels!$A$1:$C$1,0))","v":"Policy of current liabilities"}]
[null,{"$f":"INDEX(labels!$A$320:$C$320,1,MATCH(PP_Language,labels!$A$1:$C$1,0))","v":"Policy of repayment obligations of non-current borrowings"}]
[null,{"$f":"INDEX(labels!$A$321:$C$321,1,MATCH(PP_Language,labels!$A$1:$C$1,0))","v":"Policy of debts due to vacation days"}]
[null,{"$f":"INDEX(labels!$A$322:$C$322,1,MATCH(PP_Language,labels!$A$1:$C$1,0))","v":"Policy of debts due to holiday pay"}]
[null,{"$f":"INDEX(labels!$A$323:$C$323,1,MATCH(PP_Language,labels!$A$1:$C$1,0))","v":"Policy of dividend to be distributed to holders of preference shares"}]
[null,null,null,null,null,null,null,null,null,null,null,null,null,null,null,null,null,null,null,null,null,null,null,null,null,{"$f":"\"//notes-accounting-principles-assets-liabilities label {\"&COLUMN($B$361)&\"}\"","v":"//notes-accounting-principles-assets-liabilities label {2}"},null,{"$f":"\"//notes-accounting-principles-assets-liabilities \" & BasisOfPreparationAxis & \" \"  & INDEX(labels!$A$103:$C$103,1,MATCH(PP_Language,labels!$A$1:$C$1,0)) &  \" \"  &  \" {\"&COLUMN($D$361)&\"}\"","v":"//notes-accounting-principles-assets-liabilities Commercial Separate  {4}"}]
[null,{"$f":"INDEX(labels!$A$324:$C$324,1,MATCH(PP_Language,labels!$A$1:$C$1,0))","v":"Notes to the financial statements - Accounting principles for the determination of the result"}]
[null,null,null,null,null,null,null,null,null,null,null,null,null,null,null,null,null,null,null,null,null,null,null,null,null,{"$f":"\"/notes-accounting-principles-result label {\"&COLUMN($B$363)&\"}\"","v":"/notes-accounting-principles-result label {2}"},null,{"$f":"\"/notes-accounting-principles-result \" & BasisOfPreparationAxis & \" \"  & INDEX(labels!$A$103:$C$103,1,MATCH(PP_Language,labels!$A$1:$C$1,0)) &  \" \"  &  \" {\"&COLUMN($D$363)&\"}\"","v":"/notes-accounting-principles-result Commercial Separate  {4}"}]
[null,{"$f":"INDEX(labels!$A$325:$C$325,1,MATCH(PP_Language,labels!$A$1:$C$1,0))","v":"Accounting principles for determining the result"}]
[null,{"$f":"INDEX(labels!$A$326:$C$326,1,MATCH(PP_Language,labels!$A$1:$C$1,0))","v":"Policy of revenue recognition"}]
[null,{"$f":"INDEX(labels!$A$327:$C$327,1,MATCH(PP_Language,labels!$A$1:$C$1,0))","v":"Policy of gross operating result"}]
[null,{"$f":"INDEX(labels!$A$328:$C$328,1,MATCH(PP_Language,labels!$A$1:$C$1,0))","v":"Policy of selling expenses"}]
[null,{"$f":"INDEX(labels!$A$329:$C$329,1,MATCH(PP_Language,labels!$A$1:$C$1,0))","v":"Policy of general and administrative expenses"}]
[null,{"$f":"INDEX(labels!$A$330:$C$330,1,MATCH(PP_Language,labels!$A$1:$C$1,0))","v":"Policy of sum of expenses"}]
[null,{"$f":"INDEX(labels!$A$331:$C$331,1,MATCH(PP_Language,labels!$A$1:$C$1,0))","v":"Policy of government subsidies"}]
[null,{"$f":"INDEX(labels!$A$332:$C$332,1,MATCH(PP_Language,labels!$A$1:$C$1,0))","v":"Policy of expenses of employee benefits"}]
[null,{"$f":"INDEX(labels!$A$333:$C$333,1,MATCH(PP_Language,labels!$A$1:$C$1,0))","v":"Policy of wages"}]
[null,{"$f":"INDEX(labels!$A$334:$C$334,1,MATCH(PP_Language,labels!$A$1:$C$1,0))","v":"Policy of social security contributions"}]
[null,{"$f":"INDEX(labels!$A$335:$C$335,1,MATCH(PP_Language,labels!$A$1:$C$1,0))","v":"Applied policy of pension costs"}]
[null,{"$f":"INDEX(labels!$A$336:$C$336,1,MATCH(PP_Language,labels!$A$1:$C$1,0))","v":"Policy of other expenses of employee benefits"}]
[null,{"$f":"INDEX(labels!$A$337:$C$337,1,MATCH(PP_Language,labels!$A$1:$C$1,0))","v":"Basis for processing the compensation received under the NOW scheme"}]
[null,{"$f":"INDEX(labels!$A$338:$C$338,1,MATCH(PP_Language,labels!$A$1:$C$1,0))","v":"Policy of amortisation of intangible assets and depreciation of property, plant and equipment"}]
[null,{"$f":"INDEX(labels!$A$339:$C$339,1,MATCH(PP_Language,labels!$A$1:$C$1,0))","v":"Policy of amortisation of intangible assets"}]
[null,{"$f":"INDEX(labels!$A$340:$C$340,1,MATCH(PP_Language,labels!$A$1:$C$1,0))","v":"Policy of depreciation of property, plant and equipment"}]
[null,{"$f":"INDEX(labels!$A$341:$C$341,1,MATCH(PP_Language,labels!$A$1:$C$1,0))","v":"Policy of changes in the value of intangible asPolicy of sets and property, plant and equipment"}]
[null,{"$f":"INDEX(labels!$A$342:$C$342,1,MATCH(PP_Language,labels!$A$1:$C$1,0))","v":"Policy of changes in the value of intangible assets"}]
[null,{"$f":"INDEX(labels!$A$343:$C$343,1,MATCH(PP_Language,labels!$A$1:$C$1,0))","v":"Policy of changes in the fair value of real estate investments"}]
[null,{"$f":"INDEX(labels!$A$344:$C$344,1,MATCH(PP_Language,labels!$A$1:$C$1,0))","v":"Policy of changes in the value of financial assets and of securities that are part of the current assets"}]
[null,{"$f":"INDEX(labels!$A$345:$C$345,1,MATCH(PP_Language,labels!$A$1:$C$1,0))","v":"Policy of decrease in the value of current assets, provided they surpass the regular decrease in value"}]
[null,{"$f":"INDEX(labels!$A$346:$C$346,1,MATCH(PP_Language,labels!$A$1:$C$1,0))","v":"Policy of other operating expenses"}]
[null,{"$f":"INDEX(labels!$A$347:$C$347,1,MATCH(PP_Language,labels!$A$1:$C$1,0))","v":"Policy of operating result"}]
[null,{"$f":"INDEX(labels!$A$348:$C$348,1,MATCH(PP_Language,labels!$A$1:$C$1,0))","v":"Policy of released from revaluation reserve"}]
[null,{"$f":"INDEX(labels!$A$349:$C$349,1,MATCH(PP_Language,labels!$A$1:$C$1,0))","v":"Policy of financial income and expenses"}]
[null,{"$f":"INDEX(labels!$A$350:$C$350,1,MATCH(PP_Language,labels!$A$1:$C$1,0))","v":"Policy of income of securities and receivables, that are part of non-current assets"}]
[null,{"$f":"INDEX(labels!$A$351:$C$351,1,MATCH(PP_Language,labels!$A$1:$C$1,0))","v":"Policy of other interest income and related income"}]
[null,{"$f":"INDEX(labels!$A$352:$C$352,1,MATCH(PP_Language,labels!$A$1:$C$1,0))","v":"Policy of interest expenses and related expenses"}]
[null,{"$f":"INDEX(labels!$A$353:$C$353,1,MATCH(PP_Language,labels!$A$1:$C$1,0))","v":"Policy of result before tax"}]
[null,{"$f":"INDEX(labels!$A$354:$C$354,1,MATCH(PP_Language,labels!$A$1:$C$1,0))","v":"Policy of income tax expense"}]
[null,{"$f":"INDEX(labels!$A$355:$C$355,1,MATCH(PP_Language,labels!$A$1:$C$1,0))","v":"Policy of share in results of participating interests"}]
[null,{"$f":"INDEX(labels!$A$356:$C$356,1,MATCH(PP_Language,labels!$A$1:$C$1,0))","v":"Policy of result after tax"}]
[null,null,null,null,null,null,null,null,null,null,null,null,null,null,null,null,null,null,null,null,null,null,null,null,null,{"$f":"\"//notes-accounting-principles-result label {\"&COLUMN($B$396)&\"}\"","v":"//notes-accounting-principles-result label {2}"},null,{"$f":"\"//notes-accounting-principles-result \" & BasisOfPreparationAxis & \" \"  & INDEX(labels!$A$103:$C$103,1,MATCH(PP_Language,labels!$A$1:$C$1,0)) &  \" \"  &  \" {\"&COLUMN($D$396)&\"}\"","v":"//notes-accounting-principles-result Commercial Separate  {4}"}]
[null,{"$f":"INDEX(labels!$A$56:$C$56,1,MATCH(PP_Language,labels!$A$1:$C$1,0))","v":"Balance sheet"}]
[null,{"$f":"INDEX(labels!$A$57:$C$57,1,MATCH(PP_Language,labels!$A$1:$C$1,0))","v":"Intangible assets"}]
[null,{"$f":"INDEX(labels!$A$357:$C$357,1,MATCH(PP_Language,labels!$A$1:$C$1,0))","v":"Notes to the financial statements - Intangible assets: Breakdown"}]
[]
[null,null,null,{"$f":"INDEX(labels!$A$102:$C$102,1,MATCH(PP_Language,labels!$A$1:$C$1,0))","v":"Current"},null,{"$f":"INDEX(labels!$A$104:$C$104,1,MATCH(PP_Language,labels!$A$1:$C$1,0))","v":"Previous"},null,null,null,null,null,null,null,null,null,null,null,null,null,null,null,null,null,null,null,{"$f":"\"/notes-intangible-assets-breakdown label {\"&COLUMN($B$401)&\"}\"","v":"/notes-intangible-assets-breakdown label {2}"},null,{"$f":"\"/notes-intangible-assets-breakdown \" & BasisOfPreparationAxis & \" \"  & INDEX(labels!$A$103:$C$103,1,MATCH(PP_Language,labels!$A$1:$C$1,0)) &  \" \"  & INDEX(labels!$A$102:$C$102,1,MATCH(PP_Language,labels!$A$1:$C$1,0)) &  \" {\"&COLUMN($D$401)&\"}\"","v":"/notes-intangible-assets-breakdown Commercial Separate Current {4}"},null,{"$f":"\"/notes-intangible-assets-breakdown \" & BasisOfPreparationAxis & \" \"  & INDEX(labels!$A$103:$C$103,1,MATCH(PP_Language,labels!$A$1:$C$1,0)) &  \" \"  & INDEX(labels!$A$104:$C$104,1,MATCH(PP_Language,labels!$A$1:$C$1,0)) &  \" {\"&COLUMN($F$401)&\"}\"","v":"/notes-intangible-assets-breakdown Commercial Separate Previous {6}"}]
[null,{"$f":"INDEX(labels!$A$358:$C$358,1,MATCH(PP_Language,labels!$A$1:$C$1,0))","v":"Costs relating to the incorporation and issuance of shares"}]
[null,{"$f":"INDEX(labels!$A$359:$C$359,1,MATCH(PP_Language,labels!$A$1:$C$1,0))","v":"Other intangible assets"}]
[]
[null,{"$f":"INDEX(labels!$A$360:$C$360,1,MATCH(PP_Language,labels!$A$1:$C$1,0))","v":"Total of intangible assets"},null,{"$f":"IF(OR(NOT(0=0),NOT(AND(Stamdata!$D$402=\"\",Stamdata!$D$403=\"\"))), - 0+ SUM(Stamdata!$D$402,Stamdata!$D$403),\"\")","v":""},null,{"$f":"IF(OR(NOT(0=0),NOT(AND(Stamdata!$F$402=\"\",Stamdata!$F$403=\"\"))), - 0+ SUM(Stamdata!$F$402,Stamdata!$F$403),\"\")","v":""}]
[null,null,null,null,null,null,null,null,null,null,null,null,null,null,null,null,null,null,null,null,null,null,null,null,null,{"$f":"\"//notes-intangible-assets-breakdown label {\"&COLUMN($B$406)&\"}\"","v":"//notes-intangible-assets-breakdown label {2}"},null,{"$f":"\"//notes-intangible-assets-breakdown \" & BasisOfPreparationAxis & \" \"  & INDEX(labels!$A$103:$C$103,1,MATCH(PP_Language,labels!$A$1:$C$1,0)) &  \" \"  & INDEX(labels!$A$102:$C$102,1,MATCH(PP_Language,labels!$A$1:$C$1,0)) &  \" {\"&COLUMN($D$406)&\"}\"","v":"//notes-intangible-assets-breakdown Commercial Separate Current {4}"},null,{"$f":"\"//notes-intangible-assets-breakdown \" & BasisOfPreparationAxis & \" \"  & INDEX(labels!$A$103:$C$103,1,MATCH(PP_Language,labels!$A$1:$C$1,0)) &  \" \"  & INDEX(labels!$A$104:$C$104,1,MATCH(PP_Language,labels!$A$1:$C$1,0)) &  \" {\"&COLUMN($F$406)&\"}\"","v":"//notes-intangible-assets-breakdown Commercial Separate Previous {6}"}]
[null,{"$f":"INDEX(labels!$A$361:$C$361,1,MATCH(PP_Language,labels!$A$1:$C$1,0))","v":"Notes to the financial statements - Intangible assets"}]
[null,null,null,null,null,null,null,null,null,null,null,null,null,null,null,null,null,null,null,null,null,null,null,null,null,{"$f":"\"/notes-intangible-assets label {\"&COLUMN($B$408)&\"}\"","v":"/notes-intangible-assets label {2}"},null,{"$f":"\"/notes-intangible-assets \" & BasisOfPreparationAxis & \" \"  & INDEX(labels!$A$103:$C$103,1,MATCH(PP_Language,labels!$A$1:$C$1,0)) &  \" \"  &  \" {\"&COLUMN($D$408)&\"}\"","v":"/notes-intangible-assets Commercial Separate  {4}"}]
[null,{"$f":"INDEX(labels!$A$362:$C$362,1,MATCH(PP_Language,labels!$A$1:$C$1,0))","v":"Disclosure of intangible assets"}]
[null,{"$f":"INDEX(labels!$A$363:$C$363,1,MATCH(PP_Language,labels!$A$1:$C$1,0))","v":"Disclosure of the current value of intangible assets"}]
[null,{"$f":"INDEX(labels!$A$364:$C$364,1,MATCH(PP_Language,labels!$A$1:$C$1,0))","v":"Description of intangible assets with limited ownership"}]
[null,{"$f":"INDEX(labels!$A$365:$C$365,1,MATCH(PP_Language,labels!$A$1:$C$1,0))","v":"Description of intangible assets put up as collateral for debts"}]
[null,{"$f":"INDEX(labels!$A$366:$C$366,1,MATCH(PP_Language,labels!$A$1:$C$1,0))","v":"Description of the impairment of intangible assets"}]
[null,{"$f":"INDEX(labels!$A$367:$C$367,1,MATCH(PP_Language,labels!$A$1:$C$1,0))","v":"Disclosure of costs of goodwill acquired from third party"}]
[null,{"$f":"INDEX(labels!$A$368:$C$368,1,MATCH(PP_Language,labels!$A$1:$C$1,0))","v":"Description of the commitments relating to acquisitions of intangible assets"}]
[null,{"$f":"INDEX(labels!$A$369:$C$369,1,MATCH(PP_Language,labels!$A$1:$C$1,0))","v":"Description of the capitalised interest on intangible assets during the period"}]
[null,{"$f":"INDEX(labels!$A$370:$C$370,1,MATCH(PP_Language,labels!$A$1:$C$1,0))","v":"Description of the reason and factors that played a significant part in determining that the amortisation term of intangible assets exceeds twenty years"}]
[null,{"$f":"INDEX(labels!$A$371:$C$371,1,MATCH(PP_Language,labels!$A$1:$C$1,0))","v":"Description of an individual intangible asset of importance"}]
[null,null,null,null,null,null,null,null,null,null,null,null,null,null,null,null,null,null,null,null,null,null,null,null,null,{"$f":"\"//notes-intangible-assets label {\"&COLUMN($B$419)&\"}\"","v":"//notes-intangible-assets label {2}"},null,{"$f":"\"//notes-intangible-assets \" & BasisOfPreparationAxis & \" \"  & INDEX(labels!$A$103:$C$103,1,MATCH(PP_Language,labels!$A$1:$C$1,0)) &  \" \"  &  \" {\"&COLUMN($D$419)&\"}\"","v":"//notes-intangible-assets Commercial Separate  {4}"}]
[null,{"$f":"INDEX(labels!$A$372:$C$372,1,MATCH(PP_Language,labels!$A$1:$C$1,0))","v":"Notes to the financial statements - Intangible assets: Other amounts: Breakdown"}]
[]
[null,null,null,{"$f":"INDEX(labels!$A$102:$C$102,1,MATCH(PP_Language,labels!$A$1:$C$1,0))","v":"Current"},null,{"$f":"INDEX(labels!$A$104:$C$104,1,MATCH(PP_Language,labels!$A$1:$C$1,0))","v":"Previous"},null,null,null,null,null,null,null,null,null,null,null,null,null,null,null,null,null,null,null,{"$f":"\"/notes-intangible-assets-other-amounts-breakdown label {\"&COLUMN($B$422)&\"}\"","v":"/notes-intangible-assets-other-amounts-breakdown label {2}"},null,{"$f":"\"/notes-intangible-assets-other-amounts-breakdown \" & BasisOfPreparationAxis & \" \"  & INDEX(labels!$A$103:$C$103,1,MATCH(PP_Language,labels!$A$1:$C$1,0)) &  \" \"  & INDEX(labels!$A$102:$C$102,1,MATCH(PP_Language,labels!$A$1:$C$1,0)) &  \" {\"&COLUMN($D$422)&\"}\"","v":"/notes-intangible-assets-other-amounts-breakdown Commercial Separate Current {4}"},null,{"$f":"\"/notes-intangible-assets-other-amounts-breakdown \" & BasisOfPreparationAxis & \" \"  & INDEX(labels!$A$103:$C$103,1,MATCH(PP_Language,labels!$A$1:$C$1,0)) &  \" \"  & INDEX(labels!$A$104:$C$104,1,MATCH(PP_Language,labels!$A$1:$C$1,0)) &  \" {\"&COLUMN($F$422)&\"}\"","v":"/notes-intangible-assets-other-amounts-breakdown Commercial Separate Previous {6}"}]
[null,{"$f":"INDEX(labels!$A$373:$C$373,1,MATCH(PP_Language,labels!$A$1:$C$1,0))","v":"Intangible assets with limited ownership"}]
[null,{"$f":"INDEX(labels!$A$374:$C$374,1,MATCH(PP_Language,labels!$A$1:$C$1,0))","v":"Intangible assets put up as collateral for debts"}]
[null,null,null,null,null,null,null,null,null,null,null,null,null,null,null,null,null,null,null,null,null,null,null,null,null,{"$f":"\"//notes-intangible-assets-other-amounts-breakdown label {\"&COLUMN($B$425)&\"}\"","v":"//notes-intangible-assets-other-amounts-breakdown label {2}"},null,{"$f":"\"//notes-intangible-assets-other-amounts-breakdown \" & BasisOfPreparationAxis & \" \"  & INDEX(labels!$A$103:$C$103,1,MATCH(PP_Language,labels!$A$1:$C$1,0)) &  \" \"  & INDEX(labels!$A$102:$C$102,1,MATCH(PP_Language,labels!$A$1:$C$1,0)) &  \" {\"&COLUMN($D$425)&\"}\"","v":"//notes-intangible-assets-other-amounts-breakdown Commercial Separate Current {4}"},null,{"$f":"\"//notes-intangible-assets-other-amounts-breakdown \" & BasisOfPreparationAxis & \" \"  & INDEX(labels!$A$103:$C$103,1,MATCH(PP_Language,labels!$A$1:$C$1,0)) &  \" \"  & INDEX(labels!$A$104:$C$104,1,MATCH(PP_Language,labels!$A$1:$C$1,0)) &  \" {\"&COLUMN($F$425)&\"}\"","v":"//notes-intangible-assets-other-amounts-breakdown Commercial Separate Previous {6}"}]
[null,{"$f":"INDEX(labels!$A$375:$C$375,1,MATCH(PP_Language,labels!$A$1:$C$1,0))","v":"Notes to the financial statements - Intangible assets: Accumulated revaluations"}]
[]
[null,null,null,{"$f":"INDEX(labels!$A$102:$C$102,1,MATCH(PP_Language,labels!$A$1:$C$1,0))","v":"Current"},null,{"$f":"INDEX(labels!$A$104:$C$104,1,MATCH(PP_Language,labels!$A$1:$C$1,0))","v":"Previous"},null,null,null,null,null,null,null,null,null,null,null,null,null,null,null,null,null,null,null,{"$f":"\"/notes-intangible-assets-accumulated-revaluations label {\"&COLUMN($B$428)&\"}\"","v":"/notes-intangible-assets-accumulated-revaluations label {2}"},null,{"$f":"\"/notes-intangible-assets-accumulated-revaluations \" & BasisOfPreparationAxis & \" \"  & INDEX(labels!$A$103:$C$103,1,MATCH(PP_Language,labels!$A$1:$C$1,0)) &  \" \"  & INDEX(labels!$A$102:$C$102,1,MATCH(PP_Language,labels!$A$1:$C$1,0)) &  \" {\"&COLUMN($D$428)&\"}\"","v":"/notes-intangible-assets-accumulated-revaluations Commercial Separate Current {4}"},null,{"$f":"\"/notes-intangible-assets-accumulated-revaluations \" & BasisOfPreparationAxis & \" \"  & INDEX(labels!$A$103:$C$103,1,MATCH(PP_Language,labels!$A$1:$C$1,0)) &  \" \"  & INDEX(labels!$A$104:$C$104,1,MATCH(PP_Language,labels!$A$1:$C$1,0)) &  \" {\"&COLUMN($F$428)&\"}\"","v":"/notes-intangible-assets-accumulated-revaluations Commercial Separate Previous {6}"}]
[null,{"$f":"INDEX(labels!$A$376:$C$376,1,MATCH(PP_Language,labels!$A$1:$C$1,0))","v":"Sum of the revaluations related to intangible assets"}]
[null,null,null,null,null,null,null,null,null,null,null,null,null,null,null,null,null,null,null,null,null,null,null,null,null,{"$f":"\"//notes-intangible-assets-accumulated-revaluations label {\"&COLUMN($B$430)&\"}\"","v":"//notes-intangible-assets-accumulated-revaluations label {2}"},null,{"$f":"\"//notes-intangible-assets-accumulated-revaluations \" & BasisOfPreparationAxis & \" \"  & INDEX(labels!$A$103:$C$103,1,MATCH(PP_Language,labels!$A$1:$C$1,0)) &  \" \"  & INDEX(labels!$A$102:$C$102,1,MATCH(PP_Language,labels!$A$1:$C$1,0)) &  \" {\"&COLUMN($D$430)&\"}\"","v":"//notes-intangible-assets-accumulated-revaluations Commercial Separate Current {4}"},null,{"$f":"\"//notes-intangible-assets-accumulated-revaluations \" & BasisOfPreparationAxis & \" \"  & INDEX(labels!$A$103:$C$103,1,MATCH(PP_Language,labels!$A$1:$C$1,0)) &  \" \"  & INDEX(labels!$A$104:$C$104,1,MATCH(PP_Language,labels!$A$1:$C$1,0)) &  \" {\"&COLUMN($F$430)&\"}\"","v":"//notes-intangible-assets-accumulated-revaluations Commercial Separate Previous {6}"}]
[null,{"$f":"INDEX(labels!$A$58:$C$58,1,MATCH(PP_Language,labels!$A$1:$C$1,0))","v":"Property, plant and equipment"}]
[null,{"$f":"INDEX(labels!$A$377:$C$377,1,MATCH(PP_Language,labels!$A$1:$C$1,0))","v":"Notes to the financial statements - Property, plant & equipment"}]
[null,null,null,null,null,null,null,null,null,null,null,null,null,null,null,null,null,null,null,null,null,null,null,null,null,{"$f":"\"/notes-property-plant-equipment label {\"&COLUMN($B$433)&\"}\"","v":"/notes-property-plant-equipment label {2}"},null,{"$f":"\"/notes-property-plant-equipment \" & BasisOfPreparationAxis & \" \"  & INDEX(labels!$A$103:$C$103,1,MATCH(PP_Language,labels!$A$1:$C$1,0)) &  \" \"  &  \" {\"&COLUMN($D$433)&\"}\"","v":"/notes-property-plant-equipment Commercial Separate  {4}"}]
[null,{"$f":"INDEX(labels!$A$378:$C$378,1,MATCH(PP_Language,labels!$A$1:$C$1,0))","v":"Disclosure of property, plant and equipment"}]
[null,{"$f":"INDEX(labels!$A$379:$C$379,1,MATCH(PP_Language,labels!$A$1:$C$1,0))","v":"Disclosure of the current value of property, plant and equipment"}]
[null,{"$f":"INDEX(labels!$A$380:$C$380,1,MATCH(PP_Language,labels!$A$1:$C$1,0))","v":"Description of property, plant and equipment of which the legal entity does not have legal ownership"}]
[null,{"$f":"INDEX(labels!$A$381:$C$381,1,MATCH(PP_Language,labels!$A$1:$C$1,0))","v":"Description of property, plant and equipment serving as collateral for commitments"}]
[null,{"$f":"INDEX(labels!$A$382:$C$382,1,MATCH(PP_Language,labels!$A$1:$C$1,0))","v":"Description of the impairment of property, plant and equipment"}]
[null,{"$f":"INDEX(labels!$A$383:$C$383,1,MATCH(PP_Language,labels!$A$1:$C$1,0))","v":"Description of the capitalised interest on property, plant and equipment during the period"}]
[null,{"$f":"INDEX(labels!$A$384:$C$384,1,MATCH(PP_Language,labels!$A$1:$C$1,0))","v":"Disclosure of finance lease of property, plant and equipment"}]
[null,{"$f":"INDEX(labels!$A$385:$C$385,1,MATCH(PP_Language,labels!$A$1:$C$1,0))","v":"Description of the nature and extent of other important movements of property, plant and equipment"}]
[null,{"$f":"INDEX(labels!$A$386:$C$386,1,MATCH(PP_Language,labels!$A$1:$C$1,0))","v":"Disclosure of property plant equipment of the deduction of the reinvestment reserve from the acquisition or production costs of an asset"}]
[null,{"$f":"INDEX(labels!$A$387:$C$387,1,MATCH(PP_Language,labels!$A$1:$C$1,0))","v":"Description of the application of the transitional provision regarding the change in accounting policy from current value to historical cost price"}]
[null,{"$f":"INDEX(labels!$A$388:$C$388,1,MATCH(PP_Language,labels!$A$1:$C$1,0))","v":"Description of the size of the unrealized revaluation regarding the change in accounting policy from current value to historical cost price"}]
[null,null,null,null,null,null,null,null,null,null,null,null,null,null,null,null,null,null,null,null,null,null,null,null,null,{"$f":"\"//notes-property-plant-equipment label {\"&COLUMN($B$445)&\"}\"","v":"//notes-property-plant-equipment label {2}"},null,{"$f":"\"//notes-property-plant-equipment \" & BasisOfPreparationAxis & \" \"  & INDEX(labels!$A$103:$C$103,1,MATCH(PP_Language,labels!$A$1:$C$1,0)) &  \" \"  &  \" {\"&COLUMN($D$445)&\"}\"","v":"//notes-property-plant-equipment Commercial Separate  {4}"}]
[null,{"$f":"INDEX(labels!$A$389:$C$389,1,MATCH(PP_Language,labels!$A$1:$C$1,0))","v":"Notes to the financial statements - Property, plant and equipment: Accumulated revaluations"}]
[]
[null,null,null,{"$f":"INDEX(labels!$A$102:$C$102,1,MATCH(PP_Language,labels!$A$1:$C$1,0))","v":"Current"},null,{"$f":"INDEX(labels!$A$104:$C$104,1,MATCH(PP_Language,labels!$A$1:$C$1,0))","v":"Previous"},null,null,null,null,null,null,null,null,null,null,null,null,null,null,null,null,null,null,null,{"$f":"\"/notes-property-plant-equipment-accumulated-revaluations label {\"&COLUMN($B$448)&\"}\"","v":"/notes-property-plant-equipment-accumulated-revaluations label {2}"},null,{"$f":"\"/notes-property-plant-equipment-accumulated-revaluations \" & BasisOfPreparationAxis & \" \"  & INDEX(labels!$A$103:$C$103,1,MATCH(PP_Language,labels!$A$1:$C$1,0)) &  \" \"  & INDEX(labels!$A$102:$C$102,1,MATCH(PP_Language,labels!$A$1:$C$1,0)) &  \" {\"&COLUMN($D$448)&\"}\"","v":"/notes-property-plant-equipment-accumulated-revaluations Commercial Separate Current {4}"},null,{"$f":"\"/notes-property-plant-equipment-accumulated-revaluations \" & BasisOfPreparationAxis & \" \"  & INDEX(labels!$A$103:$C$103,1,MATCH(PP_Language,labels!$A$1:$C$1,0)) &  \" \"  & INDEX(labels!$A$104:$C$104,1,MATCH(PP_Language,labels!$A$1:$C$1,0)) &  \" {\"&COLUMN($F$448)&\"}\"","v":"/notes-property-plant-equipment-accumulated-revaluations Commercial Separate Previous {6}"}]
[null,{"$f":"INDEX(labels!$A$390:$C$390,1,MATCH(PP_Language,labels!$A$1:$C$1,0))","v":"Sum of the revaluations concerning property, plant and equipment"}]
[null,null,null,null,null,null,null,null,null,null,null,null,null,null,null,null,null,null,null,null,null,null,null,null,null,{"$f":"\"//notes-property-plant-equipment-accumulated-revaluations label {\"&COLUMN($B$450)&\"}\"","v":"//notes-property-plant-equipment-accumulated-revaluations label {2}"},null,{"$f":"\"//notes-property-plant-equipment-accumulated-revaluations \" & BasisOfPreparationAxis & \" \"  & INDEX(labels!$A$103:$C$103,1,MATCH(PP_Language,labels!$A$1:$C$1,0)) &  \" \"  & INDEX(labels!$A$102:$C$102,1,MATCH(PP_Language,labels!$A$1:$C$1,0)) &  \" {\"&COLUMN($D$450)&\"}\"","v":"//notes-property-plant-equipment-accumulated-revaluations Commercial Separate Current {4}"},null,{"$f":"\"//notes-property-plant-equipment-accumulated-revaluations \" & BasisOfPreparationAxis & \" \"  & INDEX(labels!$A$103:$C$103,1,MATCH(PP_Language,labels!$A$1:$C$1,0)) &  \" \"  & INDEX(labels!$A$104:$C$104,1,MATCH(PP_Language,labels!$A$1:$C$1,0)) &  \" {\"&COLUMN($F$450)&\"}\"","v":"//notes-property-plant-equipment-accumulated-revaluations Commercial Separate Previous {6}"}]
[null,{"$f":"INDEX(labels!$A$59:$C$59,1,MATCH(PP_Language,labels!$A$1:$C$1,0))","v":"Investment properties"}]
[null,{"$f":"INDEX(labels!$A$391:$C$391,1,MATCH(PP_Language,labels!$A$1:$C$1,0))","v":"Notes to the financial statements - Investment properties"}]
[null,null,null,null,null,null,null,null,null,null,null,null,null,null,null,null,null,null,null,null,null,null,null,null,null,{"$f":"\"/notes-investment-properties label {\"&COLUMN($B$453)&\"}\"","v":"/notes-investment-properties label {2}"},null,{"$f":"\"/notes-investment-properties \" & BasisOfPreparationAxis & \" \"  & INDEX(labels!$A$103:$C$103,1,MATCH(PP_Language,labels!$A$1:$C$1,0)) &  \" \"  &  \" {\"&COLUMN($D$453)&\"}\"","v":"/notes-investment-properties Commercial Separate  {4}"}]
[null,{"$f":"INDEX(labels!$A$392:$C$392,1,MATCH(PP_Language,labels!$A$1:$C$1,0))","v":"Disclosure of investment properties"}]
[null,{"$f":"INDEX(labels!$A$393:$C$393,1,MATCH(PP_Language,labels!$A$1:$C$1,0))","v":"Disclosure of fair value of investment properties"}]
[null,{"$f":"INDEX(labels!$A$394:$C$394,1,MATCH(PP_Language,labels!$A$1:$C$1,0))","v":"Description of restrictions with regard to the applicability of investment properties, as well as the extent of this restriction"}]
[null,{"$f":"INDEX(labels!$A$395:$C$395,1,MATCH(PP_Language,labels!$A$1:$C$1,0))","v":"Description of limitations with regard to the collectability of revenues, as well as the extent of this restriction"}]
[null,{"$f":"INDEX(labels!$A$396:$C$396,1,MATCH(PP_Language,labels!$A$1:$C$1,0))","v":"Description of the impairment of investment properties"}]
[null,{"$f":"INDEX(labels!$A$397:$C$397,1,MATCH(PP_Language,labels!$A$1:$C$1,0))","v":"Description of contractual obligations to purchase, construct or develop investment properties or for repairs, maintenance or enhancements of investment properties"}]
[null,null,null,null,null,null,null,null,null,null,null,null,null,null,null,null,null,null,null,null,null,null,null,null,null,{"$f":"\"//notes-investment-properties label {\"&COLUMN($B$460)&\"}\"","v":"//notes-investment-properties label {2}"},null,{"$f":"\"//notes-investment-properties \" & BasisOfPreparationAxis & \" \"  & INDEX(labels!$A$103:$C$103,1,MATCH(PP_Language,labels!$A$1:$C$1,0)) &  \" \"  &  \" {\"&COLUMN($D$460)&\"}\"","v":"//notes-investment-properties Commercial Separate  {4}"}]
[null,{"$f":"INDEX(labels!$A$60:$C$60,1,MATCH(PP_Language,labels!$A$1:$C$1,0))","v":"Financial assets"}]
[null,{"$f":"INDEX(labels!$A$398:$C$398,1,MATCH(PP_Language,labels!$A$1:$C$1,0))","v":"Notes to the financial statements - Financial assets"}]
[null,null,null,null,null,null,null,null,null,null,null,null,null,null,null,null,null,null,null,null,null,null,null,null,null,{"$f":"\"/notes-financial-assets label {\"&COLUMN($B$463)&\"}\"","v":"/notes-financial-assets label {2}"},null,{"$f":"\"/notes-financial-assets \" & BasisOfPreparationAxis & \" \"  & INDEX(labels!$A$103:$C$103,1,MATCH(PP_Language,labels!$A$1:$C$1,0)) &  \" \"  &  \" {\"&COLUMN($D$463)&\"}\"","v":"/notes-financial-assets Commercial Separate  {4}"}]
[null,{"$f":"INDEX(labels!$A$399:$C$399,1,MATCH(PP_Language,labels!$A$1:$C$1,0))","v":"Disclosure of financial assets"}]
[null,{"$f":"INDEX(labels!$A$400:$C$400,1,MATCH(PP_Language,labels!$A$1:$C$1,0))","v":"Description of the assumptions on which the present value of expected future cash flows is based for assets measured at current value that may yield income as an investment"}]
[null,{"$f":"INDEX(labels!$A$401:$C$401,1,MATCH(PP_Language,labels!$A$1:$C$1,0))","v":"Description of the approximation method for assets valuation at current value that generates income as investment"}]
[null,{"$f":"INDEX(labels!$A$402:$C$402,1,MATCH(PP_Language,labels!$A$1:$C$1,0))","v":"Description of the impairment of financial assets"}]
[null,{"$f":"INDEX(labels!$A$403:$C$403,1,MATCH(PP_Language,labels!$A$1:$C$1,0))","v":"Disclosure of deferred tax assets"}]
[null,{"$f":"INDEX(labels!$A$404:$C$404,1,MATCH(PP_Language,labels!$A$1:$C$1,0))","v":"Description of reasons for not applying Article 2: 389 of the Dutch Civil Code to the separate financial statements"}]
[null,null,null,null,null,null,null,null,null,null,null,null,null,null,null,null,null,null,null,null,null,null,null,null,null,{"$f":"\"//notes-financial-assets label {\"&COLUMN($B$470)&\"}\"","v":"//notes-financial-assets label {2}"},null,{"$f":"\"//notes-financial-assets \" & BasisOfPreparationAxis & \" \"  & INDEX(labels!$A$103:$C$103,1,MATCH(PP_Language,labels!$A$1:$C$1,0)) &  \" \"  &  \" {\"&COLUMN($D$470)&\"}\"","v":"//notes-financial-assets Commercial Separate  {4}"}]
[null,{"$f":"INDEX(labels!$A$405:$C$405,1,MATCH(PP_Language,labels!$A$1:$C$1,0))","v":"Notes to the financial statements - Financial assets: Accumulated revaluations"}]
[]
[null,null,null,{"$f":"INDEX(labels!$A$102:$C$102,1,MATCH(PP_Language,labels!$A$1:$C$1,0))","v":"Current"},null,{"$f":"INDEX(labels!$A$104:$C$104,1,MATCH(PP_Language,labels!$A$1:$C$1,0))","v":"Previous"},null,null,null,null,null,null,null,null,null,null,null,null,null,null,null,null,null,null,null,{"$f":"\"/notes-financial-assets-accumulated-revaluations label {\"&COLUMN($B$473)&\"}\"","v":"/notes-financial-assets-accumulated-revaluations label {2}"},null,{"$f":"\"/notes-financial-assets-accumulated-revaluations \" & BasisOfPreparationAxis & \" \"  & INDEX(labels!$A$103:$C$103,1,MATCH(PP_Language,labels!$A$1:$C$1,0)) &  \" \"  & INDEX(labels!$A$102:$C$102,1,MATCH(PP_Language,labels!$A$1:$C$1,0)) &  \" {\"&COLUMN($D$473)&\"}\"","v":"/notes-financial-assets-accumulated-revaluations Commercial Separate Current {4}"},null,{"$f":"\"/notes-financial-assets-accumulated-revaluations \" & BasisOfPreparationAxis & \" \"  & INDEX(labels!$A$103:$C$103,1,MATCH(PP_Language,labels!$A$1:$C$1,0)) &  \" \"  & INDEX(labels!$A$104:$C$104,1,MATCH(PP_Language,labels!$A$1:$C$1,0)) &  \" {\"&COLUMN($F$473)&\"}\"","v":"/notes-financial-assets-accumulated-revaluations Commercial Separate Previous {6}"}]
[null,{"$f":"INDEX(labels!$A$406:$C$406,1,MATCH(PP_Language,labels!$A$1:$C$1,0))","v":"Sum of the revaluations of financial assets"}]
[null,null,null,null,null,null,null,null,null,null,null,null,null,null,null,null,null,null,null,null,null,null,null,null,null,{"$f":"\"//notes-financial-assets-accumulated-revaluations label {\"&COLUMN($B$475)&\"}\"","v":"//notes-financial-assets-accumulated-revaluations label {2}"},null,{"$f":"\"//notes-financial-assets-accumulated-revaluations \" & BasisOfPreparationAxis & \" \"  & INDEX(labels!$A$103:$C$103,1,MATCH(PP_Language,labels!$A$1:$C$1,0)) &  \" \"  & INDEX(labels!$A$102:$C$102,1,MATCH(PP_Language,labels!$A$1:$C$1,0)) &  \" {\"&COLUMN($D$475)&\"}\"","v":"//notes-financial-assets-accumulated-revaluations Commercial Separate Current {4}"},null,{"$f":"\"//notes-financial-assets-accumulated-revaluations \" & BasisOfPreparationAxis & \" \"  & INDEX(labels!$A$103:$C$103,1,MATCH(PP_Language,labels!$A$1:$C$1,0)) &  \" \"  & INDEX(labels!$A$104:$C$104,1,MATCH(PP_Language,labels!$A$1:$C$1,0)) &  \" {\"&COLUMN($F$475)&\"}\"","v":"//notes-financial-assets-accumulated-revaluations Commercial Separate Previous {6}"}]
[null,{"$f":"INDEX(labels!$A$61:$C$61,1,MATCH(PP_Language,labels!$A$1:$C$1,0))","v":"Inventories"}]
[null,{"$f":"INDEX(labels!$A$407:$C$407,1,MATCH(PP_Language,labels!$A$1:$C$1,0))","v":"Notes to the financial statements - Inventories"}]
[null,null,null,null,null,null,null,null,null,null,null,null,null,null,null,null,null,null,null,null,null,null,null,null,null,{"$f":"\"/notes-inventories label {\"&COLUMN($B$478)&\"}\"","v":"/notes-inventories label {2}"},null,{"$f":"\"/notes-inventories \" & BasisOfPreparationAxis & \" \"  & INDEX(labels!$A$103:$C$103,1,MATCH(PP_Language,labels!$A$1:$C$1,0)) &  \" \"  &  \" {\"&COLUMN($D$478)&\"}\"","v":"/notes-inventories Commercial Separate  {4}"}]
[null,{"$f":"INDEX(labels!$A$408:$C$408,1,MATCH(PP_Language,labels!$A$1:$C$1,0))","v":"Disclosure of inventories"}]
[null,{"$f":"INDEX(labels!$A$409:$C$409,1,MATCH(PP_Language,labels!$A$1:$C$1,0))","v":"Description of the capitalised interest of inventories during the period"}]
[null,{"$f":"INDEX(labels!$A$410:$C$410,1,MATCH(PP_Language,labels!$A$1:$C$1,0))","v":"Description of inventories of which the legal entity does not have legal ownership"}]
[null,{"$f":"INDEX(labels!$A$411:$C$411,1,MATCH(PP_Language,labels!$A$1:$C$1,0))","v":"Description of commitments to purchase or sell inventories"}]
[null,{"$f":"INDEX(labels!$A$412:$C$412,1,MATCH(PP_Language,labels!$A$1:$C$1,0))","v":"Disclosure of cost method of inventories"}]
[null,{"$f":"INDEX(labels!$A$413:$C$413,1,MATCH(PP_Language,labels!$A$1:$C$1,0))","v":"Disclosure of the current value of agricultural inventories"}]
[null,{"$f":"INDEX(labels!$A$414:$C$414,1,MATCH(PP_Language,labels!$A$1:$C$1,0))","v":"Disclosure of revaluations of agricultural inventories valued at current value"}]
[null,{"$f":"INDEX(labels!$A$415:$C$415,1,MATCH(PP_Language,labels!$A$1:$C$1,0))","v":"Description to what extent the influence of taxes on the valuation of agricultural stocks at current value has been taken into account"}]
[null,{"$f":"INDEX(labels!$A$416:$C$416,1,MATCH(PP_Language,labels!$A$1:$C$1,0))","v":"Description of the book value of inventories that are valued at lower realizable value"}]
[null,null,null,null,null,null,null,null,null,null,null,null,null,null,null,null,null,null,null,null,null,null,null,null,null,{"$f":"\"//notes-inventories label {\"&COLUMN($B$488)&\"}\"","v":"//notes-inventories label {2}"},null,{"$f":"\"//notes-inventories \" & BasisOfPreparationAxis & \" \"  & INDEX(labels!$A$103:$C$103,1,MATCH(PP_Language,labels!$A$1:$C$1,0)) &  \" \"  &  \" {\"&COLUMN($D$488)&\"}\"","v":"//notes-inventories Commercial Separate  {4}"}]
[null,{"$f":"INDEX(labels!$A$417:$C$417,1,MATCH(PP_Language,labels!$A$1:$C$1,0))","v":"Notes to the financial statements - Inventories: Current value: Breakdown"}]
[]
[null,null,null,{"$f":"INDEX(labels!$A$102:$C$102,1,MATCH(PP_Language,labels!$A$1:$C$1,0))","v":"Current"},null,{"$f":"INDEX(labels!$A$104:$C$104,1,MATCH(PP_Language,labels!$A$1:$C$1,0))","v":"Previous"},null,null,null,null,null,null,null,null,null,null,null,null,null,null,null,null,null,null,null,{"$f":"\"/notes-inventories-current-value-breakdown label {\"&COLUMN($B$491)&\"}\"","v":"/notes-inventories-current-value-breakdown label {2}"},null,{"$f":"\"/notes-inventories-current-value-breakdown \" & BasisOfPreparationAxis & \" \"  & INDEX(labels!$A$103:$C$103,1,MATCH(PP_Language,labels!$A$1:$C$1,0)) &  \" \"  & INDEX(labels!$A$102:$C$102,1,MATCH(PP_Language,labels!$A$1:$C$1,0)) &  \" {\"&COLUMN($D$491)&\"}\"","v":"/notes-inventories-current-value-breakdown Commercial Separate Current {4}"},null,{"$f":"\"/notes-inventories-current-value-breakdown \" & BasisOfPreparationAxis & \" \"  & INDEX(labels!$A$103:$C$103,1,MATCH(PP_Language,labels!$A$1:$C$1,0)) &  \" \"  & INDEX(labels!$A$104:$C$104,1,MATCH(PP_Language,labels!$A$1:$C$1,0)) &  \" {\"&COLUMN($F$491)&\"}\"","v":"/notes-inventories-current-value-breakdown Commercial Separate Previous {6}"}]
[null,{"$f":"INDEX(labels!$A$418:$C$418,1,MATCH(PP_Language,labels!$A$1:$C$1,0))","v":"Book value of inventories that are valued at lower realisable value"}]
[null,null,null,null,null,null,null,null,null,null,null,null,null,null,null,null,null,null,null,null,null,null,null,null,null,{"$f":"\"//notes-inventories-current-value-breakdown label {\"&COLUMN($B$493)&\"}\"","v":"//notes-inventories-current-value-breakdown label {2}"},null,{"$f":"\"//notes-inventories-current-value-breakdown \" & BasisOfPreparationAxis & \" \"  & INDEX(labels!$A$103:$C$103,1,MATCH(PP_Language,labels!$A$1:$C$1,0)) &  \" \"  & INDEX(labels!$A$102:$C$102,1,MATCH(PP_Language,labels!$A$1:$C$1,0)) &  \" {\"&COLUMN($D$493)&\"}\"","v":"//notes-inventories-current-value-breakdown Commercial Separate Current {4}"},null,{"$f":"\"//notes-inventories-current-value-breakdown \" & BasisOfPreparationAxis & \" \"  & INDEX(labels!$A$103:$C$103,1,MATCH(PP_Language,labels!$A$1:$C$1,0)) &  \" \"  & INDEX(labels!$A$104:$C$104,1,MATCH(PP_Language,labels!$A$1:$C$1,0)) &  \" {\"&COLUMN($F$493)&\"}\"","v":"//notes-inventories-current-value-breakdown Commercial Separate Previous {6}"}]
[null,{"$f":"INDEX(labels!$A$62:$C$62,1,MATCH(PP_Language,labels!$A$1:$C$1,0))","v":"Construction contracts"}]
[null,{"$f":"INDEX(labels!$A$419:$C$419,1,MATCH(PP_Language,labels!$A$1:$C$1,0))","v":"Notes to the financial statements - Construction contracts"}]
[null,null,null,null,null,null,null,null,null,null,null,null,null,null,null,null,null,null,null,null,null,null,null,null,null,{"$f":"\"/notes-construction-contracts label {\"&COLUMN($B$496)&\"}\"","v":"/notes-construction-contracts label {2}"},null,{"$f":"\"/notes-construction-contracts \" & BasisOfPreparationAxis & \" \"  & INDEX(labels!$A$103:$C$103,1,MATCH(PP_Language,labels!$A$1:$C$1,0)) &  \" \"  &  \" {\"&COLUMN($D$496)&\"}\"","v":"/notes-construction-contracts Commercial Separate  {4}"}]
[null,{"$f":"INDEX(labels!$A$420:$C$420,1,MATCH(PP_Language,labels!$A$1:$C$1,0))","v":"Disclosure of construction contracts"}]
[null,null,null,null,null,null,null,null,null,null,null,null,null,null,null,null,null,null,null,null,null,null,null,null,null,{"$f":"\"//notes-construction-contracts label {\"&COLUMN($B$498)&\"}\"","v":"//notes-construction-contracts label {2}"},null,{"$f":"\"//notes-construction-contracts \" & BasisOfPreparationAxis & \" \"  & INDEX(labels!$A$103:$C$103,1,MATCH(PP_Language,labels!$A$1:$C$1,0)) &  \" \"  &  \" {\"&COLUMN($D$498)&\"}\"","v":"//notes-construction-contracts Commercial Separate  {4}"}]
[null,{"$f":"INDEX(labels!$A$63:$C$63,1,MATCH(PP_Language,labels!$A$1:$C$1,0))","v":"Receivables"}]
[null,{"$f":"INDEX(labels!$A$421:$C$421,1,MATCH(PP_Language,labels!$A$1:$C$1,0))","v":"Notes to the financial statements - Receivables: Breakdown"}]
[]
[null,null,null,{"$f":"INDEX(labels!$A$102:$C$102,1,MATCH(PP_Language,labels!$A$1:$C$1,0))","v":"Current"},null,{"$f":"INDEX(labels!$A$104:$C$104,1,MATCH(PP_Language,labels!$A$1:$C$1,0))","v":"Previous"},null,null,null,null,null,null,null,null,null,null,null,null,null,null,null,null,null,null,null,{"$f":"\"/notes-receivables-breakdown label {\"&COLUMN($B$502)&\"}\"","v":"/notes-receivables-breakdown label {2}"},null,{"$f":"\"/notes-receivables-breakdown \" & BasisOfPreparationAxis & \" \"  & INDEX(labels!$A$103:$C$103,1,MATCH(PP_Language,labels!$A$1:$C$1,0)) &  \" \"  & INDEX(labels!$A$102:$C$102,1,MATCH(PP_Language,labels!$A$1:$C$1,0)) &  \" {\"&COLUMN($D$502)&\"}\"","v":"/notes-receivables-breakdown Commercial Separate Current {4}"},null,{"$f":"\"/notes-receivables-breakdown \" & BasisOfPreparationAxis & \" \"  & INDEX(labels!$A$103:$C$103,1,MATCH(PP_Language,labels!$A$1:$C$1,0)) &  \" \"  & INDEX(labels!$A$104:$C$104,1,MATCH(PP_Language,labels!$A$1:$C$1,0)) &  \" {\"&COLUMN($F$502)&\"}\"","v":"/notes-receivables-breakdown Commercial Separate Previous {6}"}]
[null,{"$f":"INDEX(labels!$A$422:$C$422,1,MATCH(PP_Language,labels!$A$1:$C$1,0))","v":"Called-up contributions for issued share capital"}]
[null,{"$f":"INDEX(labels!$A$423:$C$423,1,MATCH(PP_Language,labels!$A$1:$C$1,0))","v":"Other receivables"},null,{"$f":"IF(OR(NOT(0=0),NOT(0=0)), - 0+ 0,\"\")","v":""},null,{"$f":"IF(OR(NOT(0=0),NOT(0=0)), - 0+ 0,\"\")","v":""}]
[]
[null,{"$f":"INDEX(labels!$A$424:$C$424,1,MATCH(PP_Language,labels!$A$1:$C$1,0))","v":"Total of receivables"},null,{"$f":"IF(OR(NOT(0=0),NOT(AND(Stamdata!$D$503=\"\",Stamdata!$D$504=\"\"))), - 0+ SUM(Stamdata!$D$503,Stamdata!$D$504),\"\")","v":""},null,{"$f":"IF(OR(NOT(0=0),NOT(AND(Stamdata!$F$503=\"\",Stamdata!$F$504=\"\"))), - 0+ SUM(Stamdata!$F$503,Stamdata!$F$504),\"\")","v":""}]
[null,null,null,null,null,null,null,null,null,null,null,null,null,null,null,null,null,null,null,null,null,null,null,null,null,{"$f":"\"//notes-receivables-breakdown label {\"&COLUMN($B$507)&\"}\"","v":"//notes-receivables-breakdown label {2}"},null,{"$f":"\"//notes-receivables-breakdown \" & BasisOfPreparationAxis & \" \"  & INDEX(labels!$A$103:$C$103,1,MATCH(PP_Language,labels!$A$1:$C$1,0)) &  \" \"  & INDEX(labels!$A$102:$C$102,1,MATCH(PP_Language,labels!$A$1:$C$1,0)) &  \" {\"&COLUMN($D$507)&\"}\"","v":"//notes-receivables-breakdown Commercial Separate Current {4}"},null,{"$f":"\"//notes-receivables-breakdown \" & BasisOfPreparationAxis & \" \"  & INDEX(labels!$A$103:$C$103,1,MATCH(PP_Language,labels!$A$1:$C$1,0)) &  \" \"  & INDEX(labels!$A$104:$C$104,1,MATCH(PP_Language,labels!$A$1:$C$1,0)) &  \" {\"&COLUMN($F$507)&\"}\"","v":"//notes-receivables-breakdown Commercial Separate Previous {6}"}]
[null,{"$f":"INDEX(labels!$A$425:$C$425,1,MATCH(PP_Language,labels!$A$1:$C$1,0))","v":"Notes to the financial statements - Receivables"}]
[null,null,null,null,null,null,null,null,null,null,null,null,null,null,null,null,null,null,null,null,null,null,null,null,null,{"$f":"\"/notes-receivables label {\"&COLUMN($B$509)&\"}\"","v":"/notes-receivables label {2}"},null,{"$f":"\"/notes-receivables \" & BasisOfPreparationAxis & \" \"  & INDEX(labels!$A$103:$C$103,1,MATCH(PP_Language,labels!$A$1:$C$1,0)) &  \" \"  &  \" {\"&COLUMN($D$509)&\"}\"","v":"/notes-receivables Commercial Separate  {4}"}]
[null,{"$f":"INDEX(labels!$A$426:$C$426,1,MATCH(PP_Language,labels!$A$1:$C$1,0))","v":"Disclosure of receivables"}]
[null,{"$f":"INDEX(labels!$A$403:$C$403,1,MATCH(PP_Language,labels!$A$1:$C$1,0))","v":"Disclosure of deferred tax assets"}]
[null,{"$f":"INDEX(labels!$A$427:$C$427,1,MATCH(PP_Language,labels!$A$1:$C$1,0))","v":"Disclosure of prepayments and accrued income"}]
[null,{"$f":"INDEX(labels!$A$428:$C$428,1,MATCH(PP_Language,labels!$A$1:$C$1,0))","v":"Description of receivables of which the legal entity does not have legal ownership"}]
[null,{"$f":"INDEX(labels!$A$429:$C$429,1,MATCH(PP_Language,labels!$A$1:$C$1,0))","v":"Disclosure of receivables with a maturity exceeding one year"}]
[null,null,null,null,null,null,null,null,null,null,null,null,null,null,null,null,null,null,null,null,null,null,null,null,null,{"$f":"\"//notes-receivables label {\"&COLUMN($B$515)&\"}\"","v":"//notes-receivables label {2}"},null,{"$f":"\"//notes-receivables \" & BasisOfPreparationAxis & \" \"  & INDEX(labels!$A$103:$C$103,1,MATCH(PP_Language,labels!$A$1:$C$1,0)) &  \" \"  &  \" {\"&COLUMN($D$515)&\"}\"","v":"//notes-receivables Commercial Separate  {4}"}]
[null,{"$f":"INDEX(labels!$A$430:$C$430,1,MATCH(PP_Language,labels!$A$1:$C$1,0))","v":"Notes to the financial statements - Receivables: Breakdown maturity"}]
[null,null,null,null,null,null,null,null,null,null,null,null,null,null,null,null,null,null,null,null,null,null,null,null,null,{"$f":"\"/notes-receivables-breakdown-maturity label {\"&COLUMN($B$517)&\"}\"","v":"/notes-receivables-breakdown-maturity label {2}"},null,{"$f":"\"/notes-receivables-breakdown-maturity \"  & INDEX(labels!$A$431:$C$431,1,MATCH(PP_Language,labels!$A$1:$C$1,0)) &  \" {\"&COLUMN($D$517)&\"}\"","v":"/notes-receivables-breakdown-maturity Receivables with a maturity exceeding one year {4}"}]
[null,{"$f":"INDEX(labels!$A$422:$C$422,1,MATCH(PP_Language,labels!$A$1:$C$1,0))","v":"Called-up contributions for issued share capital"}]
[null,{"$f":"INDEX(labels!$A$423:$C$423,1,MATCH(PP_Language,labels!$A$1:$C$1,0))","v":"Other receivables"},null,{"$f":"IF(OR(NOT(0=0),NOT(0=0)), - 0+ 0,\"\")","v":""}]
[]
[null,{"$f":"INDEX(labels!$A$424:$C$424,1,MATCH(PP_Language,labels!$A$1:$C$1,0))","v":"Total of receivables"},null,{"$f":"IF(OR(NOT(0=0),NOT(AND(Stamdata!$D$518=\"\",Stamdata!$D$519=\"\"))), - 0+ SUM(Stamdata!$D$518,Stamdata!$D$519),\"\")","v":""}]
[null,null,null,null,null,null,null,null,null,null,null,null,null,null,null,null,null,null,null,null,null,null,null,null,null,{"$f":"\"//notes-receivables-breakdown-maturity label {\"&COLUMN($B$522)&\"}\"","v":"//notes-receivables-breakdown-maturity label {2}"},null,{"$f":"\"//notes-receivables-breakdown-maturity \"  & INDEX(labels!$A$431:$C$431,1,MATCH(PP_Language,labels!$A$1:$C$1,0)) &  \" {\"&COLUMN($D$522)&\"}\"","v":"//notes-receivables-breakdown-maturity Receivables with a maturity exceeding one year {4}"}]
[null,{"$f":"INDEX(labels!$A$64:$C$64,1,MATCH(PP_Language,labels!$A$1:$C$1,0))","v":"Securities"}]
[null,{"$f":"INDEX(labels!$A$432:$C$432,1,MATCH(PP_Language,labels!$A$1:$C$1,0))","v":"Notes to the financial statements - Securities"}]
[null,null,null,null,null,null,null,null,null,null,null,null,null,null,null,null,null,null,null,null,null,null,null,null,null,{"$f":"\"/notes-securities label {\"&COLUMN($B$525)&\"}\"","v":"/notes-securities label {2}"},null,{"$f":"\"/notes-securities \" & BasisOfPreparationAxis & \" \"  & INDEX(labels!$A$103:$C$103,1,MATCH(PP_Language,labels!$A$1:$C$1,0)) &  \" \"  &  \" {\"&COLUMN($D$525)&\"}\"","v":"/notes-securities Commercial Separate  {4}"}]
[null,{"$f":"INDEX(labels!$A$433:$C$433,1,MATCH(PP_Language,labels!$A$1:$C$1,0))","v":"Disclosure of securities"}]
[null,{"$f":"INDEX(labels!$A$434:$C$434,1,MATCH(PP_Language,labels!$A$1:$C$1,0))","v":"Disclosure of fair value of securities"}]
[null,null,null,null,null,null,null,null,null,null,null,null,null,null,null,null,null,null,null,null,null,null,null,null,null,{"$f":"\"//notes-securities label {\"&COLUMN($B$528)&\"}\"","v":"//notes-securities label {2}"},null,{"$f":"\"//notes-securities \" & BasisOfPreparationAxis & \" \"  & INDEX(labels!$A$103:$C$103,1,MATCH(PP_Language,labels!$A$1:$C$1,0)) &  \" \"  &  \" {\"&COLUMN($D$528)&\"}\"","v":"//notes-securities Commercial Separate  {4}"}]
[null,{"$f":"INDEX(labels!$A$65:$C$65,1,MATCH(PP_Language,labels!$A$1:$C$1,0))","v":"Cash and cash equivalents"}]
[null,{"$f":"INDEX(labels!$A$435:$C$435,1,MATCH(PP_Language,labels!$A$1:$C$1,0))","v":"Notes to the financial statements - Cash and cash equivalents"}]
[null,null,null,null,null,null,null,null,null,null,null,null,null,null,null,null,null,null,null,null,null,null,null,null,null,{"$f":"\"/notes-cash-and-cash-equivalents label {\"&COLUMN($B$531)&\"}\"","v":"/notes-cash-and-cash-equivalents label {2}"},null,{"$f":"\"/notes-cash-and-cash-equivalents \" & BasisOfPreparationAxis & \" \"  & INDEX(labels!$A$103:$C$103,1,MATCH(PP_Language,labels!$A$1:$C$1,0)) &  \" \"  &  \" {\"&COLUMN($D$531)&\"}\"","v":"/notes-cash-and-cash-equivalents Commercial Separate  {4}"}]
[null,{"$f":"INDEX(labels!$A$436:$C$436,1,MATCH(PP_Language,labels!$A$1:$C$1,0))","v":"Disclosure of cash and cash equivalents"}]
[null,{"$f":"INDEX(labels!$A$437:$C$437,1,MATCH(PP_Language,labels!$A$1:$C$1,0))","v":"Disclosure of cheques and bills of exchange"}]
[null,null,null,null,null,null,null,null,null,null,null,null,null,null,null,null,null,null,null,null,null,null,null,null,null,{"$f":"\"//notes-cash-and-cash-equivalents label {\"&COLUMN($B$534)&\"}\"","v":"//notes-cash-and-cash-equivalents label {2}"},null,{"$f":"\"//notes-cash-and-cash-equivalents \" & BasisOfPreparationAxis & \" \"  & INDEX(labels!$A$103:$C$103,1,MATCH(PP_Language,labels!$A$1:$C$1,0)) &  \" \"  &  \" {\"&COLUMN($D$534)&\"}\"","v":"//notes-cash-and-cash-equivalents Commercial Separate  {4}"}]
[null,{"$f":"INDEX(labels!$A$66:$C$66,1,MATCH(PP_Language,labels!$A$1:$C$1,0))","v":"Equity"}]
[null,{"$f":"INDEX(labels!$A$438:$C$438,1,MATCH(PP_Language,labels!$A$1:$C$1,0))","v":"Notes to the financial statements - Equity"}]
[null,null,null,null,null,null,null,null,null,null,null,null,null,null,null,null,null,null,null,null,null,null,null,null,null,{"$f":"\"/notes-equity label {\"&COLUMN($B$537)&\"}\"","v":"/notes-equity label {2}"},null,{"$f":"\"/notes-equity \" & BasisOfPreparationAxis & \" \"  & INDEX(labels!$A$103:$C$103,1,MATCH(PP_Language,labels!$A$1:$C$1,0)) &  \" \"  &  \" {\"&COLUMN($D$537)&\"}\"","v":"/notes-equity Commercial Separate  {4}"}]
[null,{"$f":"INDEX(labels!$A$439:$C$439,1,MATCH(PP_Language,labels!$A$1:$C$1,0))","v":"Disclosure of equity"}]
[null,{"$f":"INDEX(labels!$A$440:$C$440,1,MATCH(PP_Language,labels!$A$1:$C$1,0))","v":"Disclosure of continuity with impact on equity"}]
[null,{"$f":"INDEX(labels!$A$441:$C$441,1,MATCH(PP_Language,labels!$A$1:$C$1,0))","v":"Disclosure of important subsequent events with an impact on equity"}]
[null,{"$f":"INDEX(labels!$A$442:$C$442,1,MATCH(PP_Language,labels!$A$1:$C$1,0))","v":"Disclosure of guaranteed equity"}]
[null,{"$f":"INDEX(labels!$A$443:$C$443,1,MATCH(PP_Language,labels!$A$1:$C$1,0))","v":"Description of the withheld part of the result in equity"}]
[null,null,null,null,null,null,null,null,null,null,null,null,null,null,null,null,null,null,null,null,null,null,null,null,null,{"$f":"\"//notes-equity label {\"&COLUMN($B$543)&\"}\"","v":"//notes-equity label {2}"},null,{"$f":"\"//notes-equity \" & BasisOfPreparationAxis & \" \"  & INDEX(labels!$A$103:$C$103,1,MATCH(PP_Language,labels!$A$1:$C$1,0)) &  \" \"  &  \" {\"&COLUMN($D$543)&\"}\"","v":"//notes-equity Commercial Separate  {4}"}]
[null,{"$f":"INDEX(labels!$A$444:$C$444,1,MATCH(PP_Language,labels!$A$1:$C$1,0))","v":"Share capital"}]
[null,{"$f":"INDEX(labels!$A$445:$C$445,1,MATCH(PP_Language,labels!$A$1:$C$1,0))","v":"Notes to the financial statements - Share capital: Statement of changes in number of shares: Specification"}]
[]
[]
[null,null,null,{"$f":"INDEX(labels!$A$446:$C$446,1,MATCH(PP_Language,labels!$A$1:$C$1,0))","v":"Share capital (number of shares)"},{"$f":"INDEX(labels!$A$446:$C$446,1,MATCH(PP_Language,labels!$A$1:$C$1,0))","v":"Share capital (number of shares)"},{"$f":"INDEX(labels!$A$446:$C$446,1,MATCH(PP_Language,labels!$A$1:$C$1,0))","v":"Share capital (number of shares)"},{"$f":"INDEX(labels!$A$446:$C$446,1,MATCH(PP_Language,labels!$A$1:$C$1,0))","v":"Share capital (number of shares)"},{"$f":"INDEX(labels!$A$446:$C$446,1,MATCH(PP_Language,labels!$A$1:$C$1,0))","v":"Share capital (number of shares)"},null,null,null,null,null,null,null,null,null,null,null,null,null,null,null,null,null,{"$f":"\"/notes-share-capital-statement-of-changes-numberof-shares-specification label {\"&COLUMN($B$548)&\"}\"","v":"/notes-share-capital-statement-of-changes-numberof-shares-specification label {2}"},null,{"$f":"\"/notes-share-capital-statement-of-changes-numberof-shares-specification \" & BasisOfPreparationAxis & \" \"  & INDEX(labels!$A$446:$C$446,1,MATCH(PP_Language,labels!$A$1:$C$1,0)) &  \" \"  & INDEX(labels!$A$103:$C$103,1,MATCH(PP_Language,labels!$A$1:$C$1,0)) &  \" {\"&COLUMN($D$548)&\"}\"","v":"/notes-share-capital-statement-of-changes-numberof-shares-specification Commercial Share capital (number of shares) Separate {4}"},{"$f":"\"/notes-share-capital-statement-of-changes-numberof-shares-specification \" & BasisOfPreparationAxis & \" \"  & INDEX(labels!$A$446:$C$446,1,MATCH(PP_Language,labels!$A$1:$C$1,0)) &  \" \"  & INDEX(labels!$A$103:$C$103,1,MATCH(PP_Language,labels!$A$1:$C$1,0)) &  \" {\"&COLUMN($E$548)&\"}\"","v":"/notes-share-capital-statement-of-changes-numberof-shares-specification Commercial Share capital (number of shares) Separate {5}"},{"$f":"\"/notes-share-capital-statement-of-changes-numberof-shares-specification \" & BasisOfPreparationAxis & \" \"  & INDEX(labels!$A$446:$C$446,1,MATCH(PP_Language,labels!$A$1:$C$1,0)) &  \" \"  & INDEX(labels!$A$103:$C$103,1,MATCH(PP_Language,labels!$A$1:$C$1,0)) &  \" {\"&COLUMN($F$548)&\"}\"","v":"/notes-share-capital-statement-of-changes-numberof-shares-specification Commercial Share capital (number of shares) Separate {6}"},{"$f":"\"/notes-share-capital-statement-of-changes-numberof-shares-specification \" & BasisOfPreparationAxis & \" \"  & INDEX(labels!$A$446:$C$446,1,MATCH(PP_Language,labels!$A$1:$C$1,0)) &  \" \"  & INDEX(labels!$A$103:$C$103,1,MATCH(PP_Language,labels!$A$1:$C$1,0)) &  \" {\"&COLUMN($G$548)&\"}\"","v":"/notes-share-capital-statement-of-changes-numberof-shares-specification Commercial Share capital (number of shares) Separate {7}"},{"$f":"\"/notes-share-capital-statement-of-changes-numberof-shares-specification \" & BasisOfPreparationAxis & \" \"  & INDEX(labels!$A$446:$C$446,1,MATCH(PP_Language,labels!$A$1:$C$1,0)) &  \" \"  & INDEX(labels!$A$103:$C$103,1,MATCH(PP_Language,labels!$A$1:$C$1,0)) &  \" {\"&COLUMN($H$548)&\"}\"","v":"/notes-share-capital-statement-of-changes-numberof-shares-specification Commercial Share capital (number of shares) Separate {8}"}]
[null,{"$f":"INDEX(labels!$A$447:$C$447,1,MATCH(PP_Language,labels!$A$1:$C$1,0))","v":"Description Share capital (number of shares)"}]
[null,{"$f":"INDEX(labels!$A$448:$C$448,1,MATCH(PP_Language,labels!$A$1:$C$1,0))","v":"Number of shares at the beginning of the period"}]
[]
[null,{"$f":"INDEX(labels!$A$449:$C$449,1,MATCH(PP_Language,labels!$A$1:$C$1,0))","v":"Shares issued"}]
[null,{"$f":"INDEX(labels!$A$450:$C$450,1,MATCH(PP_Language,labels!$A$1:$C$1,0))","v":"Shares purchased"}]
[null,{"$f":"INDEX(labels!$A$451:$C$451,1,MATCH(PP_Language,labels!$A$1:$C$1,0))","v":"Shares granted"}]
[null,{"$f":"INDEX(labels!$A$452:$C$452,1,MATCH(PP_Language,labels!$A$1:$C$1,0))","v":"Shares sold"}]
[null,{"$f":"INDEX(labels!$A$453:$C$453,1,MATCH(PP_Language,labels!$A$1:$C$1,0))","v":"Shares withdrawn"}]
[null,{"$f":"INDEX(labels!$A$454:$C$454,1,MATCH(PP_Language,labels!$A$1:$C$1,0))","v":"Shares distributed as dividend"}]
[null,{"$f":"INDEX(labels!$A$455:$C$455,1,MATCH(PP_Language,labels!$A$1:$C$1,0))","v":"Other movements"}]
[]
[null,{"$f":"INDEX(labels!$A$456:$C$456,1,MATCH(PP_Language,labels!$A$1:$C$1,0))","v":"Total of movements during the period"}]
[]
[null,{"$f":"INDEX(labels!$A$457:$C$457,1,MATCH(PP_Language,labels!$A$1:$C$1,0))","v":"Number of shares at the end of the period"}]
[]
[null,{"$f":"INDEX(labels!$A$172:$C$172,1,MATCH(PP_Language,labels!$A$1:$C$1,0))","v":"Presentation order"}]
[null,null,null,null,null,null,null,null,null,null,null,null,null,null,null,null,null,null,null,null,null,null,null,null,null,{"$f":"\"//notes-share-capital-statement-of-changes-numberof-shares-specification label {\"&COLUMN($B$565)&\"}\"","v":"//notes-share-capital-statement-of-changes-numberof-shares-specification label {2}"},null,{"$f":"\"//notes-share-capital-statement-of-changes-numberof-shares-specification \" & BasisOfPreparationAxis & \" \"  & INDEX(labels!$A$446:$C$446,1,MATCH(PP_Language,labels!$A$1:$C$1,0)) &  \" \"  & INDEX(labels!$A$103:$C$103,1,MATCH(PP_Language,labels!$A$1:$C$1,0)) &  \" {\"&COLUMN($D$565)&\"}\"","v":"//notes-share-capital-statement-of-changes-numberof-shares-specification Commercial Share capital (number of shares) Separate {4}"},{"$f":"\"//notes-share-capital-statement-of-changes-numberof-shares-specification \" & BasisOfPreparationAxis & \" \"  & INDEX(labels!$A$446:$C$446,1,MATCH(PP_Language,labels!$A$1:$C$1,0)) &  \" \"  & INDEX(labels!$A$103:$C$103,1,MATCH(PP_Language,labels!$A$1:$C$1,0)) &  \" {\"&COLUMN($E$565)&\"}\"","v":"//notes-share-capital-statement-of-changes-numberof-shares-specification Commercial Share capital (number of shares) Separate {5}"},{"$f":"\"//notes-share-capital-statement-of-changes-numberof-shares-specification \" & BasisOfPreparationAxis & \" \"  & INDEX(labels!$A$446:$C$446,1,MATCH(PP_Language,labels!$A$1:$C$1,0)) &  \" \"  & INDEX(labels!$A$103:$C$103,1,MATCH(PP_Language,labels!$A$1:$C$1,0)) &  \" {\"&COLUMN($F$565)&\"}\"","v":"//notes-share-capital-statement-of-changes-numberof-shares-specification Commercial Share capital (number of shares) Separate {6}"},{"$f":"\"//notes-share-capital-statement-of-changes-numberof-shares-specification \" & BasisOfPreparationAxis & \" \"  & INDEX(labels!$A$446:$C$446,1,MATCH(PP_Language,labels!$A$1:$C$1,0)) &  \" \"  & INDEX(labels!$A$103:$C$103,1,MATCH(PP_Language,labels!$A$1:$C$1,0)) &  \" {\"&COLUMN($G$565)&\"}\"","v":"//notes-share-capital-statement-of-changes-numberof-shares-specification Commercial Share capital (number of shares) Separate {7}"},{"$f":"\"//notes-share-capital-statement-of-changes-numberof-shares-specification \" & BasisOfPreparationAxis & \" \"  & INDEX(labels!$A$446:$C$446,1,MATCH(PP_Language,labels!$A$1:$C$1,0)) &  \" \"  & INDEX(labels!$A$103:$C$103,1,MATCH(PP_Language,labels!$A$1:$C$1,0)) &  \" {\"&COLUMN($H$565)&\"}\"","v":"//notes-share-capital-statement-of-changes-numberof-shares-specification Commercial Share capital (number of shares) Separate {8}"}]
[null,{"$f":"INDEX(labels!$A$458:$C$458,1,MATCH(PP_Language,labels!$A$1:$C$1,0))","v":"Notes to the financial statements - Share capital, previous period: Statement of changes in number of shares: Specification"}]
[]
[]
[null,null,null,{"$f":"INDEX(labels!$A$446:$C$446,1,MATCH(PP_Language,labels!$A$1:$C$1,0))","v":"Share capital (number of shares)"},{"$f":"INDEX(labels!$A$446:$C$446,1,MATCH(PP_Language,labels!$A$1:$C$1,0))","v":"Share capital (number of shares)"},{"$f":"INDEX(labels!$A$446:$C$446,1,MATCH(PP_Language,labels!$A$1:$C$1,0))","v":"Share capital (number of shares)"},{"$f":"INDEX(labels!$A$446:$C$446,1,MATCH(PP_Language,labels!$A$1:$C$1,0))","v":"Share capital (number of shares)"},{"$f":"INDEX(labels!$A$446:$C$446,1,MATCH(PP_Language,labels!$A$1:$C$1,0))","v":"Share capital (number of shares)"},null,null,null,null,null,null,null,null,null,null,null,null,null,null,null,null,null,{"$f":"\"/notes-share-capital-statement-of-changes-numberof-shares-previous-specification label {\"&COLUMN($B$569)&\"}\"","v":"/notes-share-capital-statement-of-changes-numberof-shares-previous-specification label {2}"},null,{"$f":"\"/notes-share-capital-statement-of-changes-numberof-shares-previous-specification \" & BasisOfPreparationAxis & \" \"  & INDEX(labels!$A$446:$C$446,1,MATCH(PP_Language,labels!$A$1:$C$1,0)) &  \" \"  & INDEX(labels!$A$103:$C$103,1,MATCH(PP_Language,labels!$A$1:$C$1,0)) &  \" {\"&COLUMN($D$569)&\"}\"","v":"/notes-share-capital-statement-of-changes-numberof-shares-previous-specification Commercial Share capital (number of shares) Separate {4}"},{"$f":"\"/notes-share-capital-statement-of-changes-numberof-shares-previous-specification \" & BasisOfPreparationAxis & \" \"  & INDEX(labels!$A$446:$C$446,1,MATCH(PP_Language,labels!$A$1:$C$1,0)) &  \" \"  & INDEX(labels!$A$103:$C$103,1,MATCH(PP_Language,labels!$A$1:$C$1,0)) &  \" {\"&COLUMN($E$569)&\"}\"","v":"/notes-share-capital-statement-of-changes-numberof-shares-previous-specification Commercial Share capital (number of shares) Separate {5}"},{"$f":"\"/notes-share-capital-statement-of-changes-numberof-shares-previous-specification \" & BasisOfPreparationAxis & \" \"  & INDEX(labels!$A$446:$C$446,1,MATCH(PP_Language,labels!$A$1:$C$1,0)) &  \" \"  & INDEX(labels!$A$103:$C$103,1,MATCH(PP_Language,labels!$A$1:$C$1,0)) &  \" {\"&COLUMN($F$569)&\"}\"","v":"/notes-share-capital-statement-of-changes-numberof-shares-previous-specification Commercial Share capital (number of shares) Separate {6}"},{"$f":"\"/notes-share-capital-statement-of-changes-numberof-shares-previous-specification \" & BasisOfPreparationAxis & \" \"  & INDEX(labels!$A$446:$C$446,1,MATCH(PP_Language,labels!$A$1:$C$1,0)) &  \" \"  & INDEX(labels!$A$103:$C$103,1,MATCH(PP_Language,labels!$A$1:$C$1,0)) &  \" {\"&COLUMN($G$569)&\"}\"","v":"/notes-share-capital-statement-of-changes-numberof-shares-previous-specification Commercial Share capital (number of shares) Separate {7}"},{"$f":"\"/notes-share-capital-statement-of-changes-numberof-shares-previous-specification \" & BasisOfPreparationAxis & \" \"  & INDEX(labels!$A$446:$C$446,1,MATCH(PP_Language,labels!$A$1:$C$1,0)) &  \" \"  & INDEX(labels!$A$103:$C$103,1,MATCH(PP_Language,labels!$A$1:$C$1,0)) &  \" {\"&COLUMN($H$569)&\"}\"","v":"/notes-share-capital-statement-of-changes-numberof-shares-previous-specification Commercial Share capital (number of shares) Separate {8}"}]
[null,{"$f":"INDEX(labels!$A$459:$C$459,1,MATCH(PP_Language,labels!$A$1:$C$1,0))","v":"Description Share capital (number of shares)"}]
[null,{"$f":"INDEX(labels!$A$448:$C$448,1,MATCH(PP_Language,labels!$A$1:$C$1,0))","v":"Number of shares at the beginning of the period"}]
[]
[null,{"$f":"INDEX(labels!$A$449:$C$449,1,MATCH(PP_Language,labels!$A$1:$C$1,0))","v":"Shares issued"}]
[null,{"$f":"INDEX(labels!$A$450:$C$450,1,MATCH(PP_Language,labels!$A$1:$C$1,0))","v":"Shares purchased"}]
[null,{"$f":"INDEX(labels!$A$451:$C$451,1,MATCH(PP_Language,labels!$A$1:$C$1,0))","v":"Shares granted"}]
[null,{"$f":"INDEX(labels!$A$452:$C$452,1,MATCH(PP_Language,labels!$A$1:$C$1,0))","v":"Shares sold"}]
[null,{"$f":"INDEX(labels!$A$453:$C$453,1,MATCH(PP_Language,labels!$A$1:$C$1,0))","v":"Shares withdrawn"}]
[null,{"$f":"INDEX(labels!$A$454:$C$454,1,MATCH(PP_Language,labels!$A$1:$C$1,0))","v":"Shares distributed as dividend"}]
[null,{"$f":"INDEX(labels!$A$455:$C$455,1,MATCH(PP_Language,labels!$A$1:$C$1,0))","v":"Other movements"}]
[]
[null,{"$f":"INDEX(labels!$A$456:$C$456,1,MATCH(PP_Language,labels!$A$1:$C$1,0))","v":"Total of movements during the period"}]
[]
[null,{"$f":"INDEX(labels!$A$457:$C$457,1,MATCH(PP_Language,labels!$A$1:$C$1,0))","v":"Number of shares at the end of the period"}]
[]
[null,{"$f":"INDEX(labels!$A$172:$C$172,1,MATCH(PP_Language,labels!$A$1:$C$1,0))","v":"Presentation order"}]
[null,null,null,null,null,null,null,null,null,null,null,null,null,null,null,null,null,null,null,null,null,null,null,null,null,{"$f":"\"//notes-share-capital-statement-of-changes-numberof-shares-previous-specification label {\"&COLUMN($B$586)&\"}\"","v":"//notes-share-capital-statement-of-changes-numberof-shares-previous-specification label {2}"},null,{"$f":"\"//notes-share-capital-statement-of-changes-numberof-shares-previous-specification \" & BasisOfPreparationAxis & \" \"  & INDEX(labels!$A$446:$C$446,1,MATCH(PP_Language,labels!$A$1:$C$1,0)) &  \" \"  & INDEX(labels!$A$103:$C$103,1,MATCH(PP_Language,labels!$A$1:$C$1,0)) &  \" {\"&COLUMN($D$586)&\"}\"","v":"//notes-share-capital-statement-of-changes-numberof-shares-previous-specification Commercial Share capital (number of shares) Separate {4}"},{"$f":"\"//notes-share-capital-statement-of-changes-numberof-shares-previous-specification \" & BasisOfPreparationAxis & \" \"  & INDEX(labels!$A$446:$C$446,1,MATCH(PP_Language,labels!$A$1:$C$1,0)) &  \" \"  & INDEX(labels!$A$103:$C$103,1,MATCH(PP_Language,labels!$A$1:$C$1,0)) &  \" {\"&COLUMN($E$586)&\"}\"","v":"//notes-share-capital-statement-of-changes-numberof-shares-previous-specification Commercial Share capital (number of shares) Separate {5}"},{"$f":"\"//notes-share-capital-statement-of-changes-numberof-shares-previous-specification \" & BasisOfPreparationAxis & \" \"  & INDEX(labels!$A$446:$C$446,1,MATCH(PP_Language,labels!$A$1:$C$1,0)) &  \" \"  & INDEX(labels!$A$103:$C$103,1,MATCH(PP_Language,labels!$A$1:$C$1,0)) &  \" {\"&COLUMN($F$586)&\"}\"","v":"//notes-share-capital-statement-of-changes-numberof-shares-previous-specification Commercial Share capital (number of shares) Separate {6}"},{"$f":"\"//notes-share-capital-statement-of-changes-numberof-shares-previous-specification \" & BasisOfPreparationAxis & \" \"  & INDEX(labels!$A$446:$C$446,1,MATCH(PP_Language,labels!$A$1:$C$1,0)) &  \" \"  & INDEX(labels!$A$103:$C$103,1,MATCH(PP_Language,labels!$A$1:$C$1,0)) &  \" {\"&COLUMN($G$586)&\"}\"","v":"//notes-share-capital-statement-of-changes-numberof-shares-previous-specification Commercial Share capital (number of shares) Separate {7}"},{"$f":"\"//notes-share-capital-statement-of-changes-numberof-shares-previous-specification \" & BasisOfPreparationAxis & \" \"  & INDEX(labels!$A$446:$C$446,1,MATCH(PP_Language,labels!$A$1:$C$1,0)) &  \" \"  & INDEX(labels!$A$103:$C$103,1,MATCH(PP_Language,labels!$A$1:$C$1,0)) &  \" {\"&COLUMN($H$586)&\"}\"","v":"//notes-share-capital-statement-of-changes-numberof-shares-previous-specification Commercial Share capital (number of shares) Separate {8}"}]
[null,{"$f":"INDEX(labels!$A$460:$C$460,1,MATCH(PP_Language,labels!$A$1:$C$1,0))","v":"Notes to the financial statements - Share capital"}]
[null,null,null,null,null,null,null,null,null,null,null,null,null,null,null,null,null,null,null,null,null,null,null,null,null,{"$f":"\"/notes-share-capital label {\"&COLUMN($B$588)&\"}\"","v":"/notes-share-capital label {2}"},null,{"$f":"\"/notes-share-capital \" & BasisOfPreparationAxis & \" \"  & INDEX(labels!$A$103:$C$103,1,MATCH(PP_Language,labels!$A$1:$C$1,0)) &  \" \"  &  \" {\"&COLUMN($D$588)&\"}\"","v":"/notes-share-capital Commercial Separate  {4}"}]
[null,{"$f":"INDEX(labels!$A$461:$C$461,1,MATCH(PP_Language,labels!$A$1:$C$1,0))","v":"Disclosure of share capital paid called up"}]
[null,{"$f":"INDEX(labels!$A$462:$C$462,1,MATCH(PP_Language,labels!$A$1:$C$1,0))","v":"Disclosure of treasury shares"}]
[null,{"$f":"INDEX(labels!$A$463:$C$463,1,MATCH(PP_Language,labels!$A$1:$C$1,0))","v":"Description of the purchase or sale of treasury shares or certificates thereof"}]
[null,{"$f":"INDEX(labels!$A$464:$C$464,1,MATCH(PP_Language,labels!$A$1:$C$1,0))","v":"Indication of the manner in which payments have been made on shares that were due and payable during the financial year or were made voluntarily"}]
[null,null,null,null,null,null,null,null,null,null,null,null,null,null,null,null,null,null,null,null,null,null,null,null,null,{"$f":"\"//notes-share-capital label {\"&COLUMN($B$593)&\"}\"","v":"//notes-share-capital label {2}"},null,{"$f":"\"//notes-share-capital \" & BasisOfPreparationAxis & \" \"  & INDEX(labels!$A$103:$C$103,1,MATCH(PP_Language,labels!$A$1:$C$1,0)) &  \" \"  &  \" {\"&COLUMN($D$593)&\"}\"","v":"//notes-share-capital Commercial Separate  {4}"}]
[null,{"$f":"INDEX(labels!$A$465:$C$465,1,MATCH(PP_Language,labels!$A$1:$C$1,0))","v":"Notes to the financial statements - Share capital: Other amounts: Breakdown"}]
[]
[null,null,null,{"$f":"INDEX(labels!$A$102:$C$102,1,MATCH(PP_Language,labels!$A$1:$C$1,0))","v":"Current"},null,{"$f":"INDEX(labels!$A$104:$C$104,1,MATCH(PP_Language,labels!$A$1:$C$1,0))","v":"Previous"},null,null,null,null,null,null,null,null,null,null,null,null,null,null,null,null,null,null,null,{"$f":"\"/notes-share-capital-other-amounts-breakdown label {\"&COLUMN($B$596)&\"}\"","v":"/notes-share-capital-other-amounts-breakdown label {2}"},null,{"$f":"\"/notes-share-capital-other-amounts-breakdown \" & BasisOfPreparationAxis & \" \"  & INDEX(labels!$A$103:$C$103,1,MATCH(PP_Language,labels!$A$1:$C$1,0)) &  \" \"  & INDEX(labels!$A$102:$C$102,1,MATCH(PP_Language,labels!$A$1:$C$1,0)) &  \" {\"&COLUMN($D$596)&\"}\"","v":"/notes-share-capital-other-amounts-breakdown Commercial Separate Current {4}"},null,{"$f":"\"/notes-share-capital-other-amounts-breakdown \" & BasisOfPreparationAxis & \" \"  & INDEX(labels!$A$103:$C$103,1,MATCH(PP_Language,labels!$A$1:$C$1,0)) &  \" \"  & INDEX(labels!$A$104:$C$104,1,MATCH(PP_Language,labels!$A$1:$C$1,0)) &  \" {\"&COLUMN($F$596)&\"}\"","v":"/notes-share-capital-other-amounts-breakdown Commercial Separate Previous {6}"}]
[null,{"$f":"INDEX(labels!$A$466:$C$466,1,MATCH(PP_Language,labels!$A$1:$C$1,0))","v":"Share capital issued"}]
[null,{"$f":"INDEX(labels!$A$467:$C$467,1,MATCH(PP_Language,labels!$A$1:$C$1,0))","v":"Share capital paid"}]
[null,{"$f":"INDEX(labels!$A$468:$C$468,1,MATCH(PP_Language,labels!$A$1:$C$1,0))","v":"Registered capital"}]
[null,null,null,null,null,null,null,null,null,null,null,null,null,null,null,null,null,null,null,null,null,null,null,null,null,{"$f":"\"//notes-share-capital-other-amounts-breakdown label {\"&COLUMN($B$600)&\"}\"","v":"//notes-share-capital-other-amounts-breakdown label {2}"},null,{"$f":"\"//notes-share-capital-other-amounts-breakdown \" & BasisOfPreparationAxis & \" \"  & INDEX(labels!$A$103:$C$103,1,MATCH(PP_Language,labels!$A$1:$C$1,0)) &  \" \"  & INDEX(labels!$A$102:$C$102,1,MATCH(PP_Language,labels!$A$1:$C$1,0)) &  \" {\"&COLUMN($D$600)&\"}\"","v":"//notes-share-capital-other-amounts-breakdown Commercial Separate Current {4}"},null,{"$f":"\"//notes-share-capital-other-amounts-breakdown \" & BasisOfPreparationAxis & \" \"  & INDEX(labels!$A$103:$C$103,1,MATCH(PP_Language,labels!$A$1:$C$1,0)) &  \" \"  & INDEX(labels!$A$104:$C$104,1,MATCH(PP_Language,labels!$A$1:$C$1,0)) &  \" {\"&COLUMN($F$600)&\"}\"","v":"//notes-share-capital-other-amounts-breakdown Commercial Separate Previous {6}"}]
[null,{"$f":"INDEX(labels!$A$469:$C$469,1,MATCH(PP_Language,labels!$A$1:$C$1,0))","v":"Notes to the financial statements - Share capital: Specification"}]
[]
[]
[null,null,null,{"$f":"INDEX(labels!$A$444:$C$444,1,MATCH(PP_Language,labels!$A$1:$C$1,0))","v":"Share capital"},{"$f":"INDEX(labels!$A$444:$C$444,1,MATCH(PP_Language,labels!$A$1:$C$1,0))","v":"Share capital"},{"$f":"INDEX(labels!$A$444:$C$444,1,MATCH(PP_Language,labels!$A$1:$C$1,0))","v":"Share capital"},{"$f":"INDEX(labels!$A$444:$C$444,1,MATCH(PP_Language,labels!$A$1:$C$1,0))","v":"Share capital"},{"$f":"INDEX(labels!$A$444:$C$444,1,MATCH(PP_Language,labels!$A$1:$C$1,0))","v":"Share capital"},null,null,null,null,null,null,null,null,null,null,null,null,null,null,null,null,null,{"$f":"\"/notes-share-capital-specification label {\"&COLUMN($B$604)&\"}\"","v":"/notes-share-capital-specification label {2}"},null,{"$f":"\"/notes-share-capital-specification \" & BasisOfPreparationAxis & \" \"  & INDEX(labels!$A$103:$C$103,1,MATCH(PP_Language,labels!$A$1:$C$1,0)) &  \" \"  & INDEX(labels!$A$444:$C$444,1,MATCH(PP_Language,labels!$A$1:$C$1,0)) &  \" {\"&COLUMN($D$604)&\"}\"","v":"/notes-share-capital-specification Commercial Separate Share capital {4}"},{"$f":"\"/notes-share-capital-specification \" & BasisOfPreparationAxis & \" \"  & INDEX(labels!$A$103:$C$103,1,MATCH(PP_Language,labels!$A$1:$C$1,0)) &  \" \"  & INDEX(labels!$A$444:$C$444,1,MATCH(PP_Language,labels!$A$1:$C$1,0)) &  \" {\"&COLUMN($E$604)&\"}\"","v":"/notes-share-capital-specification Commercial Separate Share capital {5}"},{"$f":"\"/notes-share-capital-specification \" & BasisOfPreparationAxis & \" \"  & INDEX(labels!$A$103:$C$103,1,MATCH(PP_Language,labels!$A$1:$C$1,0)) &  \" \"  & INDEX(labels!$A$444:$C$444,1,MATCH(PP_Language,labels!$A$1:$C$1,0)) &  \" {\"&COLUMN($F$604)&\"}\"","v":"/notes-share-capital-specification Commercial Separate Share capital {6}"},{"$f":"\"/notes-share-capital-specification \" & BasisOfPreparationAxis & \" \"  & INDEX(labels!$A$103:$C$103,1,MATCH(PP_Language,labels!$A$1:$C$1,0)) &  \" \"  & INDEX(labels!$A$444:$C$444,1,MATCH(PP_Language,labels!$A$1:$C$1,0)) &  \" {\"&COLUMN($G$604)&\"}\"","v":"/notes-share-capital-specification Commercial Separate Share capital {7}"},{"$f":"\"/notes-share-capital-specification \" & BasisOfPreparationAxis & \" \"  & INDEX(labels!$A$103:$C$103,1,MATCH(PP_Language,labels!$A$1:$C$1,0)) &  \" \"  & INDEX(labels!$A$444:$C$444,1,MATCH(PP_Language,labels!$A$1:$C$1,0)) &  \" {\"&COLUMN($H$604)&\"}\"","v":"/notes-share-capital-specification Commercial Separate Share capital {8}"}]
[null,{"$f":"INDEX(labels!$A$470:$C$470,1,MATCH(PP_Language,labels!$A$1:$C$1,0))","v":"Description Share capital"}]
[null,{"$f":"INDEX(labels!$A$461:$C$461,1,MATCH(PP_Language,labels!$A$1:$C$1,0))","v":"Disclosure of share capital paid called up"}]
[null,{"$f":"INDEX(labels!$A$172:$C$172,1,MATCH(PP_Language,labels!$A$1:$C$1,0))","v":"Presentation order"}]
[null,null,null,null,null,null,null,null,null,null,null,null,null,null,null,null,null,null,null,null,null,null,null,null,null,{"$f":"\"//notes-share-capital-specification label {\"&COLUMN($B$608)&\"}\"","v":"//notes-share-capital-specification label {2}"},null,{"$f":"\"//notes-share-capital-specification \" & BasisOfPreparationAxis & \" \"  & INDEX(labels!$A$103:$C$103,1,MATCH(PP_Language,labels!$A$1:$C$1,0)) &  \" \"  & INDEX(labels!$A$444:$C$444,1,MATCH(PP_Language,labels!$A$1:$C$1,0)) &  \" {\"&COLUMN($D$608)&\"}\"","v":"//notes-share-capital-specification Commercial Separate Share capital {4}"},{"$f":"\"//notes-share-capital-specification \" & BasisOfPreparationAxis & \" \"  & INDEX(labels!$A$103:$C$103,1,MATCH(PP_Language,labels!$A$1:$C$1,0)) &  \" \"  & INDEX(labels!$A$444:$C$444,1,MATCH(PP_Language,labels!$A$1:$C$1,0)) &  \" {\"&COLUMN($E$608)&\"}\"","v":"//notes-share-capital-specification Commercial Separate Share capital {5}"},{"$f":"\"//notes-share-capital-specification \" & BasisOfPreparationAxis & \" \"  & INDEX(labels!$A$103:$C$103,1,MATCH(PP_Language,labels!$A$1:$C$1,0)) &  \" \"  & INDEX(labels!$A$444:$C$444,1,MATCH(PP_Language,labels!$A$1:$C$1,0)) &  \" {\"&COLUMN($F$608)&\"}\"","v":"//notes-share-capital-specification Commercial Separate Share capital {6}"},{"$f":"\"//notes-share-capital-specification \" & BasisOfPreparationAxis & \" \"  & INDEX(labels!$A$103:$C$103,1,MATCH(PP_Language,labels!$A$1:$C$1,0)) &  \" \"  & INDEX(labels!$A$444:$C$444,1,MATCH(PP_Language,labels!$A$1:$C$1,0)) &  \" {\"&COLUMN($G$608)&\"}\"","v":"//notes-share-capital-specification Commercial Separate Share capital {7}"},{"$f":"\"//notes-share-capital-specification \" & BasisOfPreparationAxis & \" \"  & INDEX(labels!$A$103:$C$103,1,MATCH(PP_Language,labels!$A$1:$C$1,0)) &  \" \"  & INDEX(labels!$A$444:$C$444,1,MATCH(PP_Language,labels!$A$1:$C$1,0)) &  \" {\"&COLUMN($H$608)&\"}\"","v":"//notes-share-capital-specification Commercial Separate Share capital {8}"}]
[null,{"$f":"INDEX(labels!$A$111:$C$111,1,MATCH(PP_Language,labels!$A$1:$C$1,0))","v":"Share premium"}]
[null,{"$f":"INDEX(labels!$A$471:$C$471,1,MATCH(PP_Language,labels!$A$1:$C$1,0))","v":"Notes to the financial statements - Share premium"}]
[null,null,null,null,null,null,null,null,null,null,null,null,null,null,null,null,null,null,null,null,null,null,null,null,null,{"$f":"\"/notes-share-premium label {\"&COLUMN($B$611)&\"}\"","v":"/notes-share-premium label {2}"},null,{"$f":"\"/notes-share-premium \" & BasisOfPreparationAxis & \" \"  & INDEX(labels!$A$103:$C$103,1,MATCH(PP_Language,labels!$A$1:$C$1,0)) &  \" \"  &  \" {\"&COLUMN($D$611)&\"}\"","v":"/notes-share-premium Commercial Separate  {4}"}]
[null,{"$f":"INDEX(labels!$A$472:$C$472,1,MATCH(PP_Language,labels!$A$1:$C$1,0))","v":"Disclosure of share premium"}]
[null,null,null,null,null,null,null,null,null,null,null,null,null,null,null,null,null,null,null,null,null,null,null,null,null,{"$f":"\"//notes-share-premium label {\"&COLUMN($B$613)&\"}\"","v":"//notes-share-premium label {2}"},null,{"$f":"\"//notes-share-premium \" & BasisOfPreparationAxis & \" \"  & INDEX(labels!$A$103:$C$103,1,MATCH(PP_Language,labels!$A$1:$C$1,0)) &  \" \"  &  \" {\"&COLUMN($D$613)&\"}\"","v":"//notes-share-premium Commercial Separate  {4}"}]
[null,{"$f":"INDEX(labels!$A$473:$C$473,1,MATCH(PP_Language,labels!$A$1:$C$1,0))","v":"Revaluation reserve"}]
[null,{"$f":"INDEX(labels!$A$474:$C$474,1,MATCH(PP_Language,labels!$A$1:$C$1,0))","v":"Notes to the financial statements - Revaluation reserve: Statement of changes"}]
[]
[]
[null,null,null,{"$f":"INDEX(labels!$A$475:$C$475,1,MATCH(PP_Language,labels!$A$1:$C$1,0))","v":"Changes in value of assets, except for financial instruments, recognised directly through equity"},{"$f":"INDEX(labels!$A$476:$C$476,1,MATCH(PP_Language,labels!$A$1:$C$1,0))","v":"Changes in value of financial instruments recognised directly through equity"},{"$f":"INDEX(labels!$A$477:$C$477,1,MATCH(PP_Language,labels!$A$1:$C$1,0))","v":"Total of recognised directly through equity"},{"$f":"INDEX(labels!$A$478:$C$478,1,MATCH(PP_Language,labels!$A$1:$C$1,0))","v":"Hedged"},{"$f":"INDEX(labels!$A$479:$C$479,1,MATCH(PP_Language,labels!$A$1:$C$1,0))","v":"No price quotation in active market"},{"$f":"INDEX(labels!$A$480:$C$480,1,MATCH(PP_Language,labels!$A$1:$C$1,0))","v":"Total of revaluation reserves"},null,null,null,null,null,null,null,null,null,null,null,null,null,null,null,null,{"$f":"\"/notes-revaluation-reserve-statement-of-changes label {\"&COLUMN($B$618)&\"}\"","v":"/notes-revaluation-reserve-statement-of-changes label {2}"},null,{"$f":"\"/notes-revaluation-reserve-statement-of-changes \" & BasisOfPreparationAxis & \" \"  & INDEX(labels!$A$475:$C$475,1,MATCH(PP_Language,labels!$A$1:$C$1,0)) &  \" \"  & INDEX(labels!$A$103:$C$103,1,MATCH(PP_Language,labels!$A$1:$C$1,0)) &  \" {\"&COLUMN($D$618)&\"}\"","v":"/notes-revaluation-reserve-statement-of-changes Commercial Changes in value of assets, except for financial instruments, recognised directly through equity Separate {4}"},{"$f":"\"/notes-revaluation-reserve-statement-of-changes \" & BasisOfPreparationAxis & \" \"  & INDEX(labels!$A$476:$C$476,1,MATCH(PP_Language,labels!$A$1:$C$1,0)) &  \" \"  & INDEX(labels!$A$103:$C$103,1,MATCH(PP_Language,labels!$A$1:$C$1,0)) &  \" {\"&COLUMN($E$618)&\"}\"","v":"/notes-revaluation-reserve-statement-of-changes Commercial Changes in value of financial instruments recognised directly through equity Separate {5}"},{"$f":"\"/notes-revaluation-reserve-statement-of-changes \" & BasisOfPreparationAxis & \" \"  & INDEX(labels!$A$477:$C$477,1,MATCH(PP_Language,labels!$A$1:$C$1,0)) &  \" \"  & INDEX(labels!$A$103:$C$103,1,MATCH(PP_Language,labels!$A$1:$C$1,0)) &  \" {\"&COLUMN($F$618)&\"}\"","v":"/notes-revaluation-reserve-statement-of-changes Commercial Total of recognised directly through equity Separate {6}"},{"$f":"\"/notes-revaluation-reserve-statement-of-changes \" & BasisOfPreparationAxis & \" \"  & INDEX(labels!$A$478:$C$478,1,MATCH(PP_Language,labels!$A$1:$C$1,0)) &  \" \"  & INDEX(labels!$A$103:$C$103,1,MATCH(PP_Language,labels!$A$1:$C$1,0)) &  \" {\"&COLUMN($G$618)&\"}\"","v":"/notes-revaluation-reserve-statement-of-changes Commercial Hedged Separate {7}"},{"$f":"\"/notes-revaluation-reserve-statement-of-changes \" & BasisOfPreparationAxis & \" \"  & INDEX(labels!$A$479:$C$479,1,MATCH(PP_Language,labels!$A$1:$C$1,0)) &  \" \"  & INDEX(labels!$A$103:$C$103,1,MATCH(PP_Language,labels!$A$1:$C$1,0)) &  \" {\"&COLUMN($H$618)&\"}\"","v":"/notes-revaluation-reserve-statement-of-changes Commercial No price quotation in active market Separate {8}"},{"$f":"\"/notes-revaluation-reserve-statement-of-changes \" & BasisOfPreparationAxis & \" \"  & INDEX(labels!$A$480:$C$480,1,MATCH(PP_Language,labels!$A$1:$C$1,0)) &  \" \"  & INDEX(labels!$A$103:$C$103,1,MATCH(PP_Language,labels!$A$1:$C$1,0)) &  \" {\"&COLUMN($I$618)&\"}\"","v":"/notes-revaluation-reserve-statement-of-changes Commercial Total of revaluation reserves Separate {9}"}]
[null,{"$f":"INDEX(labels!$A$481:$C$481,1,MATCH(PP_Language,labels!$A$1:$C$1,0))","v":"Revaluation reserve at the beginning of the period"}]
[null,{"$f":"INDEX(labels!$A$482:$C$482,1,MATCH(PP_Language,labels!$A$1:$C$1,0))","v":"Movement of revaluation reserve as a result of change in accounting policies"}]
[null,{"$f":"INDEX(labels!$A$483:$C$483,1,MATCH(PP_Language,labels!$A$1:$C$1,0))","v":"Movement of revaluation reserve as a result of tax impact of change in accounting policies"}]
[null,{"$f":"INDEX(labels!$A$484:$C$484,1,MATCH(PP_Language,labels!$A$1:$C$1,0))","v":"Adjusted revaluation reserve after recalculation due to change in accounting policies"}]
[]
[null,{"$f":"INDEX(labels!$A$485:$C$485,1,MATCH(PP_Language,labels!$A$1:$C$1,0))","v":"Realised revaluations through the income statement"}]
[null,{"$f":"INDEX(labels!$A$486:$C$486,1,MATCH(PP_Language,labels!$A$1:$C$1,0))","v":"Realised revaluations through the other reserves"}]
[null,{"$f":"INDEX(labels!$A$487:$C$487,1,MATCH(PP_Language,labels!$A$1:$C$1,0))","v":"Realised revaluations through hedged assets and liabilities"}]
[null,{"$f":"INDEX(labels!$A$488:$C$488,1,MATCH(PP_Language,labels!$A$1:$C$1,0))","v":"Tax impact of realised revaluations"}]
[null,{"$f":"INDEX(labels!$A$489:$C$489,1,MATCH(PP_Language,labels!$A$1:$C$1,0))","v":"Revaluations through the income statement"}]
[null,{"$f":"INDEX(labels!$A$490:$C$490,1,MATCH(PP_Language,labels!$A$1:$C$1,0))","v":"Revaluations through the other reserves"}]
[null,{"$f":"INDEX(labels!$A$491:$C$491,1,MATCH(PP_Language,labels!$A$1:$C$1,0))","v":"Revaluations through hedged assets and liabilities"}]
[null,{"$f":"INDEX(labels!$A$492:$C$492,1,MATCH(PP_Language,labels!$A$1:$C$1,0))","v":"Tax impact of revaluations"}]
[]
[null,{"$f":"INDEX(labels!$A$456:$C$456,1,MATCH(PP_Language,labels!$A$1:$C$1,0))","v":"Total of movements during the period"},null,{"$f":"IF(OR(NOT(AND(Stamdata!$D$627=\"\",Stamdata!$D$628=\"\",Stamdata!$D$629=\"\",Stamdata!$D$630=\"\")),NOT(AND(Stamdata!$D$624=\"\",Stamdata!$D$625=\"\",Stamdata!$D$626=\"\",Stamdata!$D$631=\"\"))), SUM(Stamdata!$D$627,Stamdata!$D$628,Stamdata!$D$629,Stamdata!$D$630)- SUM(Stamdata!$D$624,Stamdata!$D$625,Stamdata!$D$626,Stamdata!$D$631),\"\")","v":""},{"$f":"IF(OR(NOT(AND(Stamdata!$E$627=\"\",Stamdata!$E$628=\"\",Stamdata!$E$629=\"\",Stamdata!$E$630=\"\")),NOT(AND(Stamdata!$E$624=\"\",Stamdata!$E$625=\"\",Stamdata!$E$626=\"\",Stamdata!$E$631=\"\"))), SUM(Stamdata!$E$627,Stamdata!$E$628,Stamdata!$E$629,Stamdata!$E$630)- SUM(Stamdata!$E$624,Stamdata!$E$625,Stamdata!$E$626,Stamdata!$E$631),\"\")","v":""},{"$f":"IF(OR(NOT(AND(Stamdata!$F$627=\"\",Stamdata!$F$628=\"\",Stamdata!$F$629=\"\",Stamdata!$F$630=\"\")),NOT(AND(Stamdata!$F$624=\"\",Stamdata!$F$625=\"\",Stamdata!$F$626=\"\",Stamdata!$F$631=\"\"))), SUM(Stamdata!$F$627,Stamdata!$F$628,Stamdata!$F$629,Stamdata!$F$630)- SUM(Stamdata!$F$624,Stamdata!$F$625,Stamdata!$F$626,Stamdata!$F$631),\"\")","v":""},{"$f":"IF(OR(NOT(AND(Stamdata!$G$627=\"\",Stamdata!$G$628=\"\",Stamdata!$G$629=\"\",Stamdata!$G$630=\"\")),NOT(AND(Stamdata!$G$624=\"\",Stamdata!$G$625=\"\",Stamdata!$G$626=\"\",Stamdata!$G$631=\"\"))), SUM(Stamdata!$G$627,Stamdata!$G$628,Stamdata!$G$629,Stamdata!$G$630)- SUM(Stamdata!$G$624,Stamdata!$G$625,Stamdata!$G$626,Stamdata!$G$631),\"\")","v":""},{"$f":"IF(OR(NOT(AND(Stamdata!$H$627=\"\",Stamdata!$H$628=\"\",Stamdata!$H$629=\"\",Stamdata!$H$630=\"\")),NOT(AND(Stamdata!$H$624=\"\",Stamdata!$H$625=\"\",Stamdata!$H$626=\"\",Stamdata!$H$631=\"\"))), SUM(Stamdata!$H$627,Stamdata!$H$628,Stamdata!$H$629,Stamdata!$H$630)- SUM(Stamdata!$H$624,Stamdata!$H$625,Stamdata!$H$626,Stamdata!$H$631),\"\")","v":""},{"$f":"IF(OR(NOT(AND(Stamdata!$I$627=\"\",Stamdata!$I$628=\"\",Stamdata!$I$629=\"\",Stamdata!$I$630=\"\")),NOT(AND(Stamdata!$I$624=\"\",Stamdata!$I$625=\"\",Stamdata!$I$626=\"\",Stamdata!$I$631=\"\"))), SUM(Stamdata!$I$627,Stamdata!$I$628,Stamdata!$I$629,Stamdata!$I$630)- SUM(Stamdata!$I$624,Stamdata!$I$625,Stamdata!$I$626,Stamdata!$I$631),\"\")","v":""}]
[]
[null,{"$f":"INDEX(labels!$A$493:$C$493,1,MATCH(PP_Language,labels!$A$1:$C$1,0))","v":"Revaluation reserve at the end of the period"}]
[null,null,null,null,null,null,null,null,null,null,null,null,null,null,null,null,null,null,null,null,null,null,null,null,null,{"$f":"\"//notes-revaluation-reserve-statement-of-changes label {\"&COLUMN($B$636)&\"}\"","v":"//notes-revaluation-reserve-statement-of-changes label {2}"},null,{"$f":"\"//notes-revaluation-reserve-statement-of-changes \" & BasisOfPreparationAxis & \" \"  & INDEX(labels!$A$475:$C$475,1,MATCH(PP_Language,labels!$A$1:$C$1,0)) &  \" \"  & INDEX(labels!$A$103:$C$103,1,MATCH(PP_Language,labels!$A$1:$C$1,0)) &  \" {\"&COLUMN($D$636)&\"}\"","v":"//notes-revaluation-reserve-statement-of-changes Commercial Changes in value of assets, except for financial instruments, recognised directly through equity Separate {4}"},{"$f":"\"//notes-revaluation-reserve-statement-of-changes \" & BasisOfPreparationAxis & \" \"  & INDEX(labels!$A$476:$C$476,1,MATCH(PP_Language,labels!$A$1:$C$1,0)) &  \" \"  & INDEX(labels!$A$103:$C$103,1,MATCH(PP_Language,labels!$A$1:$C$1,0)) &  \" {\"&COLUMN($E$636)&\"}\"","v":"//notes-revaluation-reserve-statement-of-changes Commercial Changes in value of financial instruments recognised directly through equity Separate {5}"},{"$f":"\"//notes-revaluation-reserve-statement-of-changes \" & BasisOfPreparationAxis & \" \"  & INDEX(labels!$A$477:$C$477,1,MATCH(PP_Language,labels!$A$1:$C$1,0)) &  \" \"  & INDEX(labels!$A$103:$C$103,1,MATCH(PP_Language,labels!$A$1:$C$1,0)) &  \" {\"&COLUMN($F$636)&\"}\"","v":"//notes-revaluation-reserve-statement-of-changes Commercial Total of recognised directly through equity Separate {6}"},{"$f":"\"//notes-revaluation-reserve-statement-of-changes \" & BasisOfPreparationAxis & \" \"  & INDEX(labels!$A$478:$C$478,1,MATCH(PP_Language,labels!$A$1:$C$1,0)) &  \" \"  & INDEX(labels!$A$103:$C$103,1,MATCH(PP_Language,labels!$A$1:$C$1,0)) &  \" {\"&COLUMN($G$636)&\"}\"","v":"//notes-revaluation-reserve-statement-of-changes Commercial Hedged Separate {7}"},{"$f":"\"//notes-revaluation-reserve-statement-of-changes \" & BasisOfPreparationAxis & \" \"  & INDEX(labels!$A$479:$C$479,1,MATCH(PP_Language,labels!$A$1:$C$1,0)) &  \" \"  & INDEX(labels!$A$103:$C$103,1,MATCH(PP_Language,labels!$A$1:$C$1,0)) &  \" {\"&COLUMN($H$636)&\"}\"","v":"//notes-revaluation-reserve-statement-of-changes Commercial No price quotation in active market Separate {8}"},{"$f":"\"//notes-revaluation-reserve-statement-of-changes \" & BasisOfPreparationAxis & \" \"  & INDEX(labels!$A$480:$C$480,1,MATCH(PP_Language,labels!$A$1:$C$1,0)) &  \" \"  & INDEX(labels!$A$103:$C$103,1,MATCH(PP_Language,labels!$A$1:$C$1,0)) &  \" {\"&COLUMN($I$636)&\"}\"","v":"//notes-revaluation-reserve-statement-of-changes Commercial Total of revaluation reserves Separate {9}"}]
[null,{"$f":"INDEX(labels!$A$494:$C$494,1,MATCH(PP_Language,labels!$A$1:$C$1,0))","v":"Notes to the financial statements - Revaluation reserve, previous period: Statement of changes"}]
[]
[]
[null,null,null,{"$f":"INDEX(labels!$A$475:$C$475,1,MATCH(PP_Language,labels!$A$1:$C$1,0))","v":"Changes in value of assets, except for financial instruments, recognised directly through equity"},{"$f":"INDEX(labels!$A$476:$C$476,1,MATCH(PP_Language,labels!$A$1:$C$1,0))","v":"Changes in value of financial instruments recognised directly through equity"},{"$f":"INDEX(labels!$A$477:$C$477,1,MATCH(PP_Language,labels!$A$1:$C$1,0))","v":"Total of recognised directly through equity"},{"$f":"INDEX(labels!$A$478:$C$478,1,MATCH(PP_Language,labels!$A$1:$C$1,0))","v":"Hedged"},{"$f":"INDEX(labels!$A$479:$C$479,1,MATCH(PP_Language,labels!$A$1:$C$1,0))","v":"No price quotation in active market"},{"$f":"INDEX(labels!$A$480:$C$480,1,MATCH(PP_Language,labels!$A$1:$C$1,0))","v":"Total of revaluation reserves"},null,null,null,null,null,null,null,null,null,null,null,null,null,null,null,null,{"$f":"\"/notes-revaluation-reserve-statement-of-changes-previous label {\"&COLUMN($B$640)&\"}\"","v":"/notes-revaluation-reserve-statement-of-changes-previous label {2}"},null,{"$f":"\"/notes-revaluation-reserve-statement-of-changes-previous \" & BasisOfPreparationAxis & \" \"  & INDEX(labels!$A$475:$C$475,1,MATCH(PP_Language,labels!$A$1:$C$1,0)) &  \" \"  & INDEX(labels!$A$103:$C$103,1,MATCH(PP_Language,labels!$A$1:$C$1,0)) &  \" {\"&COLUMN($D$640)&\"}\"","v":"/notes-revaluation-reserve-statement-of-changes-previous Commercial Changes in value of assets, except for financial instruments, recognised directly through equity Separate {4}"},{"$f":"\"/notes-revaluation-reserve-statement-of-changes-previous \" & BasisOfPreparationAxis & \" \"  & INDEX(labels!$A$476:$C$476,1,MATCH(PP_Language,labels!$A$1:$C$1,0)) &  \" \"  & INDEX(labels!$A$103:$C$103,1,MATCH(PP_Language,labels!$A$1:$C$1,0)) &  \" {\"&COLUMN($E$640)&\"}\"","v":"/notes-revaluation-reserve-statement-of-changes-previous Commercial Changes in value of financial instruments recognised directly through equity Separate {5}"},{"$f":"\"/notes-revaluation-reserve-statement-of-changes-previous \" & BasisOfPreparationAxis & \" \"  & INDEX(labels!$A$477:$C$477,1,MATCH(PP_Language,labels!$A$1:$C$1,0)) &  \" \"  & INDEX(labels!$A$103:$C$103,1,MATCH(PP_Language,labels!$A$1:$C$1,0)) &  \" {\"&COLUMN($F$640)&\"}\"","v":"/notes-revaluation-reserve-statement-of-changes-previous Commercial Total of recognised directly through equity Separate {6}"},{"$f":"\"/notes-revaluation-reserve-statement-of-changes-previous \" & BasisOfPreparationAxis & \" \"  & INDEX(labels!$A$478:$C$478,1,MATCH(PP_Language,labels!$A$1:$C$1,0)) &  \" \"  & INDEX(labels!$A$103:$C$103,1,MATCH(PP_Language,labels!$A$1:$C$1,0)) &  \" {\"&COLUMN($G$640)&\"}\"","v":"/notes-revaluation-reserve-statement-of-changes-previous Commercial Hedged Separate {7}"},{"$f":"\"/notes-revaluation-reserve-statement-of-changes-previous \" & BasisOfPreparationAxis & \" \"  & INDEX(labels!$A$479:$C$479,1,MATCH(PP_Language,labels!$A$1:$C$1,0)) &  \" \"  & INDEX(labels!$A$103:$C$103,1,MATCH(PP_Language,labels!$A$1:$C$1,0)) &  \" {\"&COLUMN($H$640)&\"}\"","v":"/notes-revaluation-reserve-statement-of-changes-previous Commercial No price quotation in active market Separate {8}"},{"$f":"\"/notes-revaluation-reserve-statement-of-changes-previous \" & BasisOfPreparationAxis & \" \"  & INDEX(labels!$A$480:$C$480,1,MATCH(PP_Language,labels!$A$1:$C$1,0)) &  \" \"  & INDEX(labels!$A$103:$C$103,1,MATCH(PP_Language,labels!$A$1:$C$1,0)) &  \" {\"&COLUMN($I$640)&\"}\"","v":"/notes-revaluation-reserve-statement-of-changes-previous Commercial Total of revaluation reserves Separate {9}"}]
[null,{"$f":"INDEX(labels!$A$481:$C$481,1,MATCH(PP_Language,labels!$A$1:$C$1,0))","v":"Revaluation reserve at the beginning of the period"}]
[null,{"$f":"INDEX(labels!$A$482:$C$482,1,MATCH(PP_Language,labels!$A$1:$C$1,0))","v":"Movement of revaluation reserve as a result of change in accounting policies"}]
[null,{"$f":"INDEX(labels!$A$483:$C$483,1,MATCH(PP_Language,labels!$A$1:$C$1,0))","v":"Movement of revaluation reserve as a result of tax impact of change in accounting policies"}]
[null,{"$f":"INDEX(labels!$A$484:$C$484,1,MATCH(PP_Language,labels!$A$1:$C$1,0))","v":"Adjusted revaluation reserve after recalculation due to change in accounting policies"}]
[]
[null,{"$f":"INDEX(labels!$A$485:$C$485,1,MATCH(PP_Language,labels!$A$1:$C$1,0))","v":"Realised revaluations through the income statement"}]
[null,{"$f":"INDEX(labels!$A$486:$C$486,1,MATCH(PP_Language,labels!$A$1:$C$1,0))","v":"Realised revaluations through the other reserves"}]
[null,{"$f":"INDEX(labels!$A$487:$C$487,1,MATCH(PP_Language,labels!$A$1:$C$1,0))","v":"Realised revaluations through hedged assets and liabilities"}]
[null,{"$f":"INDEX(labels!$A$488:$C$488,1,MATCH(PP_Language,labels!$A$1:$C$1,0))","v":"Tax impact of realised revaluations"}]
[null,{"$f":"INDEX(labels!$A$489:$C$489,1,MATCH(PP_Language,labels!$A$1:$C$1,0))","v":"Revaluations through the income statement"}]
[null,{"$f":"INDEX(labels!$A$490:$C$490,1,MATCH(PP_Language,labels!$A$1:$C$1,0))","v":"Revaluations through the other reserves"}]
[null,{"$f":"INDEX(labels!$A$491:$C$491,1,MATCH(PP_Language,labels!$A$1:$C$1,0))","v":"Revaluations through hedged assets and liabilities"}]
[null,{"$f":"INDEX(labels!$A$492:$C$492,1,MATCH(PP_Language,labels!$A$1:$C$1,0))","v":"Tax impact of revaluations"}]
[]
[null,{"$f":"INDEX(labels!$A$456:$C$456,1,MATCH(PP_Language,labels!$A$1:$C$1,0))","v":"Total of movements during the period"},null,{"$f":"IF(OR(NOT(AND(Stamdata!$D$649=\"\",Stamdata!$D$650=\"\",Stamdata!$D$651=\"\",Stamdata!$D$652=\"\")),NOT(AND(Stamdata!$D$646=\"\",Stamdata!$D$647=\"\",Stamdata!$D$648=\"\",Stamdata!$D$653=\"\"))), SUM(Stamdata!$D$649,Stamdata!$D$650,Stamdata!$D$651,Stamdata!$D$652)- SUM(Stamdata!$D$646,Stamdata!$D$647,Stamdata!$D$648,Stamdata!$D$653),\"\")","v":""},{"$f":"IF(OR(NOT(AND(Stamdata!$E$649=\"\",Stamdata!$E$650=\"\",Stamdata!$E$651=\"\",Stamdata!$E$652=\"\")),NOT(AND(Stamdata!$E$646=\"\",Stamdata!$E$647=\"\",Stamdata!$E$648=\"\",Stamdata!$E$653=\"\"))), SUM(Stamdata!$E$649,Stamdata!$E$650,Stamdata!$E$651,Stamdata!$E$652)- SUM(Stamdata!$E$646,Stamdata!$E$647,Stamdata!$E$648,Stamdata!$E$653),\"\")","v":""},{"$f":"IF(OR(NOT(AND(Stamdata!$F$649=\"\",Stamdata!$F$650=\"\",Stamdata!$F$651=\"\",Stamdata!$F$652=\"\")),NOT(AND(Stamdata!$F$646=\"\",Stamdata!$F$647=\"\",Stamdata!$F$648=\"\",Stamdata!$F$653=\"\"))), SUM(Stamdata!$F$649,Stamdata!$F$650,Stamdata!$F$651,Stamdata!$F$652)- SUM(Stamdata!$F$646,Stamdata!$F$647,Stamdata!$F$648,Stamdata!$F$653),\"\")","v":""},{"$f":"IF(OR(NOT(AND(Stamdata!$G$649=\"\",Stamdata!$G$650=\"\",Stamdata!$G$651=\"\",Stamdata!$G$652=\"\")),NOT(AND(Stamdata!$G$646=\"\",Stamdata!$G$647=\"\",Stamdata!$G$648=\"\",Stamdata!$G$653=\"\"))), SUM(Stamdata!$G$649,Stamdata!$G$650,Stamdata!$G$651,Stamdata!$G$652)- SUM(Stamdata!$G$646,Stamdata!$G$647,Stamdata!$G$648,Stamdata!$G$653),\"\")","v":""},{"$f":"IF(OR(NOT(AND(Stamdata!$H$649=\"\",Stamdata!$H$650=\"\",Stamdata!$H$651=\"\",Stamdata!$H$652=\"\")),NOT(AND(Stamdata!$H$646=\"\",Stamdata!$H$647=\"\",Stamdata!$H$648=\"\",Stamdata!$H$653=\"\"))), SUM(Stamdata!$H$649,Stamdata!$H$650,Stamdata!$H$651,Stamdata!$H$652)- SUM(Stamdata!$H$646,Stamdata!$H$647,Stamdata!$H$648,Stamdata!$H$653),\"\")","v":""},{"$f":"IF(OR(NOT(AND(Stamdata!$I$649=\"\",Stamdata!$I$650=\"\",Stamdata!$I$651=\"\",Stamdata!$I$652=\"\")),NOT(AND(Stamdata!$I$646=\"\",Stamdata!$I$647=\"\",Stamdata!$I$648=\"\",Stamdata!$I$653=\"\"))), SUM(Stamdata!$I$649,Stamdata!$I$650,Stamdata!$I$651,Stamdata!$I$652)- SUM(Stamdata!$I$646,Stamdata!$I$647,Stamdata!$I$648,Stamdata!$I$653),\"\")","v":""}]
[]
[null,{"$f":"INDEX(labels!$A$493:$C$493,1,MATCH(PP_Language,labels!$A$1:$C$1,0))","v":"Revaluation reserve at the end of the period"}]
[null,null,null,null,null,null,null,null,null,null,null,null,null,null,null,null,null,null,null,null,null,null,null,null,null,{"$f":"\"//notes-revaluation-reserve-statement-of-changes-previous label {\"&COLUMN($B$658)&\"}\"","v":"//notes-revaluation-reserve-statement-of-changes-previous label {2}"},null,{"$f":"\"//notes-revaluation-reserve-statement-of-changes-previous \" & BasisOfPreparationAxis & \" \"  & INDEX(labels!$A$475:$C$475,1,MATCH(PP_Language,labels!$A$1:$C$1,0)) &  \" \"  & INDEX(labels!$A$103:$C$103,1,MATCH(PP_Language,labels!$A$1:$C$1,0)) &  \" {\"&COLUMN($D$658)&\"}\"","v":"//notes-revaluation-reserve-statement-of-changes-previous Commercial Changes in value of assets, except for financial instruments, recognised directly through equity Separate {4}"},{"$f":"\"//notes-revaluation-reserve-statement-of-changes-previous \" & BasisOfPreparationAxis & \" \"  & INDEX(labels!$A$476:$C$476,1,MATCH(PP_Language,labels!$A$1:$C$1,0)) &  \" \"  & INDEX(labels!$A$103:$C$103,1,MATCH(PP_Language,labels!$A$1:$C$1,0)) &  \" {\"&COLUMN($E$658)&\"}\"","v":"//notes-revaluation-reserve-statement-of-changes-previous Commercial Changes in value of financial instruments recognised directly through equity Separate {5}"},{"$f":"\"//notes-revaluation-reserve-statement-of-changes-previous \" & BasisOfPreparationAxis & \" \"  & INDEX(labels!$A$477:$C$477,1,MATCH(PP_Language,labels!$A$1:$C$1,0)) &  \" \"  & INDEX(labels!$A$103:$C$103,1,MATCH(PP_Language,labels!$A$1:$C$1,0)) &  \" {\"&COLUMN($F$658)&\"}\"","v":"//notes-revaluation-reserve-statement-of-changes-previous Commercial Total of recognised directly through equity Separate {6}"},{"$f":"\"//notes-revaluation-reserve-statement-of-changes-previous \" & BasisOfPreparationAxis & \" \"  & INDEX(labels!$A$478:$C$478,1,MATCH(PP_Language,labels!$A$1:$C$1,0)) &  \" \"  & INDEX(labels!$A$103:$C$103,1,MATCH(PP_Language,labels!$A$1:$C$1,0)) &  \" {\"&COLUMN($G$658)&\"}\"","v":"//notes-revaluation-reserve-statement-of-changes-previous Commercial Hedged Separate {7}"},{"$f":"\"//notes-revaluation-reserve-statement-of-changes-previous \" & BasisOfPreparationAxis & \" \"  & INDEX(labels!$A$479:$C$479,1,MATCH(PP_Language,labels!$A$1:$C$1,0)) &  \" \"  & INDEX(labels!$A$103:$C$103,1,MATCH(PP_Language,labels!$A$1:$C$1,0)) &  \" {\"&COLUMN($H$658)&\"}\"","v":"//notes-revaluation-reserve-statement-of-changes-previous Commercial No price quotation in active market Separate {8}"},{"$f":"\"//notes-revaluation-reserve-statement-of-changes-previous \" & BasisOfPreparationAxis & \" \"  & INDEX(labels!$A$480:$C$480,1,MATCH(PP_Language,labels!$A$1:$C$1,0)) &  \" \"  & INDEX(labels!$A$103:$C$103,1,MATCH(PP_Language,labels!$A$1:$C$1,0)) &  \" {\"&COLUMN($I$658)&\"}\"","v":"//notes-revaluation-reserve-statement-of-changes-previous Commercial Total of revaluation reserves Separate {9}"}]
[null,{"$f":"INDEX(labels!$A$495:$C$495,1,MATCH(PP_Language,labels!$A$1:$C$1,0))","v":"Notes to the financial statements - Revaluation reserve"}]
[null,null,null,null,null,null,null,null,null,null,null,null,null,null,null,null,null,null,null,null,null,null,null,null,null,{"$f":"\"/notes-revaluation-reserve label {\"&COLUMN($B$660)&\"}\"","v":"/notes-revaluation-reserve label {2}"},null,{"$f":"\"/notes-revaluation-reserve \" & BasisOfPreparationAxis & \" \"  & INDEX(labels!$A$103:$C$103,1,MATCH(PP_Language,labels!$A$1:$C$1,0)) &  \" \"  &  \" {\"&COLUMN($D$660)&\"}\"","v":"/notes-revaluation-reserve Commercial Separate  {4}"}]
[null,{"$f":"INDEX(labels!$A$496:$C$496,1,MATCH(PP_Language,labels!$A$1:$C$1,0))","v":"Disclosure of revaluation reserve"}]
[null,{"$f":"INDEX(labels!$A$497:$C$497,1,MATCH(PP_Language,labels!$A$1:$C$1,0))","v":"Description of how, in conjunction with the revaluation, the impact of taxes on capital and income is taken into account"}]
[null,null,null,null,null,null,null,null,null,null,null,null,null,null,null,null,null,null,null,null,null,null,null,null,null,{"$f":"\"//notes-revaluation-reserve label {\"&COLUMN($B$663)&\"}\"","v":"//notes-revaluation-reserve label {2}"},null,{"$f":"\"//notes-revaluation-reserve \" & BasisOfPreparationAxis & \" \"  & INDEX(labels!$A$103:$C$103,1,MATCH(PP_Language,labels!$A$1:$C$1,0)) &  \" \"  &  \" {\"&COLUMN($D$663)&\"}\"","v":"//notes-revaluation-reserve Commercial Separate  {4}"}]
[null,{"$f":"INDEX(labels!$A$113:$C$113,1,MATCH(PP_Language,labels!$A$1:$C$1,0))","v":"Other legal reserves"}]
[null,{"$f":"INDEX(labels!$A$498:$C$498,1,MATCH(PP_Language,labels!$A$1:$C$1,0))","v":"Notes to the financial statements - Other legal reserves: Breakdown"}]
[]
[null,null,null,{"$f":"INDEX(labels!$A$102:$C$102,1,MATCH(PP_Language,labels!$A$1:$C$1,0))","v":"Current"},null,{"$f":"INDEX(labels!$A$104:$C$104,1,MATCH(PP_Language,labels!$A$1:$C$1,0))","v":"Previous"},null,null,null,null,null,null,null,null,null,null,null,null,null,null,null,null,null,null,null,{"$f":"\"/notes-legal-reserves-breakdown label {\"&COLUMN($B$667)&\"}\"","v":"/notes-legal-reserves-breakdown label {2}"},null,{"$f":"\"/notes-legal-reserves-breakdown \" & BasisOfPreparationAxis & \" \"  & INDEX(labels!$A$103:$C$103,1,MATCH(PP_Language,labels!$A$1:$C$1,0)) &  \" \"  & INDEX(labels!$A$102:$C$102,1,MATCH(PP_Language,labels!$A$1:$C$1,0)) &  \" {\"&COLUMN($D$667)&\"}\"","v":"/notes-legal-reserves-breakdown Commercial Separate Current {4}"},null,{"$f":"\"/notes-legal-reserves-breakdown \" & BasisOfPreparationAxis & \" \"  & INDEX(labels!$A$103:$C$103,1,MATCH(PP_Language,labels!$A$1:$C$1,0)) &  \" \"  & INDEX(labels!$A$104:$C$104,1,MATCH(PP_Language,labels!$A$1:$C$1,0)) &  \" {\"&COLUMN($F$667)&\"}\"","v":"/notes-legal-reserves-breakdown Commercial Separate Previous {6}"}]
[null,{"$f":"INDEX(labels!$A$499:$C$499,1,MATCH(PP_Language,labels!$A$1:$C$1,0))","v":"Legal reserve for the negative translation of the share capital of a public limited liability company into euros"}]
[null,{"$f":"INDEX(labels!$A$500:$C$500,1,MATCH(PP_Language,labels!$A$1:$C$1,0))","v":"Legal reserve for the translation of the share capital of a public limited liability company into euros"}]
[null,{"$f":"INDEX(labels!$A$501:$C$501,1,MATCH(PP_Language,labels!$A$1:$C$1,0))","v":"Reserve for contribution on shares other than cash"}]
[null,{"$f":"INDEX(labels!$A$502:$C$502,1,MATCH(PP_Language,labels!$A$1:$C$1,0))","v":"Non-distributable reserve for granted loan to obtain by others shares in the capital of the company or of depositary receipts thereof"}]
[null,{"$f":"INDEX(labels!$A$503:$C$503,1,MATCH(PP_Language,labels!$A$1:$C$1,0))","v":"Legal reserve that account for incorporation and share issue"}]
[null,{"$f":"INDEX(labels!$A$504:$C$504,1,MATCH(PP_Language,labels!$A$1:$C$1,0))","v":"Legal reserve for capitalised development costs"}]
[null,{"$f":"INDEX(labels!$A$505:$C$505,1,MATCH(PP_Language,labels!$A$1:$C$1,0))","v":"Legal reserve participating interests"}]
[null,{"$f":"INDEX(labels!$A$506:$C$506,1,MATCH(PP_Language,labels!$A$1:$C$1,0))","v":"Legal reserve for conversion differences for the conversion of the invested capital and the result of participating interests"}]
[null,{"$f":"INDEX(labels!$A$507:$C$507,1,MATCH(PP_Language,labels!$A$1:$C$1,0))","v":"Foreign currency translation reserve"}]
[]
[null,{"$f":"INDEX(labels!$A$508:$C$508,1,MATCH(PP_Language,labels!$A$1:$C$1,0))","v":"Total of other legal reserves"},null,{"$f":"IF(OR(NOT(AND(Stamdata!$D$668=\"\",Stamdata!$D$669=\"\",Stamdata!$D$670=\"\",Stamdata!$D$671=\"\",Stamdata!$D$672=\"\",Stamdata!$D$673=\"\",Stamdata!$D$674=\"\",Stamdata!$D$675=\"\",Stamdata!$D$676=\"\")),NOT(0=0)), SUM(Stamdata!$D$668,Stamdata!$D$669,Stamdata!$D$670,Stamdata!$D$671,Stamdata!$D$672,Stamdata!$D$673,Stamdata!$D$674,Stamdata!$D$675,Stamdata!$D$676)- 0,\"\")","v":""},null,{"$f":"IF(OR(NOT(AND(Stamdata!$F$668=\"\",Stamdata!$F$669=\"\",Stamdata!$F$670=\"\",Stamdata!$F$671=\"\",Stamdata!$F$672=\"\",Stamdata!$F$673=\"\",Stamdata!$F$674=\"\",Stamdata!$F$675=\"\",Stamdata!$F$676=\"\")),NOT(0=0)), SUM(Stamdata!$F$668,Stamdata!$F$669,Stamdata!$F$670,Stamdata!$F$671,Stamdata!$F$672,Stamdata!$F$673,Stamdata!$F$674,Stamdata!$F$675,Stamdata!$F$676)- 0,\"\")","v":""}]
[null,null,null,null,null,null,null,null,null,null,null,null,null,null,null,null,null,null,null,null,null,null,null,null,null,{"$f":"\"//notes-legal-reserves-breakdown label {\"&COLUMN($B$679)&\"}\"","v":"//notes-legal-reserves-breakdown label {2}"},null,{"$f":"\"//notes-legal-reserves-breakdown \" & BasisOfPreparationAxis & \" \"  & INDEX(labels!$A$103:$C$103,1,MATCH(PP_Language,labels!$A$1:$C$1,0)) &  \" \"  & INDEX(labels!$A$102:$C$102,1,MATCH(PP_Language,labels!$A$1:$C$1,0)) &  \" {\"&COLUMN($D$679)&\"}\"","v":"//notes-legal-reserves-breakdown Commercial Separate Current {4}"},null,{"$f":"\"//notes-legal-reserves-breakdown \" & BasisOfPreparationAxis & \" \"  & INDEX(labels!$A$103:$C$103,1,MATCH(PP_Language,labels!$A$1:$C$1,0)) &  \" \"  & INDEX(labels!$A$104:$C$104,1,MATCH(PP_Language,labels!$A$1:$C$1,0)) &  \" {\"&COLUMN($F$679)&\"}\"","v":"//notes-legal-reserves-breakdown Commercial Separate Previous {6}"}]
[null,{"$f":"INDEX(labels!$A$509:$C$509,1,MATCH(PP_Language,labels!$A$1:$C$1,0))","v":"Notes to the financial statements - Other legal reserves"}]
[null,null,null,null,null,null,null,null,null,null,null,null,null,null,null,null,null,null,null,null,null,null,null,null,null,{"$f":"\"/notes-legal-reserves label {\"&COLUMN($B$681)&\"}\"","v":"/notes-legal-reserves label {2}"},null,{"$f":"\"/notes-legal-reserves \" & BasisOfPreparationAxis & \" \"  & INDEX(labels!$A$103:$C$103,1,MATCH(PP_Language,labels!$A$1:$C$1,0)) &  \" \"  &  \" {\"&COLUMN($D$681)&\"}\"","v":"/notes-legal-reserves Commercial Separate  {4}"}]
[null,{"$f":"INDEX(labels!$A$510:$C$510,1,MATCH(PP_Language,labels!$A$1:$C$1,0))","v":"Disclosure of other legal reserves, distinguished by their nature"}]
[null,null,null,null,null,null,null,null,null,null,null,null,null,null,null,null,null,null,null,null,null,null,null,null,null,{"$f":"\"//notes-legal-reserves label {\"&COLUMN($B$683)&\"}\"","v":"//notes-legal-reserves label {2}"},null,{"$f":"\"//notes-legal-reserves \" & BasisOfPreparationAxis & \" \"  & INDEX(labels!$A$103:$C$103,1,MATCH(PP_Language,labels!$A$1:$C$1,0)) &  \" \"  &  \" {\"&COLUMN($D$683)&\"}\"","v":"//notes-legal-reserves Commercial Separate  {4}"}]
[null,{"$f":"INDEX(labels!$A$511:$C$511,1,MATCH(PP_Language,labels!$A$1:$C$1,0))","v":"Notes to the financial statements - Statutory reserves"}]
[null,null,null,null,null,null,null,null,null,null,null,null,null,null,null,null,null,null,null,null,null,null,null,null,null,{"$f":"\"/notes-statutory-reserves label {\"&COLUMN($B$685)&\"}\"","v":"/notes-statutory-reserves label {2}"},null,{"$f":"\"/notes-statutory-reserves \" & BasisOfPreparationAxis & \" \"  & INDEX(labels!$A$103:$C$103,1,MATCH(PP_Language,labels!$A$1:$C$1,0)) &  \" \"  &  \" {\"&COLUMN($D$685)&\"}\"","v":"/notes-statutory-reserves Commercial Separate  {4}"}]
[null,{"$f":"INDEX(labels!$A$512:$C$512,1,MATCH(PP_Language,labels!$A$1:$C$1,0))","v":"Disclosure of statutory reserves"}]
[null,null,null,null,null,null,null,null,null,null,null,null,null,null,null,null,null,null,null,null,null,null,null,null,null,{"$f":"\"//notes-statutory-reserves label {\"&COLUMN($B$687)&\"}\"","v":"//notes-statutory-reserves label {2}"},null,{"$f":"\"//notes-statutory-reserves \" & BasisOfPreparationAxis & \" \"  & INDEX(labels!$A$103:$C$103,1,MATCH(PP_Language,labels!$A$1:$C$1,0)) &  \" \"  &  \" {\"&COLUMN($D$687)&\"}\"","v":"//notes-statutory-reserves Commercial Separate  {4}"}]
[null,{"$f":"INDEX(labels!$A$513:$C$513,1,MATCH(PP_Language,labels!$A$1:$C$1,0))","v":"Notes to the financial statements - Fiscal reinvestment reserve"}]
[null,null,null,null,null,null,null,null,null,null,null,null,null,null,null,null,null,null,null,null,null,null,null,null,null,{"$f":"\"/notes-reinvestment-reserve label {\"&COLUMN($B$689)&\"}\"","v":"/notes-reinvestment-reserve label {2}"},null,{"$f":"\"/notes-reinvestment-reserve \" & BasisOfPreparationAxis & \" \"  & INDEX(labels!$A$103:$C$103,1,MATCH(PP_Language,labels!$A$1:$C$1,0)) &  \" \"  &  \" {\"&COLUMN($D$689)&\"}\"","v":"/notes-reinvestment-reserve Commercial Separate  {4}"}]
[null,{"$f":"INDEX(labels!$A$514:$C$514,1,MATCH(PP_Language,labels!$A$1:$C$1,0))","v":"Disclosure of fiscal reinvestment reserve"}]
[null,null,null,null,null,null,null,null,null,null,null,null,null,null,null,null,null,null,null,null,null,null,null,null,null,{"$f":"\"//notes-reinvestment-reserve label {\"&COLUMN($B$691)&\"}\"","v":"//notes-reinvestment-reserve label {2}"},null,{"$f":"\"//notes-reinvestment-reserve \" & BasisOfPreparationAxis & \" \"  & INDEX(labels!$A$103:$C$103,1,MATCH(PP_Language,labels!$A$1:$C$1,0)) &  \" \"  &  \" {\"&COLUMN($D$691)&\"}\"","v":"//notes-reinvestment-reserve Commercial Separate  {4}"}]
[null,{"$f":"INDEX(labels!$A$515:$C$515,1,MATCH(PP_Language,labels!$A$1:$C$1,0))","v":"Notes to the financial statements - Other reserves"}]
[null,null,null,null,null,null,null,null,null,null,null,null,null,null,null,null,null,null,null,null,null,null,null,null,null,{"$f":"\"/notes-other-reserves label {\"&COLUMN($B$693)&\"}\"","v":"/notes-other-reserves label {2}"},null,{"$f":"\"/notes-other-reserves \" & BasisOfPreparationAxis & \" \"  & INDEX(labels!$A$103:$C$103,1,MATCH(PP_Language,labels!$A$1:$C$1,0)) &  \" \"  &  \" {\"&COLUMN($D$693)&\"}\"","v":"/notes-other-reserves Commercial Separate  {4}"}]
[null,{"$f":"INDEX(labels!$A$516:$C$516,1,MATCH(PP_Language,labels!$A$1:$C$1,0))","v":"Disclosure of other reserves"}]
[null,null,null,null,null,null,null,null,null,null,null,null,null,null,null,null,null,null,null,null,null,null,null,null,null,{"$f":"\"//notes-other-reserves label {\"&COLUMN($B$695)&\"}\"","v":"//notes-other-reserves label {2}"},null,{"$f":"\"//notes-other-reserves \" & BasisOfPreparationAxis & \" \"  & INDEX(labels!$A$103:$C$103,1,MATCH(PP_Language,labels!$A$1:$C$1,0)) &  \" \"  &  \" {\"&COLUMN($D$695)&\"}\"","v":"//notes-other-reserves Commercial Separate  {4}"}]
[null,{"$f":"INDEX(labels!$A$517:$C$517,1,MATCH(PP_Language,labels!$A$1:$C$1,0))","v":"Notes to the financial statements - Result for the year"}]
[null,null,null,null,null,null,null,null,null,null,null,null,null,null,null,null,null,null,null,null,null,null,null,null,null,{"$f":"\"/notes-result-for-the-year label {\"&COLUMN($B$697)&\"}\"","v":"/notes-result-for-the-year label {2}"},null,{"$f":"\"/notes-result-for-the-year \" & BasisOfPreparationAxis & \" \"  & INDEX(labels!$A$103:$C$103,1,MATCH(PP_Language,labels!$A$1:$C$1,0)) &  \" \"  &  \" {\"&COLUMN($D$697)&\"}\"","v":"/notes-result-for-the-year Commercial Separate  {4}"}]
[null,{"$f":"INDEX(labels!$A$518:$C$518,1,MATCH(PP_Language,labels!$A$1:$C$1,0))","v":"Disclosure of result after tax for the year"}]
[null,null,null,null,null,null,null,null,null,null,null,null,null,null,null,null,null,null,null,null,null,null,null,null,null,{"$f":"\"//notes-result-for-the-year label {\"&COLUMN($B$699)&\"}\"","v":"//notes-result-for-the-year label {2}"},null,{"$f":"\"//notes-result-for-the-year \" & BasisOfPreparationAxis & \" \"  & INDEX(labels!$A$103:$C$103,1,MATCH(PP_Language,labels!$A$1:$C$1,0)) &  \" \"  &  \" {\"&COLUMN($D$699)&\"}\"","v":"//notes-result-for-the-year Commercial Separate  {4}"}]
[null,{"$f":"INDEX(labels!$A$519:$C$519,1,MATCH(PP_Language,labels!$A$1:$C$1,0))","v":"Notes to the financial statements - Undistributed profit"}]
[null,null,null,null,null,null,null,null,null,null,null,null,null,null,null,null,null,null,null,null,null,null,null,null,null,{"$f":"\"/notes-retained-earnings label {\"&COLUMN($B$701)&\"}\"","v":"/notes-retained-earnings label {2}"},null,{"$f":"\"/notes-retained-earnings \" & BasisOfPreparationAxis & \" \"  & INDEX(labels!$A$103:$C$103,1,MATCH(PP_Language,labels!$A$1:$C$1,0)) &  \" \"  &  \" {\"&COLUMN($D$701)&\"}\"","v":"/notes-retained-earnings Commercial Separate  {4}"}]
[null,{"$f":"INDEX(labels!$A$520:$C$520,1,MATCH(PP_Language,labels!$A$1:$C$1,0))","v":"Disclosure of undistributed profit"}]
[null,null,null,null,null,null,null,null,null,null,null,null,null,null,null,null,null,null,null,null,null,null,null,null,null,{"$f":"\"//notes-retained-earnings label {\"&COLUMN($B$703)&\"}\"","v":"//notes-retained-earnings label {2}"},null,{"$f":"\"//notes-retained-earnings \" & BasisOfPreparationAxis & \" \"  & INDEX(labels!$A$103:$C$103,1,MATCH(PP_Language,labels!$A$1:$C$1,0)) &  \" \"  &  \" {\"&COLUMN($D$703)&\"}\"","v":"//notes-retained-earnings Commercial Separate  {4}"}]
[null,{"$f":"INDEX(labels!$A$67:$C$67,1,MATCH(PP_Language,labels!$A$1:$C$1,0))","v":"Provisions"}]
[null,{"$f":"INDEX(labels!$A$523:$C$523,1,MATCH(PP_Language,labels!$A$1:$C$1,0))","v":"Notes to the financial statements - Provisions"}]
[null,null,null,null,null,null,null,null,null,null,null,null,null,null,null,null,null,null,null,null,null,null,null,null,null,{"$f":"\"/notes-provisions label {\"&COLUMN($B$706)&\"}\"","v":"/notes-provisions label {2}"},null,{"$f":"\"/notes-provisions \" & BasisOfPreparationAxis & \" \"  & INDEX(labels!$A$103:$C$103,1,MATCH(PP_Language,labels!$A$1:$C$1,0)) &  \" \"  &  \" {\"&COLUMN($D$706)&\"}\"","v":"/notes-provisions Commercial Separate  {4}"}]
[null,{"$f":"INDEX(labels!$A$524:$C$524,1,MATCH(PP_Language,labels!$A$1:$C$1,0))","v":"Disclosure of provisions"}]
[null,{"$f":"INDEX(labels!$A$525:$C$525,1,MATCH(PP_Language,labels!$A$1:$C$1,0))","v":"Disclosure of provision for repair costs"}]
[null,{"$f":"INDEX(labels!$A$526:$C$526,1,MATCH(PP_Language,labels!$A$1:$C$1,0))","v":"Disclosure of provision for tax liabilities"}]
[null,{"$f":"INDEX(labels!$A$527:$C$527,1,MATCH(PP_Language,labels!$A$1:$C$1,0))","v":"Disclosure of provision for pension obligations"}]
[null,{"$f":"INDEX(labels!$A$528:$C$528,1,MATCH(PP_Language,labels!$A$1:$C$1,0))","v":"Disclosure of provision for employee benefits"}]
[null,{"$f":"INDEX(labels!$A$529:$C$529,1,MATCH(PP_Language,labels!$A$1:$C$1,0))","v":"Disclosure of environmental provision"}]
[null,{"$f":"INDEX(labels!$A$530:$C$530,1,MATCH(PP_Language,labels!$A$1:$C$1,0))","v":"Disclosure of provision for legal proceedings"}]
[null,{"$f":"INDEX(labels!$A$531:$C$531,1,MATCH(PP_Language,labels!$A$1:$C$1,0))","v":"Disclosure of provision for major maintenance"}]
[null,{"$f":"INDEX(labels!$A$532:$C$532,1,MATCH(PP_Language,labels!$A$1:$C$1,0))","v":"Disclosure of provision for disposal obligations"}]
[null,{"$f":"INDEX(labels!$A$533:$C$533,1,MATCH(PP_Language,labels!$A$1:$C$1,0))","v":"Disclosure of provision for onerous contracts"}]
[null,{"$f":"INDEX(labels!$A$534:$C$534,1,MATCH(PP_Language,labels!$A$1:$C$1,0))","v":"Description of the actuarial assumptions used for the provision for pension obligations"}]
[null,{"$f":"INDEX(labels!$A$535:$C$535,1,MATCH(PP_Language,labels!$A$1:$C$1,0))","v":"Description of obligations per balance sheet date that have pension provisions"}]
[null,{"$f":"INDEX(labels!$A$536:$C$536,1,MATCH(PP_Language,labels!$A$1:$C$1,0))","v":"Disclosure of restructuring provision"}]
[null,{"$f":"INDEX(labels!$A$537:$C$537,1,MATCH(PP_Language,labels!$A$1:$C$1,0))","v":"Disclosure of provision relating to participating interest"}]
[null,{"$f":"INDEX(labels!$A$538:$C$538,1,MATCH(PP_Language,labels!$A$1:$C$1,0))","v":"Description of the valuation methods of the provision for pension obligations"}]
[null,{"$f":"INDEX(labels!$A$539:$C$539,1,MATCH(PP_Language,labels!$A$1:$C$1,0))","v":"Disclosure of deferred tax liabilities"}]
[null,{"$f":"INDEX(labels!$A$540:$C$540,1,MATCH(PP_Language,labels!$A$1:$C$1,0))","v":"Disclosure of warranty provision"}]
[null,null,null,null,null,null,null,null,null,null,null,null,null,null,null,null,null,null,null,null,null,null,null,null,null,{"$f":"\"//notes-provisions label {\"&COLUMN($B$724)&\"}\"","v":"//notes-provisions label {2}"},null,{"$f":"\"//notes-provisions \" & BasisOfPreparationAxis & \" \"  & INDEX(labels!$A$103:$C$103,1,MATCH(PP_Language,labels!$A$1:$C$1,0)) &  \" \"  &  \" {\"&COLUMN($D$724)&\"}\"","v":"//notes-provisions Commercial Separate  {4}"}]
[null,{"$f":"INDEX(labels!$A$541:$C$541,1,MATCH(PP_Language,labels!$A$1:$C$1,0))","v":"Notes to the financial statements - Provisions: Other amounts: Breakdown"}]
[]
[null,null,null,{"$f":"INDEX(labels!$A$102:$C$102,1,MATCH(PP_Language,labels!$A$1:$C$1,0))","v":"Current"},null,{"$f":"INDEX(labels!$A$104:$C$104,1,MATCH(PP_Language,labels!$A$1:$C$1,0))","v":"Previous"},null,null,null,null,null,null,null,null,null,null,null,null,null,null,null,null,null,null,null,{"$f":"\"/notes-provisions-other-amounts-breakdown label {\"&COLUMN($B$727)&\"}\"","v":"/notes-provisions-other-amounts-breakdown label {2}"},null,{"$f":"\"/notes-provisions-other-amounts-breakdown \" & BasisOfPreparationAxis & \" \"  & INDEX(labels!$A$103:$C$103,1,MATCH(PP_Language,labels!$A$1:$C$1,0)) &  \" \"  & INDEX(labels!$A$102:$C$102,1,MATCH(PP_Language,labels!$A$1:$C$1,0)) &  \" {\"&COLUMN($D$727)&\"}\"","v":"/notes-provisions-other-amounts-breakdown Commercial Separate Current {4}"},null,{"$f":"\"/notes-provisions-other-amounts-breakdown \" & BasisOfPreparationAxis & \" \"  & INDEX(labels!$A$103:$C$103,1,MATCH(PP_Language,labels!$A$1:$C$1,0)) &  \" \"  & INDEX(labels!$A$104:$C$104,1,MATCH(PP_Language,labels!$A$1:$C$1,0)) &  \" {\"&COLUMN($F$727)&\"}\"","v":"/notes-provisions-other-amounts-breakdown Commercial Separate Previous {6}"}]
[null,{"$f":"INDEX(labels!$A$542:$C$542,1,MATCH(PP_Language,labels!$A$1:$C$1,0))","v":"Long-term part of provisions"}]
[null,null,null,null,null,null,null,null,null,null,null,null,null,null,null,null,null,null,null,null,null,null,null,null,null,{"$f":"\"//notes-provisions-other-amounts-breakdown label {\"&COLUMN($B$729)&\"}\"","v":"//notes-provisions-other-amounts-breakdown label {2}"},null,{"$f":"\"//notes-provisions-other-amounts-breakdown \" & BasisOfPreparationAxis & \" \"  & INDEX(labels!$A$103:$C$103,1,MATCH(PP_Language,labels!$A$1:$C$1,0)) &  \" \"  & INDEX(labels!$A$102:$C$102,1,MATCH(PP_Language,labels!$A$1:$C$1,0)) &  \" {\"&COLUMN($D$729)&\"}\"","v":"//notes-provisions-other-amounts-breakdown Commercial Separate Current {4}"},null,{"$f":"\"//notes-provisions-other-amounts-breakdown \" & BasisOfPreparationAxis & \" \"  & INDEX(labels!$A$103:$C$103,1,MATCH(PP_Language,labels!$A$1:$C$1,0)) &  \" \"  & INDEX(labels!$A$104:$C$104,1,MATCH(PP_Language,labels!$A$1:$C$1,0)) &  \" {\"&COLUMN($F$729)&\"}\"","v":"//notes-provisions-other-amounts-breakdown Commercial Separate Previous {6}"}]
[null,{"$f":"INDEX(labels!$A$68:$C$68,1,MATCH(PP_Language,labels!$A$1:$C$1,0))","v":"Non-current liabilities"}]
[null,{"$f":"INDEX(labels!$A$543:$C$543,1,MATCH(PP_Language,labels!$A$1:$C$1,0))","v":"Notes to the financial statements - Non-current liabilities: Breakdown"}]
[]
[null,null,null,{"$f":"INDEX(labels!$A$102:$C$102,1,MATCH(PP_Language,labels!$A$1:$C$1,0))","v":"Current"},null,{"$f":"INDEX(labels!$A$104:$C$104,1,MATCH(PP_Language,labels!$A$1:$C$1,0))","v":"Previous"},null,null,null,null,null,null,null,null,null,null,null,null,null,null,null,null,null,null,null,{"$f":"\"/notes-noncurrent-liabilities-breakdown label {\"&COLUMN($B$733)&\"}\"","v":"/notes-noncurrent-liabilities-breakdown label {2}"},null,{"$f":"\"/notes-noncurrent-liabilities-breakdown \" & BasisOfPreparationAxis & \" \"  & INDEX(labels!$A$103:$C$103,1,MATCH(PP_Language,labels!$A$1:$C$1,0)) &  \" \"  & INDEX(labels!$A$102:$C$102,1,MATCH(PP_Language,labels!$A$1:$C$1,0)) &  \" {\"&COLUMN($D$733)&\"}\"","v":"/notes-noncurrent-liabilities-breakdown Commercial Separate Current {4}"},null,{"$f":"\"/notes-noncurrent-liabilities-breakdown \" & BasisOfPreparationAxis & \" \"  & INDEX(labels!$A$103:$C$103,1,MATCH(PP_Language,labels!$A$1:$C$1,0)) &  \" \"  & INDEX(labels!$A$104:$C$104,1,MATCH(PP_Language,labels!$A$1:$C$1,0)) &  \" {\"&COLUMN($F$733)&\"}\"","v":"/notes-noncurrent-liabilities-breakdown Commercial Separate Previous {6}"}]
[null,{"$f":"INDEX(labels!$A$544:$C$544,1,MATCH(PP_Language,labels!$A$1:$C$1,0))","v":"Old age obligation"}]
[null,{"$f":"INDEX(labels!$A$545:$C$545,1,MATCH(PP_Language,labels!$A$1:$C$1,0))","v":"Other payables"}]
[]
[null,{"$f":"INDEX(labels!$A$546:$C$546,1,MATCH(PP_Language,labels!$A$1:$C$1,0))","v":"Total of non-current liabilities"},null,{"$f":"IF(OR(NOT(AND(Stamdata!$D$734=\"\",Stamdata!$D$735=\"\")),NOT(0=0)), SUM(Stamdata!$D$734,Stamdata!$D$735)- 0,\"\")","v":""},null,{"$f":"IF(OR(NOT(AND(Stamdata!$F$734=\"\",Stamdata!$F$735=\"\")),NOT(0=0)), SUM(Stamdata!$F$734,Stamdata!$F$735)- 0,\"\")","v":""}]
[null,null,null,null,null,null,null,null,null,null,null,null,null,null,null,null,null,null,null,null,null,null,null,null,null,{"$f":"\"//notes-noncurrent-liabilities-breakdown label {\"&COLUMN($B$738)&\"}\"","v":"//notes-noncurrent-liabilities-breakdown label {2}"},null,{"$f":"\"//notes-noncurrent-liabilities-breakdown \" & BasisOfPreparationAxis & \" \"  & INDEX(labels!$A$103:$C$103,1,MATCH(PP_Language,labels!$A$1:$C$1,0)) &  \" \"  & INDEX(labels!$A$102:$C$102,1,MATCH(PP_Language,labels!$A$1:$C$1,0)) &  \" {\"&COLUMN($D$738)&\"}\"","v":"//notes-noncurrent-liabilities-breakdown Commercial Separate Current {4}"},null,{"$f":"\"//notes-noncurrent-liabilities-breakdown \" & BasisOfPreparationAxis & \" \"  & INDEX(labels!$A$103:$C$103,1,MATCH(PP_Language,labels!$A$1:$C$1,0)) &  \" \"  & INDEX(labels!$A$104:$C$104,1,MATCH(PP_Language,labels!$A$1:$C$1,0)) &  \" {\"&COLUMN($F$738)&\"}\"","v":"//notes-noncurrent-liabilities-breakdown Commercial Separate Previous {6}"}]
[null,{"$f":"INDEX(labels!$A$547:$C$547,1,MATCH(PP_Language,labels!$A$1:$C$1,0))","v":"Notes to the financial statements - Non-current liabilities"}]
[null,null,null,null,null,null,null,null,null,null,null,null,null,null,null,null,null,null,null,null,null,null,null,null,null,{"$f":"\"/notes-noncurrent-liabilities label {\"&COLUMN($B$740)&\"}\"","v":"/notes-noncurrent-liabilities label {2}"},null,{"$f":"\"/notes-noncurrent-liabilities \" & BasisOfPreparationAxis & \" \"  & INDEX(labels!$A$103:$C$103,1,MATCH(PP_Language,labels!$A$1:$C$1,0)) &  \" \"  &  \" {\"&COLUMN($D$740)&\"}\"","v":"/notes-noncurrent-liabilities Commercial Separate  {4}"}]
[null,{"$f":"INDEX(labels!$A$548:$C$548,1,MATCH(PP_Language,labels!$A$1:$C$1,0))","v":"Disclosure of non-current liabilities"}]
[null,{"$f":"INDEX(labels!$A$549:$C$549,1,MATCH(PP_Language,labels!$A$1:$C$1,0))","v":"Disclosure of subordinated liabilities"}]
[null,{"$f":"INDEX(labels!$A$550:$C$550,1,MATCH(PP_Language,labels!$A$1:$C$1,0))","v":"Disclosure of finance lease liabilities"}]
[null,{"$f":"INDEX(labels!$A$551:$C$551,1,MATCH(PP_Language,labels!$A$1:$C$1,0))","v":"Disclosure of old age obligation"}]
[null,{"$f":"INDEX(labels!$A$552:$C$552,1,MATCH(PP_Language,labels!$A$1:$C$1,0))","v":"Disclosure of negative goodwill"}]
[null,{"$f":"INDEX(labels!$A$553:$C$553,1,MATCH(PP_Language,labels!$A$1:$C$1,0))","v":"Description of the period where negative goodwill is recognised in income statement"}]
[null,{"$f":"INDEX(labels!$A$554:$C$554,1,MATCH(PP_Language,labels!$A$1:$C$1,0))","v":"Disclosure of accruals and deferred income"}]
[null,{"$f":"INDEX(labels!$A$555:$C$555,1,MATCH(PP_Language,labels!$A$1:$C$1,0))","v":"Specification of secured liabilities and form of separation"}]
[null,{"$f":"INDEX(labels!$A$556:$C$556,1,MATCH(PP_Language,labels!$A$1:$C$1,0))","v":"Disclosure of the maturity of non-current liabilities"}]
[null,{"$f":"INDEX(labels!$A$557:$C$557,1,MATCH(PP_Language,labels!$A$1:$C$1,0))","v":"Disclosure of the liabilities to which the legal person has committed itself, whether or not conditionally, to encumber or not to encumber assets"}]
[null,null,null,null,null,null,null,null,null,null,null,null,null,null,null,null,null,null,null,null,null,null,null,null,null,{"$f":"\"//notes-noncurrent-liabilities label {\"&COLUMN($B$751)&\"}\"","v":"//notes-noncurrent-liabilities label {2}"},null,{"$f":"\"//notes-noncurrent-liabilities \" & BasisOfPreparationAxis & \" \"  & INDEX(labels!$A$103:$C$103,1,MATCH(PP_Language,labels!$A$1:$C$1,0)) &  \" \"  &  \" {\"&COLUMN($D$751)&\"}\"","v":"//notes-noncurrent-liabilities Commercial Separate  {4}"}]
[null,{"$f":"INDEX(labels!$A$558:$C$558,1,MATCH(PP_Language,labels!$A$1:$C$1,0))","v":"Notes to the financial statements - Non-current liabilities: Other amounts: Breakdown"}]
[]
[null,null,null,{"$f":"INDEX(labels!$A$102:$C$102,1,MATCH(PP_Language,labels!$A$1:$C$1,0))","v":"Current"},null,{"$f":"INDEX(labels!$A$104:$C$104,1,MATCH(PP_Language,labels!$A$1:$C$1,0))","v":"Previous"},null,null,null,null,null,null,null,null,null,null,null,null,null,null,null,null,null,null,null,{"$f":"\"/notes-noncurrent-liabilities-other-amounts-breakdown label {\"&COLUMN($B$754)&\"}\"","v":"/notes-noncurrent-liabilities-other-amounts-breakdown label {2}"},null,{"$f":"\"/notes-noncurrent-liabilities-other-amounts-breakdown \" & BasisOfPreparationAxis & \" \"  & INDEX(labels!$A$103:$C$103,1,MATCH(PP_Language,labels!$A$1:$C$1,0)) &  \" \"  & INDEX(labels!$A$102:$C$102,1,MATCH(PP_Language,labels!$A$1:$C$1,0)) &  \" {\"&COLUMN($D$754)&\"}\"","v":"/notes-noncurrent-liabilities-other-amounts-breakdown Commercial Separate Current {4}"},null,{"$f":"\"/notes-noncurrent-liabilities-other-amounts-breakdown \" & BasisOfPreparationAxis & \" \"  & INDEX(labels!$A$103:$C$103,1,MATCH(PP_Language,labels!$A$1:$C$1,0)) &  \" \"  & INDEX(labels!$A$104:$C$104,1,MATCH(PP_Language,labels!$A$1:$C$1,0)) &  \" {\"&COLUMN($F$754)&\"}\"","v":"/notes-noncurrent-liabilities-other-amounts-breakdown Commercial Separate Previous {6}"}]
[null,{"$f":"INDEX(labels!$A$559:$C$559,1,MATCH(PP_Language,labels!$A$1:$C$1,0))","v":"Non-current liabilities with a maturity exceeding five years"}]
[null,{"$f":"INDEX(labels!$A$560:$C$560,1,MATCH(PP_Language,labels!$A$1:$C$1,0))","v":"Amount of secured non-current liabilities"}]
[null,null,null,null,null,null,null,null,null,null,null,null,null,null,null,null,null,null,null,null,null,null,null,null,null,{"$f":"\"//notes-noncurrent-liabilities-other-amounts-breakdown label {\"&COLUMN($B$757)&\"}\"","v":"//notes-noncurrent-liabilities-other-amounts-breakdown label {2}"},null,{"$f":"\"//notes-noncurrent-liabilities-other-amounts-breakdown \" & BasisOfPreparationAxis & \" \"  & INDEX(labels!$A$103:$C$103,1,MATCH(PP_Language,labels!$A$1:$C$1,0)) &  \" \"  & INDEX(labels!$A$102:$C$102,1,MATCH(PP_Language,labels!$A$1:$C$1,0)) &  \" {\"&COLUMN($D$757)&\"}\"","v":"//notes-noncurrent-liabilities-other-amounts-breakdown Commercial Separate Current {4}"},null,{"$f":"\"//notes-noncurrent-liabilities-other-amounts-breakdown \" & BasisOfPreparationAxis & \" \"  & INDEX(labels!$A$103:$C$103,1,MATCH(PP_Language,labels!$A$1:$C$1,0)) &  \" \"  & INDEX(labels!$A$104:$C$104,1,MATCH(PP_Language,labels!$A$1:$C$1,0)) &  \" {\"&COLUMN($F$757)&\"}\"","v":"//notes-noncurrent-liabilities-other-amounts-breakdown Commercial Separate Previous {6}"}]
[null,{"$f":"INDEX(labels!$A$69:$C$69,1,MATCH(PP_Language,labels!$A$1:$C$1,0))","v":"Current liabilities"}]
[null,{"$f":"INDEX(labels!$A$561:$C$561,1,MATCH(PP_Language,labels!$A$1:$C$1,0))","v":"Notes to the financial statements - Current liabilities"}]
[null,null,null,null,null,null,null,null,null,null,null,null,null,null,null,null,null,null,null,null,null,null,null,null,null,{"$f":"\"/notes-current-liabilities label {\"&COLUMN($B$760)&\"}\"","v":"/notes-current-liabilities label {2}"},null,{"$f":"\"/notes-current-liabilities \" & BasisOfPreparationAxis & \" \"  & INDEX(labels!$A$103:$C$103,1,MATCH(PP_Language,labels!$A$1:$C$1,0)) &  \" \"  &  \" {\"&COLUMN($D$760)&\"}\"","v":"/notes-current-liabilities Commercial Separate  {4}"}]
[null,{"$f":"INDEX(labels!$A$562:$C$562,1,MATCH(PP_Language,labels!$A$1:$C$1,0))","v":"Disclosure of current liabilities"}]
[null,{"$f":"INDEX(labels!$A$550:$C$550,1,MATCH(PP_Language,labels!$A$1:$C$1,0))","v":"Disclosure of finance lease liabilities"}]
[null,{"$f":"INDEX(labels!$A$554:$C$554,1,MATCH(PP_Language,labels!$A$1:$C$1,0))","v":"Disclosure of accruals and deferred income"}]
[null,{"$f":"INDEX(labels!$A$557:$C$557,1,MATCH(PP_Language,labels!$A$1:$C$1,0))","v":"Disclosure of the liabilities to which the legal person has committed itself, whether or not conditionally, to encumber or not to encumber assets"}]
[null,null,null,null,null,null,null,null,null,null,null,null,null,null,null,null,null,null,null,null,null,null,null,null,null,{"$f":"\"//notes-current-liabilities label {\"&COLUMN($B$765)&\"}\"","v":"//notes-current-liabilities label {2}"},null,{"$f":"\"//notes-current-liabilities \" & BasisOfPreparationAxis & \" \"  & INDEX(labels!$A$103:$C$103,1,MATCH(PP_Language,labels!$A$1:$C$1,0)) &  \" \"  &  \" {\"&COLUMN($D$765)&\"}\"","v":"//notes-current-liabilities Commercial Separate  {4}"}]
[null,{"$f":"INDEX(labels!$A$563:$C$563,1,MATCH(PP_Language,labels!$A$1:$C$1,0))","v":"Notes to the financial statements - Current liabilities: Other amounts: Breakdown"}]
[]
[null,null,null,{"$f":"INDEX(labels!$A$102:$C$102,1,MATCH(PP_Language,labels!$A$1:$C$1,0))","v":"Current"},null,{"$f":"INDEX(labels!$A$104:$C$104,1,MATCH(PP_Language,labels!$A$1:$C$1,0))","v":"Previous"},null,null,null,null,null,null,null,null,null,null,null,null,null,null,null,null,null,null,null,{"$f":"\"/notes-current-liabilities-other-amounts-breakdown label {\"&COLUMN($B$768)&\"}\"","v":"/notes-current-liabilities-other-amounts-breakdown label {2}"},null,{"$f":"\"/notes-current-liabilities-other-amounts-breakdown \" & BasisOfPreparationAxis & \" \"  & INDEX(labels!$A$103:$C$103,1,MATCH(PP_Language,labels!$A$1:$C$1,0)) &  \" \"  & INDEX(labels!$A$102:$C$102,1,MATCH(PP_Language,labels!$A$1:$C$1,0)) &  \" {\"&COLUMN($D$768)&\"}\"","v":"/notes-current-liabilities-other-amounts-breakdown Commercial Separate Current {4}"},null,{"$f":"\"/notes-current-liabilities-other-amounts-breakdown \" & BasisOfPreparationAxis & \" \"  & INDEX(labels!$A$103:$C$103,1,MATCH(PP_Language,labels!$A$1:$C$1,0)) &  \" \"  & INDEX(labels!$A$104:$C$104,1,MATCH(PP_Language,labels!$A$1:$C$1,0)) &  \" {\"&COLUMN($F$768)&\"}\"","v":"/notes-current-liabilities-other-amounts-breakdown Commercial Separate Previous {6}"}]
[null,{"$f":"INDEX(labels!$A$564:$C$564,1,MATCH(PP_Language,labels!$A$1:$C$1,0))","v":"Amount of secured current liabilities"}]
[null,null,null,null,null,null,null,null,null,null,null,null,null,null,null,null,null,null,null,null,null,null,null,null,null,{"$f":"\"//notes-current-liabilities-other-amounts-breakdown label {\"&COLUMN($B$770)&\"}\"","v":"//notes-current-liabilities-other-amounts-breakdown label {2}"},null,{"$f":"\"//notes-current-liabilities-other-amounts-breakdown \" & BasisOfPreparationAxis & \" \"  & INDEX(labels!$A$103:$C$103,1,MATCH(PP_Language,labels!$A$1:$C$1,0)) &  \" \"  & INDEX(labels!$A$102:$C$102,1,MATCH(PP_Language,labels!$A$1:$C$1,0)) &  \" {\"&COLUMN($D$770)&\"}\"","v":"//notes-current-liabilities-other-amounts-breakdown Commercial Separate Current {4}"},null,{"$f":"\"//notes-current-liabilities-other-amounts-breakdown \" & BasisOfPreparationAxis & \" \"  & INDEX(labels!$A$103:$C$103,1,MATCH(PP_Language,labels!$A$1:$C$1,0)) &  \" \"  & INDEX(labels!$A$104:$C$104,1,MATCH(PP_Language,labels!$A$1:$C$1,0)) &  \" {\"&COLUMN($F$770)&\"}\"","v":"//notes-current-liabilities-other-amounts-breakdown Commercial Separate Previous {6}"}]
[null,{"$f":"INDEX(labels!$A$70:$C$70,1,MATCH(PP_Language,labels!$A$1:$C$1,0))","v":"Off-balance sheet commitments"}]
[null,{"$f":"INDEX(labels!$A$565:$C$565,1,MATCH(PP_Language,labels!$A$1:$C$1,0))","v":"Notes to the financial statements - Assets and liabilities not recognised in balance sheet"}]
[null,null,null,null,null,null,null,null,null,null,null,null,null,null,null,null,null,null,null,null,null,null,null,null,null,{"$f":"\"/notes-assets-liabilities-not-recognised label {\"&COLUMN($B$773)&\"}\"","v":"/notes-assets-liabilities-not-recognised label {2}"},null,{"$f":"\"/notes-assets-liabilities-not-recognised \" & BasisOfPreparationAxis & \" \"  & INDEX(labels!$A$103:$C$103,1,MATCH(PP_Language,labels!$A$1:$C$1,0)) &  \" \"  &  \" {\"&COLUMN($D$773)&\"}\"","v":"/notes-assets-liabilities-not-recognised Commercial Separate  {4}"}]
[null,{"$f":"INDEX(labels!$A$566:$C$566,1,MATCH(PP_Language,labels!$A$1:$C$1,0))","v":"Disclosure of off-balance sheet commitments"}]
[null,{"$f":"INDEX(labels!$A$567:$C$567,1,MATCH(PP_Language,labels!$A$1:$C$1,0))","v":"Description of the nature of off-balance sheet liabilities"}]
[null,{"$f":"INDEX(labels!$A$568:$C$568,1,MATCH(PP_Language,labels!$A$1:$C$1,0))","v":"Description of the financial consequences of the contingent arrangements"}]
[null,{"$f":"INDEX(labels!$A$569:$C$569,1,MATCH(PP_Language,labels!$A$1:$C$1,0))","v":"Description of the business objectives of the contingent arrangements"}]
[null,{"$f":"INDEX(labels!$A$570:$C$570,1,MATCH(PP_Language,labels!$A$1:$C$1,0))","v":"Description of the nature of the contingent arrangements"}]
[null,{"$f":"INDEX(labels!$A$571:$C$571,1,MATCH(PP_Language,labels!$A$1:$C$1,0))","v":"Description of the indication of uncertainties regarding the amount or moment of outflow relating to off-balance sheet liabilities"}]
[null,{"$f":"INDEX(labels!$A$572:$C$572,1,MATCH(PP_Language,labels!$A$1:$C$1,0))","v":"Description of the possibility of any reimbursement relating to off-balance sheet liabilities"}]
[null,{"$f":"INDEX(labels!$A$573:$C$573,1,MATCH(PP_Language,labels!$A$1:$C$1,0))","v":"Disclosure of contingent liabilities on behalf of group companies"}]
[null,{"$f":"INDEX(labels!$A$574:$C$574,1,MATCH(PP_Language,labels!$A$1:$C$1,0))","v":"Description of off-balance sheet commitments relating to liability claims"}]
[null,{"$f":"INDEX(labels!$A$575:$C$575,1,MATCH(PP_Language,labels!$A$1:$C$1,0))","v":"Description of the off-balance sheet liabilities relating to the fiscal unity"}]
[null,{"$f":"INDEX(labels!$A$576:$C$576,1,MATCH(PP_Language,labels!$A$1:$C$1,0))","v":"Description of off-balance sheet liabilities relating to purchase commitments"}]
[null,{"$f":"INDEX(labels!$A$577:$C$577,1,MATCH(PP_Language,labels!$A$1:$C$1,0))","v":"Description of off-balance sheet commitments relating to guarantees"}]
[null,{"$f":"INDEX(labels!$A$578:$C$578,1,MATCH(PP_Language,labels!$A$1:$C$1,0))","v":"Description of guarantees for the joint supervisory directors of the legal person, as provided by the legal entity, are subsidiaries and the companies of which he consolidates the data"}]
[null,{"$f":"INDEX(labels!$A$579:$C$579,1,MATCH(PP_Language,labels!$A$1:$C$1,0))","v":"Disclosure of contingent assets"}]
[null,{"$f":"INDEX(labels!$A$580:$C$580,1,MATCH(PP_Language,labels!$A$1:$C$1,0))","v":"Description of the estimate of financial impact of off-balance sheet liabilities"}]
[null,{"$f":"INDEX(labels!$A$581:$C$581,1,MATCH(PP_Language,labels!$A$1:$C$1,0))","v":"Disclosure of operating leases"}]
[null,{"$f":"INDEX(labels!$A$582:$C$582,1,MATCH(PP_Language,labels!$A$1:$C$1,0))","v":"Description of the average maturity of the operational lease commitments"}]
[null,{"$f":"INDEX(labels!$A$583:$C$583,1,MATCH(PP_Language,labels!$A$1:$C$1,0))","v":"Description of the size and duration of obligations to purchase or sell stocks of special significance"}]
[null,{"$f":"INDEX(labels!$A$142:$C$142,1,MATCH(PP_Language,labels!$A$1:$C$1,0))","v":"Notification of legal entity for which legal entity issued a liability claim in accordance with article 403"}]
[null,null,null,null,null,null,null,null,null,null,null,null,null,null,null,null,null,null,null,null,null,null,null,null,null,{"$f":"\"//notes-assets-liabilities-not-recognised label {\"&COLUMN($B$793)&\"}\"","v":"//notes-assets-liabilities-not-recognised label {2}"},null,{"$f":"\"//notes-assets-liabilities-not-recognised \" & BasisOfPreparationAxis & \" \"  & INDEX(labels!$A$103:$C$103,1,MATCH(PP_Language,labels!$A$1:$C$1,0)) &  \" \"  &  \" {\"&COLUMN($D$793)&\"}\"","v":"//notes-assets-liabilities-not-recognised Commercial Separate  {4}"}]
[null,{"$f":"INDEX(labels!$A$584:$C$584,1,MATCH(PP_Language,labels!$A$1:$C$1,0))","v":"Notes to the financial statements - Assets and liabilities not recognised in balance sheet: Other amounts: Breakdown"}]
[]
[null,null,null,{"$f":"INDEX(labels!$A$102:$C$102,1,MATCH(PP_Language,labels!$A$1:$C$1,0))","v":"Current"},null,{"$f":"INDEX(labels!$A$104:$C$104,1,MATCH(PP_Language,labels!$A$1:$C$1,0))","v":"Previous"},null,null,null,null,null,null,null,null,null,null,null,null,null,null,null,null,null,null,null,{"$f":"\"/notes-assets-liabilities-not-recognised-other-amounts-breakdown label {\"&COLUMN($B$796)&\"}\"","v":"/notes-assets-liabilities-not-recognised-other-amounts-breakdown label {2}"},null,{"$f":"\"/notes-assets-liabilities-not-recognised-other-amounts-breakdown \" & BasisOfPreparationAxis & \" \"  & INDEX(labels!$A$103:$C$103,1,MATCH(PP_Language,labels!$A$1:$C$1,0)) &  \" \"  & INDEX(labels!$A$102:$C$102,1,MATCH(PP_Language,labels!$A$1:$C$1,0)) &  \" {\"&COLUMN($D$796)&\"}\"","v":"/notes-assets-liabilities-not-recognised-other-amounts-breakdown Commercial Separate Current {4}"},null,{"$f":"\"/notes-assets-liabilities-not-recognised-other-amounts-breakdown \" & BasisOfPreparationAxis & \" \"  & INDEX(labels!$A$103:$C$103,1,MATCH(PP_Language,labels!$A$1:$C$1,0)) &  \" \"  & INDEX(labels!$A$104:$C$104,1,MATCH(PP_Language,labels!$A$1:$C$1,0)) &  \" {\"&COLUMN($F$796)&\"}\"","v":"/notes-assets-liabilities-not-recognised-other-amounts-breakdown Commercial Separate Previous {6}"}]
[null,{"$f":"INDEX(labels!$A$585:$C$585,1,MATCH(PP_Language,labels!$A$1:$C$1,0))","v":"Contingent assets to which the legal entity committed"}]
[null,{"$f":"INDEX(labels!$A$586:$C$586,1,MATCH(PP_Language,labels!$A$1:$C$1,0))","v":"Contingent liabilities to which the legal entity committed"}]
[null,{"$f":"INDEX(labels!$A$587:$C$587,1,MATCH(PP_Language,labels!$A$1:$C$1,0))","v":"Liabilities to which the legal entity committed"}]
[null,{"$f":"INDEX(labels!$A$588:$C$588,1,MATCH(PP_Language,labels!$A$1:$C$1,0))","v":"Not recorded liabilities to which the legal entity committed"}]
[null,{"$f":"INDEX(labels!$A$589:$C$589,1,MATCH(PP_Language,labels!$A$1:$C$1,0))","v":"Contingent liabilities on behalf of group companies"}]
[null,{"$f":"INDEX(labels!$A$590:$C$590,1,MATCH(PP_Language,labels!$A$1:$C$1,0))","v":"Contingent liabilities from discounted exchanges or chèques on behalf of group companies"}]
[null,{"$f":"INDEX(labels!$A$591:$C$591,1,MATCH(PP_Language,labels!$A$1:$C$1,0))","v":"Contingent assets to which the legal entity committed on behalf of group companies"}]
[null,{"$f":"INDEX(labels!$A$592:$C$592,1,MATCH(PP_Language,labels!$A$1:$C$1,0))","v":"Contingent liabilities to which the legal entity committed on behalf of group companies"}]
[null,{"$f":"INDEX(labels!$A$593:$C$593,1,MATCH(PP_Language,labels!$A$1:$C$1,0))","v":"Liabilities to which the legal entity committed on behalf of group companies"}]
[null,{"$f":"INDEX(labels!$A$594:$C$594,1,MATCH(PP_Language,labels!$A$1:$C$1,0))","v":"Not recorded liabilities to which the legal entity committed on behalf of group companies"}]
[null,null,null,null,null,null,null,null,null,null,null,null,null,null,null,null,null,null,null,null,null,null,null,null,null,{"$f":"\"//notes-assets-liabilities-not-recognised-other-amounts-breakdown label {\"&COLUMN($B$807)&\"}\"","v":"//notes-assets-liabilities-not-recognised-other-amounts-breakdown label {2}"},null,{"$f":"\"//notes-assets-liabilities-not-recognised-other-amounts-breakdown \" & BasisOfPreparationAxis & \" \"  & INDEX(labels!$A$103:$C$103,1,MATCH(PP_Language,labels!$A$1:$C$1,0)) &  \" \"  & INDEX(labels!$A$102:$C$102,1,MATCH(PP_Language,labels!$A$1:$C$1,0)) &  \" {\"&COLUMN($D$807)&\"}\"","v":"//notes-assets-liabilities-not-recognised-other-amounts-breakdown Commercial Separate Current {4}"},null,{"$f":"\"//notes-assets-liabilities-not-recognised-other-amounts-breakdown \" & BasisOfPreparationAxis & \" \"  & INDEX(labels!$A$103:$C$103,1,MATCH(PP_Language,labels!$A$1:$C$1,0)) &  \" \"  & INDEX(labels!$A$104:$C$104,1,MATCH(PP_Language,labels!$A$1:$C$1,0)) &  \" {\"&COLUMN($F$807)&\"}\"","v":"//notes-assets-liabilities-not-recognised-other-amounts-breakdown Commercial Separate Previous {6}"}]
[null,{"$f":"INDEX(labels!$A$595:$C$595,1,MATCH(PP_Language,labels!$A$1:$C$1,0))","v":"Notes to the financial statements - Assets and liabilities not recognised in balance sheets: Payments to obtain usage rights: Breakdown maturity"}]
[]
[null,null,null,{"$f":"INDEX(labels!$A$102:$C$102,1,MATCH(PP_Language,labels!$A$1:$C$1,0))","v":"Current"},null,{"$f":"INDEX(labels!$A$104:$C$104,1,MATCH(PP_Language,labels!$A$1:$C$1,0))","v":"Previous"},null,null,null,null,null,null,null,null,null,null,null,null,null,null,null,null,null,null,null,{"$f":"\"/notes-contingent-liabilities-payments-obtain-usage-rights-breakdown-maturity label {\"&COLUMN($B$810)&\"}\"","v":"/notes-contingent-liabilities-payments-obtain-usage-rights-breakdown-maturity label {2}"},null,{"$f":"\"/notes-contingent-liabilities-payments-obtain-usage-rights-breakdown-maturity \" & BasisOfPreparationAxis & \" \"  & INDEX(labels!$A$103:$C$103,1,MATCH(PP_Language,labels!$A$1:$C$1,0)) &  \" \"  & INDEX(labels!$A$102:$C$102,1,MATCH(PP_Language,labels!$A$1:$C$1,0)) &  \" {\"&COLUMN($D$810)&\"}\"","v":"/notes-contingent-liabilities-payments-obtain-usage-rights-breakdown-maturity Commercial Separate Current {4}"},null,{"$f":"\"/notes-contingent-liabilities-payments-obtain-usage-rights-breakdown-maturity \" & BasisOfPreparationAxis & \" \"  & INDEX(labels!$A$103:$C$103,1,MATCH(PP_Language,labels!$A$1:$C$1,0)) &  \" \"  & INDEX(labels!$A$104:$C$104,1,MATCH(PP_Language,labels!$A$1:$C$1,0)) &  \" {\"&COLUMN($F$810)&\"}\"","v":"/notes-contingent-liabilities-payments-obtain-usage-rights-breakdown-maturity Commercial Separate Previous {6}"}]
[null,{"$f":"INDEX(labels!$A$596:$C$596,1,MATCH(PP_Language,labels!$A$1:$C$1,0))","v":"Off-balance sheet liabilities relating to payments to obtain usage rights"}]
[null,{"$f":"INDEX(labels!$A$597:$C$597,1,MATCH(PP_Language,labels!$A$1:$C$1,0))","v":"Off-balance sheet commitments relating to payments to obtain usage rights with a maturity exceeding one year"}]
[null,{"$f":"INDEX(labels!$A$598:$C$598,1,MATCH(PP_Language,labels!$A$1:$C$1,0))","v":"Off-balance sheet commitments relating to payments to obtain usage rights with a maturity exceeding five years"}]
[null,null,null,null,null,null,null,null,null,null,null,null,null,null,null,null,null,null,null,null,null,null,null,null,null,{"$f":"\"//notes-contingent-liabilities-payments-obtain-usage-rights-breakdown-maturity label {\"&COLUMN($B$814)&\"}\"","v":"//notes-contingent-liabilities-payments-obtain-usage-rights-breakdown-maturity label {2}"},null,{"$f":"\"//notes-contingent-liabilities-payments-obtain-usage-rights-breakdown-maturity \" & BasisOfPreparationAxis & \" \"  & INDEX(labels!$A$103:$C$103,1,MATCH(PP_Language,labels!$A$1:$C$1,0)) &  \" \"  & INDEX(labels!$A$102:$C$102,1,MATCH(PP_Language,labels!$A$1:$C$1,0)) &  \" {\"&COLUMN($D$814)&\"}\"","v":"//notes-contingent-liabilities-payments-obtain-usage-rights-breakdown-maturity Commercial Separate Current {4}"},null,{"$f":"\"//notes-contingent-liabilities-payments-obtain-usage-rights-breakdown-maturity \" & BasisOfPreparationAxis & \" \"  & INDEX(labels!$A$103:$C$103,1,MATCH(PP_Language,labels!$A$1:$C$1,0)) &  \" \"  & INDEX(labels!$A$104:$C$104,1,MATCH(PP_Language,labels!$A$1:$C$1,0)) &  \" {\"&COLUMN($F$814)&\"}\"","v":"//notes-contingent-liabilities-payments-obtain-usage-rights-breakdown-maturity Commercial Separate Previous {6}"}]
[null,{"$f":"INDEX(labels!$A$71:$C$71,1,MATCH(PP_Language,labels!$A$1:$C$1,0))","v":"Income statement"}]
[null,{"$f":"INDEX(labels!$A$77:$C$77,1,MATCH(PP_Language,labels!$A$1:$C$1,0))","v":"Depreciation of property, plant and equipment and amortisation of intangible assets"}]
[null,{"$f":"INDEX(labels!$A$599:$C$599,1,MATCH(PP_Language,labels!$A$1:$C$1,0))","v":"Notes to the financial statements - Amortisation of intangible assets and depreciation of property, plant and equipment"}]
[null,null,null,null,null,null,null,null,null,null,null,null,null,null,null,null,null,null,null,null,null,null,null,null,null,{"$f":"\"/notes-amortisation-depreciation label {\"&COLUMN($B$818)&\"}\"","v":"/notes-amortisation-depreciation label {2}"},null,{"$f":"\"/notes-amortisation-depreciation \" & BasisOfPreparationAxis & \" \"  & INDEX(labels!$A$103:$C$103,1,MATCH(PP_Language,labels!$A$1:$C$1,0)) &  \" \"  &  \" {\"&COLUMN($D$818)&\"}\"","v":"/notes-amortisation-depreciation Commercial Separate  {4}"}]
[null,{"$f":"INDEX(labels!$A$600:$C$600,1,MATCH(PP_Language,labels!$A$1:$C$1,0))","v":"Disclosure of amortisation and depreciation of the amount of arbitrary depreciation and amortisation that exceeds the amount of regular depreciation and amortisation"}]
[null,null,null,null,null,null,null,null,null,null,null,null,null,null,null,null,null,null,null,null,null,null,null,null,null,{"$f":"\"//notes-amortisation-depreciation label {\"&COLUMN($B$820)&\"}\"","v":"//notes-amortisation-depreciation label {2}"},null,{"$f":"\"//notes-amortisation-depreciation \" & BasisOfPreparationAxis & \" \"  & INDEX(labels!$A$103:$C$103,1,MATCH(PP_Language,labels!$A$1:$C$1,0)) &  \" \"  &  \" {\"&COLUMN($D$820)&\"}\"","v":"//notes-amortisation-depreciation Commercial Separate  {4}"}]
[null,{"$f":"INDEX(labels!$A$602:$C$602,1,MATCH(PP_Language,labels!$A$1:$C$1,0))","v":"Notes to the financial statements - Impairment loss of individual asset of material importance: Specification"}]
[]
[]
[null,null,null,{"$f":"INDEX(labels!$A$603:$C$603,1,MATCH(PP_Language,labels!$A$1:$C$1,0))","v":"Individual asset"},{"$f":"INDEX(labels!$A$603:$C$603,1,MATCH(PP_Language,labels!$A$1:$C$1,0))","v":"Individual asset"},{"$f":"INDEX(labels!$A$603:$C$603,1,MATCH(PP_Language,labels!$A$1:$C$1,0))","v":"Individual asset"},{"$f":"INDEX(labels!$A$603:$C$603,1,MATCH(PP_Language,labels!$A$1:$C$1,0))","v":"Individual asset"},{"$f":"INDEX(labels!$A$603:$C$603,1,MATCH(PP_Language,labels!$A$1:$C$1,0))","v":"Individual asset"},null,null,null,null,null,null,null,null,null,null,null,null,null,null,null,null,null,{"$f":"\"/notes-material-impairment-loss-individual-asset-specification label {\"&COLUMN($B$824)&\"}\"","v":"/notes-material-impairment-loss-individual-asset-specification label {2}"},null,{"$f":"\"/notes-material-impairment-loss-individual-asset-specification \" & BasisOfPreparationAxis & \" \"  & INDEX(labels!$A$603:$C$603,1,MATCH(PP_Language,labels!$A$1:$C$1,0)) &  \" \"  & INDEX(labels!$A$103:$C$103,1,MATCH(PP_Language,labels!$A$1:$C$1,0)) &  \" {\"&COLUMN($D$824)&\"}\"","v":"/notes-material-impairment-loss-individual-asset-specification Commercial Individual asset Separate {4}"},{"$f":"\"/notes-material-impairment-loss-individual-asset-specification \" & BasisOfPreparationAxis & \" \"  & INDEX(labels!$A$603:$C$603,1,MATCH(PP_Language,labels!$A$1:$C$1,0)) &  \" \"  & INDEX(labels!$A$103:$C$103,1,MATCH(PP_Language,labels!$A$1:$C$1,0)) &  \" {\"&COLUMN($E$824)&\"}\"","v":"/notes-material-impairment-loss-individual-asset-specification Commercial Individual asset Separate {5}"},{"$f":"\"/notes-material-impairment-loss-individual-asset-specification \" & BasisOfPreparationAxis & \" \"  & INDEX(labels!$A$603:$C$603,1,MATCH(PP_Language,labels!$A$1:$C$1,0)) &  \" \"  & INDEX(labels!$A$103:$C$103,1,MATCH(PP_Language,labels!$A$1:$C$1,0)) &  \" {\"&COLUMN($F$824)&\"}\"","v":"/notes-material-impairment-loss-individual-asset-specification Commercial Individual asset Separate {6}"},{"$f":"\"/notes-material-impairment-loss-individual-asset-specification \" & BasisOfPreparationAxis & \" \"  & INDEX(labels!$A$603:$C$603,1,MATCH(PP_Language,labels!$A$1:$C$1,0)) &  \" \"  & INDEX(labels!$A$103:$C$103,1,MATCH(PP_Language,labels!$A$1:$C$1,0)) &  \" {\"&COLUMN($G$824)&\"}\"","v":"/notes-material-impairment-loss-individual-asset-specification Commercial Individual asset Separate {7}"},{"$f":"\"/notes-material-impairment-loss-individual-asset-specification \" & BasisOfPreparationAxis & \" \"  & INDEX(labels!$A$603:$C$603,1,MATCH(PP_Language,labels!$A$1:$C$1,0)) &  \" \"  & INDEX(labels!$A$103:$C$103,1,MATCH(PP_Language,labels!$A$1:$C$1,0)) &  \" {\"&COLUMN($H$824)&\"}\"","v":"/notes-material-impairment-loss-individual-asset-specification Commercial Individual asset Separate {8}"}]
[null,{"$f":"INDEX(labels!$A$604:$C$604,1,MATCH(PP_Language,labels!$A$1:$C$1,0))","v":"Description Individual asset"}]
[null,{"$f":"INDEX(labels!$A$605:$C$605,1,MATCH(PP_Language,labels!$A$1:$C$1,0))","v":"Description of the nature of the individual asset for which an impairment loss, or reversal thereof, is recognized which is material"}]
[null,{"$f":"INDEX(labels!$A$606:$C$606,1,MATCH(PP_Language,labels!$A$1:$C$1,0))","v":"Description of the segment to be reported to which it is individually active, for which an impairment loss, or reversal thereof, is justified which is material"}]
[null,{"$f":"INDEX(labels!$A$607:$C$607,1,MATCH(PP_Language,labels!$A$1:$C$1,0))","v":"Description of whether the current value or the value in use is applicable"}]
[null,{"$f":"INDEX(labels!$A$172:$C$172,1,MATCH(PP_Language,labels!$A$1:$C$1,0))","v":"Presentation order"}]
[null,null,null,null,null,null,null,null,null,null,null,null,null,null,null,null,null,null,null,null,null,null,null,null,null,{"$f":"\"//notes-material-impairment-loss-individual-asset-specification label {\"&COLUMN($B$830)&\"}\"","v":"//notes-material-impairment-loss-individual-asset-specification label {2}"},null,{"$f":"\"//notes-material-impairment-loss-individual-asset-specification \" & BasisOfPreparationAxis & \" \"  & INDEX(labels!$A$603:$C$603,1,MATCH(PP_Language,labels!$A$1:$C$1,0)) &  \" \"  & INDEX(labels!$A$103:$C$103,1,MATCH(PP_Language,labels!$A$1:$C$1,0)) &  \" {\"&COLUMN($D$830)&\"}\"","v":"//notes-material-impairment-loss-individual-asset-specification Commercial Individual asset Separate {4}"},{"$f":"\"//notes-material-impairment-loss-individual-asset-specification \" & BasisOfPreparationAxis & \" \"  & INDEX(labels!$A$603:$C$603,1,MATCH(PP_Language,labels!$A$1:$C$1,0)) &  \" \"  & INDEX(labels!$A$103:$C$103,1,MATCH(PP_Language,labels!$A$1:$C$1,0)) &  \" {\"&COLUMN($E$830)&\"}\"","v":"//notes-material-impairment-loss-individual-asset-specification Commercial Individual asset Separate {5}"},{"$f":"\"//notes-material-impairment-loss-individual-asset-specification \" & BasisOfPreparationAxis & \" \"  & INDEX(labels!$A$603:$C$603,1,MATCH(PP_Language,labels!$A$1:$C$1,0)) &  \" \"  & INDEX(labels!$A$103:$C$103,1,MATCH(PP_Language,labels!$A$1:$C$1,0)) &  \" {\"&COLUMN($F$830)&\"}\"","v":"//notes-material-impairment-loss-individual-asset-specification Commercial Individual asset Separate {6}"},{"$f":"\"//notes-material-impairment-loss-individual-asset-specification \" & BasisOfPreparationAxis & \" \"  & INDEX(labels!$A$603:$C$603,1,MATCH(PP_Language,labels!$A$1:$C$1,0)) &  \" \"  & INDEX(labels!$A$103:$C$103,1,MATCH(PP_Language,labels!$A$1:$C$1,0)) &  \" {\"&COLUMN($G$830)&\"}\"","v":"//notes-material-impairment-loss-individual-asset-specification Commercial Individual asset Separate {7}"},{"$f":"\"//notes-material-impairment-loss-individual-asset-specification \" & BasisOfPreparationAxis & \" \"  & INDEX(labels!$A$603:$C$603,1,MATCH(PP_Language,labels!$A$1:$C$1,0)) &  \" \"  & INDEX(labels!$A$103:$C$103,1,MATCH(PP_Language,labels!$A$1:$C$1,0)) &  \" {\"&COLUMN($H$830)&\"}\"","v":"//notes-material-impairment-loss-individual-asset-specification Commercial Individual asset Separate {8}"}]
[null,{"$f":"INDEX(labels!$A$84:$C$84,1,MATCH(PP_Language,labels!$A$1:$C$1,0))","v":"Income tax expense"}]
[null,{"$f":"INDEX(labels!$A$608:$C$608,1,MATCH(PP_Language,labels!$A$1:$C$1,0))","v":"Notes to the financial statements - Income tax expense"}]
[null,null,null,null,null,null,null,null,null,null,null,null,null,null,null,null,null,null,null,null,null,null,null,null,null,{"$f":"\"/notes-income-tax-expense label {\"&COLUMN($B$833)&\"}\"","v":"/notes-income-tax-expense label {2}"},null,{"$f":"\"/notes-income-tax-expense \" & BasisOfPreparationAxis & \" \"  & INDEX(labels!$A$103:$C$103,1,MATCH(PP_Language,labels!$A$1:$C$1,0)) &  \" \"  &  \" {\"&COLUMN($D$833)&\"}\"","v":"/notes-income-tax-expense Commercial Separate  {4}"}]
[null,{"$f":"INDEX(labels!$A$609:$C$609,1,MATCH(PP_Language,labels!$A$1:$C$1,0))","v":"Disclosure of income tax expense"}]
[null,{"$f":"INDEX(labels!$A$610:$C$610,1,MATCH(PP_Language,labels!$A$1:$C$1,0))","v":"Disclosure of income tax expense from ordinary activities"}]
[null,{"$f":"INDEX(labels!$A$611:$C$611,1,MATCH(PP_Language,labels!$A$1:$C$1,0))","v":"Disclosure of the reconciliation of the income tax expense to the corporate tax return"}]
[null,{"$f":"INDEX(labels!$A$612:$C$612,1,MATCH(PP_Language,labels!$A$1:$C$1,0))","v":"Disclosure of income tax recognised directly in equity"}]
[null,null,null,null,null,null,null,null,null,null,null,null,null,null,null,null,null,null,null,null,null,null,null,null,null,{"$f":"\"//notes-income-tax-expense label {\"&COLUMN($B$838)&\"}\"","v":"//notes-income-tax-expense label {2}"},null,{"$f":"\"//notes-income-tax-expense \" & BasisOfPreparationAxis & \" \"  & INDEX(labels!$A$103:$C$103,1,MATCH(PP_Language,labels!$A$1:$C$1,0)) &  \" \"  &  \" {\"&COLUMN($D$838)&\"}\"","v":"//notes-income-tax-expense Commercial Separate  {4}"}]
[null,{"$f":"INDEX(labels!$A$613:$C$613,1,MATCH(PP_Language,labels!$A$1:$C$1,0))","v":"Notes to the financial statements - Income tax expense: Other amounts: Breakdown"}]
[]
[null,null,null,{"$f":"INDEX(labels!$A$102:$C$102,1,MATCH(PP_Language,labels!$A$1:$C$1,0))","v":"Current"},null,{"$f":"INDEX(labels!$A$104:$C$104,1,MATCH(PP_Language,labels!$A$1:$C$1,0))","v":"Previous"},null,null,null,null,null,null,null,null,null,null,null,null,null,null,null,null,null,null,null,{"$f":"\"/notes-income-tax-expense-other-amounts-breakdown label {\"&COLUMN($B$841)&\"}\"","v":"/notes-income-tax-expense-other-amounts-breakdown label {2}"},null,{"$f":"\"/notes-income-tax-expense-other-amounts-breakdown \" & BasisOfPreparationAxis & \" \"  & INDEX(labels!$A$103:$C$103,1,MATCH(PP_Language,labels!$A$1:$C$1,0)) &  \" \"  & INDEX(labels!$A$102:$C$102,1,MATCH(PP_Language,labels!$A$1:$C$1,0)) &  \" {\"&COLUMN($D$841)&\"}\"","v":"/notes-income-tax-expense-other-amounts-breakdown Commercial Separate Current {4}"},null,{"$f":"\"/notes-income-tax-expense-other-amounts-breakdown \" & BasisOfPreparationAxis & \" \"  & INDEX(labels!$A$103:$C$103,1,MATCH(PP_Language,labels!$A$1:$C$1,0)) &  \" \"  & INDEX(labels!$A$104:$C$104,1,MATCH(PP_Language,labels!$A$1:$C$1,0)) &  \" {\"&COLUMN($F$841)&\"}\"","v":"/notes-income-tax-expense-other-amounts-breakdown Commercial Separate Previous {6}"}]
[null,{"$f":"INDEX(labels!$A$614:$C$614,1,MATCH(PP_Language,labels!$A$1:$C$1,0))","v":"Limited deductible expenses"}]
[null,{"$f":"INDEX(labels!$A$615:$C$615,1,MATCH(PP_Language,labels!$A$1:$C$1,0))","v":"Non deductible expenses"}]
[null,null,null,null,null,null,null,null,null,null,null,null,null,null,null,null,null,null,null,null,null,null,null,null,null,{"$f":"\"//notes-income-tax-expense-other-amounts-breakdown label {\"&COLUMN($B$844)&\"}\"","v":"//notes-income-tax-expense-other-amounts-breakdown label {2}"},null,{"$f":"\"//notes-income-tax-expense-other-amounts-breakdown \" & BasisOfPreparationAxis & \" \"  & INDEX(labels!$A$103:$C$103,1,MATCH(PP_Language,labels!$A$1:$C$1,0)) &  \" \"  & INDEX(labels!$A$102:$C$102,1,MATCH(PP_Language,labels!$A$1:$C$1,0)) &  \" {\"&COLUMN($D$844)&\"}\"","v":"//notes-income-tax-expense-other-amounts-breakdown Commercial Separate Current {4}"},null,{"$f":"\"//notes-income-tax-expense-other-amounts-breakdown \" & BasisOfPreparationAxis & \" \"  & INDEX(labels!$A$103:$C$103,1,MATCH(PP_Language,labels!$A$1:$C$1,0)) &  \" \"  & INDEX(labels!$A$104:$C$104,1,MATCH(PP_Language,labels!$A$1:$C$1,0)) &  \" {\"&COLUMN($F$844)&\"}\"","v":"//notes-income-tax-expense-other-amounts-breakdown Commercial Separate Previous {6}"}]
[null,{"$f":"INDEX(labels!$A$89:$C$89,1,MATCH(PP_Language,labels!$A$1:$C$1,0))","v":"Other notes"}]
[null,{"$f":"INDEX(labels!$A$90:$C$90,1,MATCH(PP_Language,labels!$A$1:$C$1,0))","v":"Licensing agreements"}]
[null,{"$f":"INDEX(labels!$A$618:$C$618,1,MATCH(PP_Language,labels!$A$1:$C$1,0))","v":"Notes to the financial statements - Licensing agreements"}]
[null,null,null,null,null,null,null,null,null,null,null,null,null,null,null,null,null,null,null,null,null,null,null,null,null,{"$f":"\"/notes-licensing-agreements label {\"&COLUMN($B$848)&\"}\"","v":"/notes-licensing-agreements label {2}"},null,{"$f":"\"/notes-licensing-agreements \" & BasisOfPreparationAxis & \" \"  & INDEX(labels!$A$103:$C$103,1,MATCH(PP_Language,labels!$A$1:$C$1,0)) &  \" \"  &  \" {\"&COLUMN($D$848)&\"}\"","v":"/notes-licensing-agreements Commercial Separate  {4}"}]
[null,{"$f":"INDEX(labels!$A$619:$C$619,1,MATCH(PP_Language,labels!$A$1:$C$1,0))","v":"Policy of public-private concession agreements"}]
[null,{"$f":"INDEX(labels!$A$620:$C$620,1,MATCH(PP_Language,labels!$A$1:$C$1,0))","v":"Disclosure of licensing agreements"}]
[null,{"$f":"INDEX(labels!$A$621:$C$621,1,MATCH(PP_Language,labels!$A$1:$C$1,0))","v":"Description of the main licensing agreements"}]
[null,{"$f":"INDEX(labels!$A$622:$C$622,1,MATCH(PP_Language,labels!$A$1:$C$1,0))","v":"Description of the most important conditions in the agreements concerning concessions that influence the size, the moment and the certainty of the future cash flows"}]
[null,{"$f":"INDEX(labels!$A$623:$C$623,1,MATCH(PP_Language,labels!$A$1:$C$1,0))","v":"Description of the nature and extent of the rights to the use of specific assets"}]
[null,{"$f":"INDEX(labels!$A$624:$C$624,1,MATCH(PP_Language,labels!$A$1:$C$1,0))","v":"Description of the nature and extent of service obligations or the rights to expected services"}]
[null,{"$f":"INDEX(labels!$A$625:$C$625,1,MATCH(PP_Language,labels!$A$1:$C$1,0))","v":"Description of the nature and extent of the obligations for the purchase or construction of property, plant and equipment"}]
[null,{"$f":"INDEX(labels!$A$626:$C$626,1,MATCH(PP_Language,labels!$A$1:$C$1,0))","v":"Description of the nature and extent of the obligations to transfer specific assets at the end of the concession period or the rights to receive these assets"}]
[null,{"$f":"INDEX(labels!$A$627:$C$627,1,MATCH(PP_Language,labels!$A$1:$C$1,0))","v":"Description of the nature and extent of the options for extension or termination"}]
[null,{"$f":"INDEX(labels!$A$628:$C$628,1,MATCH(PP_Language,labels!$A$1:$C$1,0))","v":"Description of the nature and extent of other rights and obligations"}]
[null,{"$f":"INDEX(labels!$A$629:$C$629,1,MATCH(PP_Language,labels!$A$1:$C$1,0))","v":"Description of the changes of the agreements during the period if applicable; and the manner in which the concession agreement is classified"}]
[null,null,null,null,null,null,null,null,null,null,null,null,null,null,null,null,null,null,null,null,null,null,null,null,null,{"$f":"\"//notes-licensing-agreements label {\"&COLUMN($B$860)&\"}\"","v":"//notes-licensing-agreements label {2}"},null,{"$f":"\"//notes-licensing-agreements \" & BasisOfPreparationAxis & \" \"  & INDEX(labels!$A$103:$C$103,1,MATCH(PP_Language,labels!$A$1:$C$1,0)) &  \" \"  &  \" {\"&COLUMN($D$860)&\"}\"","v":"//notes-licensing-agreements Commercial Separate  {4}"}]
[null,{"$f":"INDEX(labels!$A$91:$C$91,1,MATCH(PP_Language,labels!$A$1:$C$1,0))","v":"Average number of employees"}]
[null,{"$f":"INDEX(labels!$A$630:$C$630,1,MATCH(PP_Language,labels!$A$1:$C$1,0))","v":"Notes to the financial statements - Average number of employees: Breakdown"}]
[]
[null,null,null,{"$f":"INDEX(labels!$A$102:$C$102,1,MATCH(PP_Language,labels!$A$1:$C$1,0))","v":"Current"},null,{"$f":"INDEX(labels!$A$104:$C$104,1,MATCH(PP_Language,labels!$A$1:$C$1,0))","v":"Previous"},null,null,null,null,null,null,null,null,null,null,null,null,null,null,null,null,null,null,null,{"$f":"\"/notes-average-number-of-employees-breakdown label {\"&COLUMN($B$864)&\"}\"","v":"/notes-average-number-of-employees-breakdown label {2}"},null,{"$f":"\"/notes-average-number-of-employees-breakdown \" & BasisOfPreparationAxis & \" \"  & INDEX(labels!$A$103:$C$103,1,MATCH(PP_Language,labels!$A$1:$C$1,0)) &  \" \"  & INDEX(labels!$A$102:$C$102,1,MATCH(PP_Language,labels!$A$1:$C$1,0)) &  \" {\"&COLUMN($D$864)&\"}\"","v":"/notes-average-number-of-employees-breakdown Commercial Separate Current {4}"},null,{"$f":"\"/notes-average-number-of-employees-breakdown \" & BasisOfPreparationAxis & \" \"  & INDEX(labels!$A$103:$C$103,1,MATCH(PP_Language,labels!$A$1:$C$1,0)) &  \" \"  & INDEX(labels!$A$104:$C$104,1,MATCH(PP_Language,labels!$A$1:$C$1,0)) &  \" {\"&COLUMN($F$864)&\"}\"","v":"/notes-average-number-of-employees-breakdown Commercial Separate Previous {6}"}]
[null,{"$f":"INDEX(labels!$A$631:$C$631,1,MATCH(PP_Language,labels!$A$1:$C$1,0))","v":"Average number of employees over the period working in the Netherlands"}]
[null,{"$f":"INDEX(labels!$A$632:$C$632,1,MATCH(PP_Language,labels!$A$1:$C$1,0))","v":"Average number of employees over the period working outside the Netherlands"}]
[]
[null,{"$f":"INDEX(labels!$A$633:$C$633,1,MATCH(PP_Language,labels!$A$1:$C$1,0))","v":"Total of average number of employees over the period"}]
[null,null,null,null,null,null,null,null,null,null,null,null,null,null,null,null,null,null,null,null,null,null,null,null,null,{"$f":"\"//notes-average-number-of-employees-breakdown label {\"&COLUMN($B$869)&\"}\"","v":"//notes-average-number-of-employees-breakdown label {2}"},null,{"$f":"\"//notes-average-number-of-employees-breakdown \" & BasisOfPreparationAxis & \" \"  & INDEX(labels!$A$103:$C$103,1,MATCH(PP_Language,labels!$A$1:$C$1,0)) &  \" \"  & INDEX(labels!$A$102:$C$102,1,MATCH(PP_Language,labels!$A$1:$C$1,0)) &  \" {\"&COLUMN($D$869)&\"}\"","v":"//notes-average-number-of-employees-breakdown Commercial Separate Current {4}"},null,{"$f":"\"//notes-average-number-of-employees-breakdown \" & BasisOfPreparationAxis & \" \"  & INDEX(labels!$A$103:$C$103,1,MATCH(PP_Language,labels!$A$1:$C$1,0)) &  \" \"  & INDEX(labels!$A$104:$C$104,1,MATCH(PP_Language,labels!$A$1:$C$1,0)) &  \" {\"&COLUMN($F$869)&\"}\"","v":"//notes-average-number-of-employees-breakdown Commercial Separate Previous {6}"}]
[null,{"$f":"INDEX(labels!$A$634:$C$634,1,MATCH(PP_Language,labels!$A$1:$C$1,0))","v":"Notes to the financial statements - Average number of employees"}]
[null,null,null,null,null,null,null,null,null,null,null,null,null,null,null,null,null,null,null,null,null,null,null,null,null,{"$f":"\"/notes-average-number-of-employees label {\"&COLUMN($B$871)&\"}\"","v":"/notes-average-number-of-employees label {2}"},null,{"$f":"\"/notes-average-number-of-employees \" & BasisOfPreparationAxis & \" \"  & INDEX(labels!$A$103:$C$103,1,MATCH(PP_Language,labels!$A$1:$C$1,0)) &  \" \"  &  \" {\"&COLUMN($D$871)&\"}\"","v":"/notes-average-number-of-employees Commercial Separate  {4}"}]
[null,{"$f":"INDEX(labels!$A$635:$C$635,1,MATCH(PP_Language,labels!$A$1:$C$1,0))","v":"Disclosure of average number of employees during the period"}]
[null,null,null,null,null,null,null,null,null,null,null,null,null,null,null,null,null,null,null,null,null,null,null,null,null,{"$f":"\"//notes-average-number-of-employees label {\"&COLUMN($B$873)&\"}\"","v":"//notes-average-number-of-employees label {2}"},null,{"$f":"\"//notes-average-number-of-employees \" & BasisOfPreparationAxis & \" \"  & INDEX(labels!$A$103:$C$103,1,MATCH(PP_Language,labels!$A$1:$C$1,0)) &  \" \"  &  \" {\"&COLUMN($D$873)&\"}\"","v":"//notes-average-number-of-employees Commercial Separate  {4}"}]
[null,{"$f":"INDEX(labels!$A$92:$C$92,1,MATCH(PP_Language,labels!$A$1:$C$1,0))","v":"Financial instruments"}]
[null,{"$f":"INDEX(labels!$A$636:$C$636,1,MATCH(PP_Language,labels!$A$1:$C$1,0))","v":"Notes to the financial statements - Financial instruments"}]
[null,null,null,null,null,null,null,null,null,null,null,null,null,null,null,null,null,null,null,null,null,null,null,null,null,{"$f":"\"/notes-financial-instruments label {\"&COLUMN($B$876)&\"}\"","v":"/notes-financial-instruments label {2}"},null,{"$f":"\"/notes-financial-instruments \" & BasisOfPreparationAxis & \" \"  & INDEX(labels!$A$103:$C$103,1,MATCH(PP_Language,labels!$A$1:$C$1,0)) &  \" \"  &  \" {\"&COLUMN($D$876)&\"}\"","v":"/notes-financial-instruments Commercial Separate  {4}"}]
[null,{"$f":"INDEX(labels!$A$637:$C$637,1,MATCH(PP_Language,labels!$A$1:$C$1,0))","v":"Disclosure of financial instruments"}]
[null,{"$f":"INDEX(labels!$A$638:$C$638,1,MATCH(PP_Language,labels!$A$1:$C$1,0))","v":"Disclosure of financial assets of book value higher than current value"}]
[null,{"$f":"INDEX(labels!$A$639:$C$639,1,MATCH(PP_Language,labels!$A$1:$C$1,0))","v":"Information relating to the nature and extent of derivative financial instruments not valued against actual values"}]
[null,{"$f":"INDEX(labels!$A$640:$C$640,1,MATCH(PP_Language,labels!$A$1:$C$1,0))","v":"Terms and conditions that may affect the amount, timing and certainty of future cash flows of derivative financial instruments"}]
[null,null,null,null,null,null,null,null,null,null,null,null,null,null,null,null,null,null,null,null,null,null,null,null,null,{"$f":"\"//notes-financial-instruments label {\"&COLUMN($B$881)&\"}\"","v":"//notes-financial-instruments label {2}"},null,{"$f":"\"//notes-financial-instruments \" & BasisOfPreparationAxis & \" \"  & INDEX(labels!$A$103:$C$103,1,MATCH(PP_Language,labels!$A$1:$C$1,0)) &  \" \"  &  \" {\"&COLUMN($D$881)&\"}\"","v":"//notes-financial-instruments Commercial Separate  {4}"}]
[null,{"$f":"INDEX(labels!$A$641:$C$641,1,MATCH(PP_Language,labels!$A$1:$C$1,0))","v":"Notes to the financial statements - Payments due to termination of the employment to senior officials with or without employment: Specification"}]
[]
[]
[null,null,null,{"$f":"INDEX(labels!$A$642:$C$642,1,MATCH(PP_Language,labels!$A$1:$C$1,0))","v":"The name (consisting of the initials and last name) of the senior official"},{"$f":"INDEX(labels!$A$642:$C$642,1,MATCH(PP_Language,labels!$A$1:$C$1,0))","v":"The name (consisting of the initials and last name) of the senior official"},{"$f":"INDEX(labels!$A$642:$C$642,1,MATCH(PP_Language,labels!$A$1:$C$1,0))","v":"The name (consisting of the initials and last name) of the senior official"},{"$f":"INDEX(labels!$A$642:$C$642,1,MATCH(PP_Language,labels!$A$1:$C$1,0))","v":"The name (consisting of the initials and last name) of the senior official"},{"$f":"INDEX(labels!$A$642:$C$642,1,MATCH(PP_Language,labels!$A$1:$C$1,0))","v":"The name (consisting of the initials and last name) of the senior official"},null,null,null,null,null,null,null,null,null,null,null,null,null,null,null,null,null,{"$f":"\"/notes-payments-due-to-termination-employment-senior-officials-specification label {\"&COLUMN($B$885)&\"}\"","v":"/notes-payments-due-to-termination-employment-senior-officials-specification label {2}"},null,{"$f":"\"/notes-payments-due-to-termination-employment-senior-officials-specification \" & BasisOfPreparationAxis & \" \"  & INDEX(labels!$A$103:$C$103,1,MATCH(PP_Language,labels!$A$1:$C$1,0)) &  \" \"  & INDEX(labels!$A$642:$C$642,1,MATCH(PP_Language,labels!$A$1:$C$1,0)) &  \" {\"&COLUMN($D$885)&\"}\"","v":"/notes-payments-due-to-termination-employment-senior-officials-specification Commercial Separate The name (consisting of the initials and last name) of the senior official {4}"},{"$f":"\"/notes-payments-due-to-termination-employment-senior-officials-specification \" & BasisOfPreparationAxis & \" \"  & INDEX(labels!$A$103:$C$103,1,MATCH(PP_Language,labels!$A$1:$C$1,0)) &  \" \"  & INDEX(labels!$A$642:$C$642,1,MATCH(PP_Language,labels!$A$1:$C$1,0)) &  \" {\"&COLUMN($E$885)&\"}\"","v":"/notes-payments-due-to-termination-employment-senior-officials-specification Commercial Separate The name (consisting of the initials and last name) of the senior official {5}"},{"$f":"\"/notes-payments-due-to-termination-employment-senior-officials-specification \" & BasisOfPreparationAxis & \" \"  & INDEX(labels!$A$103:$C$103,1,MATCH(PP_Language,labels!$A$1:$C$1,0)) &  \" \"  & INDEX(labels!$A$642:$C$642,1,MATCH(PP_Language,labels!$A$1:$C$1,0)) &  \" {\"&COLUMN($F$885)&\"}\"","v":"/notes-payments-due-to-termination-employment-senior-officials-specification Commercial Separate The name (consisting of the initials and last name) of the senior official {6}"},{"$f":"\"/notes-payments-due-to-termination-employment-senior-officials-specification \" & BasisOfPreparationAxis & \" \"  & INDEX(labels!$A$103:$C$103,1,MATCH(PP_Language,labels!$A$1:$C$1,0)) &  \" \"  & INDEX(labels!$A$642:$C$642,1,MATCH(PP_Language,labels!$A$1:$C$1,0)) &  \" {\"&COLUMN($G$885)&\"}\"","v":"/notes-payments-due-to-termination-employment-senior-officials-specification Commercial Separate The name (consisting of the initials and last name) of the senior official {7}"},{"$f":"\"/notes-payments-due-to-termination-employment-senior-officials-specification \" & BasisOfPreparationAxis & \" \"  & INDEX(labels!$A$103:$C$103,1,MATCH(PP_Language,labels!$A$1:$C$1,0)) &  \" \"  & INDEX(labels!$A$642:$C$642,1,MATCH(PP_Language,labels!$A$1:$C$1,0)) &  \" {\"&COLUMN($H$885)&\"}\"","v":"/notes-payments-due-to-termination-employment-senior-officials-specification Commercial Separate The name (consisting of the initials and last name) of the senior official {8}"}]
[null,{"$f":"INDEX(labels!$A$643:$C$643,1,MATCH(PP_Language,labels!$A$1:$C$1,0))","v":"Description The name (consisting of the initials and last name) of the senior official"}]
[null,{"$f":"INDEX(labels!$A$644:$C$644,1,MATCH(PP_Language,labels!$A$1:$C$1,0))","v":"Position(s)"}]
[null,{"$f":"INDEX(labels!$A$645:$C$645,1,MATCH(PP_Language,labels!$A$1:$C$1,0))","v":"Extent of employment as a part-time factor in FTE"}]
[null,{"$f":"INDEX(labels!$A$646:$C$646,1,MATCH(PP_Language,labels!$A$1:$C$1,0))","v":"Year of termination of the employment"}]
[null,{"$f":"INDEX(labels!$A$647:$C$647,1,MATCH(PP_Language,labels!$A$1:$C$1,0))","v":"Agreed payments due to termination"}]
[null,{"$f":"INDEX(labels!$A$648:$C$648,1,MATCH(PP_Language,labels!$A$1:$C$1,0))","v":"Individual maximum remuneration"}]
[null,{"$f":"INDEX(labels!$A$649:$C$649,1,MATCH(PP_Language,labels!$A$1:$C$1,0))","v":"Total of payments due to termination of the employment"}]
[null,{"$f":"INDEX(labels!$A$650:$C$650,1,MATCH(PP_Language,labels!$A$1:$C$1,0))","v":"Payments made in the financial year due to termination of the employment"}]
[null,{"$f":"INDEX(labels!$A$651:$C$651,1,MATCH(PP_Language,labels!$A$1:$C$1,0))","v":"Undue payments and amounts not yet received"}]
[null,{"$f":"INDEX(labels!$A$652:$C$652,1,MATCH(PP_Language,labels!$A$1:$C$1,0))","v":"Amount exceeding maximum remuneration"}]
[null,{"$f":"INDEX(labels!$A$653:$C$653,1,MATCH(PP_Language,labels!$A$1:$C$1,0))","v":"Reasons for exceeding the maximum amount of remuneration"}]
[null,{"$f":"INDEX(labels!$A$654:$C$654,1,MATCH(PP_Language,labels!$A$1:$C$1,0))","v":"Description of the claim for undue payment"}]
[null,{"$f":"INDEX(labels!$A$655:$C$655,1,MATCH(PP_Language,labels!$A$1:$C$1,0))","v":"Error recovery in WNT accountability"}]
[null,{"$f":"INDEX(labels!$A$656:$C$656,1,MATCH(PP_Language,labels!$A$1:$C$1,0))","v":"Explanation of the difference and cause of error recovery"}]
[null,{"$f":"INDEX(labels!$A$172:$C$172,1,MATCH(PP_Language,labels!$A$1:$C$1,0))","v":"Presentation order"}]
[null,null,null,null,null,null,null,null,null,null,null,null,null,null,null,null,null,null,null,null,null,null,null,null,null,{"$f":"\"//notes-payments-due-to-termination-employment-senior-officials-specification label {\"&COLUMN($B$901)&\"}\"","v":"//notes-payments-due-to-termination-employment-senior-officials-specification label {2}"},null,{"$f":"\"//notes-payments-due-to-termination-employment-senior-officials-specification \" & BasisOfPreparationAxis & \" \"  & INDEX(labels!$A$103:$C$103,1,MATCH(PP_Language,labels!$A$1:$C$1,0)) &  \" \"  & INDEX(labels!$A$642:$C$642,1,MATCH(PP_Language,labels!$A$1:$C$1,0)) &  \" {\"&COLUMN($D$901)&\"}\"","v":"//notes-payments-due-to-termination-employment-senior-officials-specification Commercial Separate The name (consisting of the initials and last name) of the senior official {4}"},{"$f":"\"//notes-payments-due-to-termination-employment-senior-officials-specification \" & BasisOfPreparationAxis & \" \"  & INDEX(labels!$A$103:$C$103,1,MATCH(PP_Language,labels!$A$1:$C$1,0)) &  \" \"  & INDEX(labels!$A$642:$C$642,1,MATCH(PP_Language,labels!$A$1:$C$1,0)) &  \" {\"&COLUMN($E$901)&\"}\"","v":"//notes-payments-due-to-termination-employment-senior-officials-specification Commercial Separate The name (consisting of the initials and last name) of the senior official {5}"},{"$f":"\"//notes-payments-due-to-termination-employment-senior-officials-specification \" & BasisOfPreparationAxis & \" \"  & INDEX(labels!$A$103:$C$103,1,MATCH(PP_Language,labels!$A$1:$C$1,0)) &  \" \"  & INDEX(labels!$A$642:$C$642,1,MATCH(PP_Language,labels!$A$1:$C$1,0)) &  \" {\"&COLUMN($F$901)&\"}\"","v":"//notes-payments-due-to-termination-employment-senior-officials-specification Commercial Separate The name (consisting of the initials and last name) of the senior official {6}"},{"$f":"\"//notes-payments-due-to-termination-employment-senior-officials-specification \" & BasisOfPreparationAxis & \" \"  & INDEX(labels!$A$103:$C$103,1,MATCH(PP_Language,labels!$A$1:$C$1,0)) &  \" \"  & INDEX(labels!$A$642:$C$642,1,MATCH(PP_Language,labels!$A$1:$C$1,0)) &  \" {\"&COLUMN($G$901)&\"}\"","v":"//notes-payments-due-to-termination-employment-senior-officials-specification Commercial Separate The name (consisting of the initials and last name) of the senior official {7}"},{"$f":"\"//notes-payments-due-to-termination-employment-senior-officials-specification \" & BasisOfPreparationAxis & \" \"  & INDEX(labels!$A$103:$C$103,1,MATCH(PP_Language,labels!$A$1:$C$1,0)) &  \" \"  & INDEX(labels!$A$642:$C$642,1,MATCH(PP_Language,labels!$A$1:$C$1,0)) &  \" {\"&COLUMN($H$901)&\"}\"","v":"//notes-payments-due-to-termination-employment-senior-officials-specification Commercial Separate The name (consisting of the initials and last name) of the senior official {8}"}]
[null,{"$f":"INDEX(labels!$A$93:$C$93,1,MATCH(PP_Language,labels!$A$1:$C$1,0))","v":"Remuneration of managing and supervisory directors"}]
[null,{"$f":"INDEX(labels!$A$657:$C$657,1,MATCH(PP_Language,labels!$A$1:$C$1,0))","v":"Notes to the financial statements - Remuneration of executive senior officials with employment and without employment from the 13th month: Specification"}]
[]
[]
[null,null,null,{"$f":"INDEX(labels!$A$642:$C$642,1,MATCH(PP_Language,labels!$A$1:$C$1,0))","v":"The name (consisting of the initials and last name) of the senior official"},{"$f":"INDEX(labels!$A$642:$C$642,1,MATCH(PP_Language,labels!$A$1:$C$1,0))","v":"The name (consisting of the initials and last name) of the senior official"},{"$f":"INDEX(labels!$A$642:$C$642,1,MATCH(PP_Language,labels!$A$1:$C$1,0))","v":"The name (consisting of the initials and last name) of the senior official"},{"$f":"INDEX(labels!$A$642:$C$642,1,MATCH(PP_Language,labels!$A$1:$C$1,0))","v":"The name (consisting of the initials and last name) of the senior official"},{"$f":"INDEX(labels!$A$642:$C$642,1,MATCH(PP_Language,labels!$A$1:$C$1,0))","v":"The name (consisting of the initials and last name) of the senior official"},null,null,null,null,null,null,null,null,null,null,null,null,null,null,null,null,null,{"$f":"\"/notes-remuneration-executive-senior-officials-from13month-specification label {\"&COLUMN($B$906)&\"}\"","v":"/notes-remuneration-executive-senior-officials-from13month-specification label {2}"},null,{"$f":"\"/notes-remuneration-executive-senior-officials-from13month-specification \" & BasisOfPreparationAxis & \" \"  & INDEX(labels!$A$103:$C$103,1,MATCH(PP_Language,labels!$A$1:$C$1,0)) &  \" \"  & INDEX(labels!$A$642:$C$642,1,MATCH(PP_Language,labels!$A$1:$C$1,0)) &  \" {\"&COLUMN($D$906)&\"}\"","v":"/notes-remuneration-executive-senior-officials-from13month-specification Commercial Separate The name (consisting of the initials and last name) of the senior official {4}"},{"$f":"\"/notes-remuneration-executive-senior-officials-from13month-specification \" & BasisOfPreparationAxis & \" \"  & INDEX(labels!$A$103:$C$103,1,MATCH(PP_Language,labels!$A$1:$C$1,0)) &  \" \"  & INDEX(labels!$A$642:$C$642,1,MATCH(PP_Language,labels!$A$1:$C$1,0)) &  \" {\"&COLUMN($E$906)&\"}\"","v":"/notes-remuneration-executive-senior-officials-from13month-specification Commercial Separate The name (consisting of the initials and last name) of the senior official {5}"},{"$f":"\"/notes-remuneration-executive-senior-officials-from13month-specification \" & BasisOfPreparationAxis & \" \"  & INDEX(labels!$A$103:$C$103,1,MATCH(PP_Language,labels!$A$1:$C$1,0)) &  \" \"  & INDEX(labels!$A$642:$C$642,1,MATCH(PP_Language,labels!$A$1:$C$1,0)) &  \" {\"&COLUMN($F$906)&\"}\"","v":"/notes-remuneration-executive-senior-officials-from13month-specification Commercial Separate The name (consisting of the initials and last name) of the senior official {6}"},{"$f":"\"/notes-remuneration-executive-senior-officials-from13month-specification \" & BasisOfPreparationAxis & \" \"  & INDEX(labels!$A$103:$C$103,1,MATCH(PP_Language,labels!$A$1:$C$1,0)) &  \" \"  & INDEX(labels!$A$642:$C$642,1,MATCH(PP_Language,labels!$A$1:$C$1,0)) &  \" {\"&COLUMN($G$906)&\"}\"","v":"/notes-remuneration-executive-senior-officials-from13month-specification Commercial Separate The name (consisting of the initials and last name) of the senior official {7}"},{"$f":"\"/notes-remuneration-executive-senior-officials-from13month-specification \" & BasisOfPreparationAxis & \" \"  & INDEX(labels!$A$103:$C$103,1,MATCH(PP_Language,labels!$A$1:$C$1,0)) &  \" \"  & INDEX(labels!$A$642:$C$642,1,MATCH(PP_Language,labels!$A$1:$C$1,0)) &  \" {\"&COLUMN($H$906)&\"}\"","v":"/notes-remuneration-executive-senior-officials-from13month-specification Commercial Separate The name (consisting of the initials and last name) of the senior official {8}"}]
[null,{"$f":"INDEX(labels!$A$658:$C$658,1,MATCH(PP_Language,labels!$A$1:$C$1,0))","v":"Description The name (consisting of the initials and last name) of the senior official"}]
[null,{"$f":"INDEX(labels!$A$644:$C$644,1,MATCH(PP_Language,labels!$A$1:$C$1,0))","v":"Position(s)"}]
[null,{"$f":"INDEX(labels!$A$659:$C$659,1,MATCH(PP_Language,labels!$A$1:$C$1,0))","v":"Start of employment"}]
[null,{"$f":"INDEX(labels!$A$660:$C$660,1,MATCH(PP_Language,labels!$A$1:$C$1,0))","v":"End of employment"}]
[null,{"$f":"INDEX(labels!$A$645:$C$645,1,MATCH(PP_Language,labels!$A$1:$C$1,0))","v":"Extent of employment as a part-time factor in FTE"}]
[null,{"$f":"INDEX(labels!$A$661:$C$661,1,MATCH(PP_Language,labels!$A$1:$C$1,0))","v":"Employment relationship?"}]
[null,{"$f":"INDEX(labels!$A$662:$C$662,1,MATCH(PP_Language,labels!$A$1:$C$1,0))","v":"Consideration plus taxable expense allowances"}]
[null,{"$f":"INDEX(labels!$A$663:$C$663,1,MATCH(PP_Language,labels!$A$1:$C$1,0))","v":"Post-employment benefits"}]
[]
[null,{"$f":"INDEX(labels!$A$664:$C$664,1,MATCH(PP_Language,labels!$A$1:$C$1,0))","v":"Subtotal"},null,{"$f":"IF(OR(NOT(0=0),NOT(AND(Stamdata!$D$913=\"\",Stamdata!$D$914=\"\"))), - 0+ SUM(Stamdata!$D$913,Stamdata!$D$914),\"\")","v":""},{"$f":"IF(OR(NOT(0=0),NOT(AND(Stamdata!$E$913=\"\",Stamdata!$E$914=\"\"))), - 0+ SUM(Stamdata!$E$913,Stamdata!$E$914),\"\")","v":""},{"$f":"IF(OR(NOT(0=0),NOT(AND(Stamdata!$F$913=\"\",Stamdata!$F$914=\"\"))), - 0+ SUM(Stamdata!$F$913,Stamdata!$F$914),\"\")","v":""},{"$f":"IF(OR(NOT(0=0),NOT(AND(Stamdata!$G$913=\"\",Stamdata!$G$914=\"\"))), - 0+ SUM(Stamdata!$G$913,Stamdata!$G$914),\"\")","v":""},{"$f":"IF(OR(NOT(0=0),NOT(AND(Stamdata!$H$913=\"\",Stamdata!$H$914=\"\"))), - 0+ SUM(Stamdata!$H$913,Stamdata!$H$914),\"\")","v":""}]
[null,{"$f":"INDEX(labels!$A$665:$C$665,1,MATCH(PP_Language,labels!$A$1:$C$1,0))","v":"Individual applicable remuneration maximum"}]
[null,{"$f":"INDEX(labels!$A$651:$C$651,1,MATCH(PP_Language,labels!$A$1:$C$1,0))","v":"Undue payments and amounts not yet received"}]
[null,{"$f":"INDEX(labels!$A$666:$C$666,1,MATCH(PP_Language,labels!$A$1:$C$1,0))","v":"Remuneration"}]
[null,{"$f":"INDEX(labels!$A$652:$C$652,1,MATCH(PP_Language,labels!$A$1:$C$1,0))","v":"Amount exceeding maximum remuneration"}]
[null,{"$f":"INDEX(labels!$A$653:$C$653,1,MATCH(PP_Language,labels!$A$1:$C$1,0))","v":"Reasons for exceeding the maximum amount of remuneration"}]
[null,{"$f":"INDEX(labels!$A$654:$C$654,1,MATCH(PP_Language,labels!$A$1:$C$1,0))","v":"Description of the claim for undue payment"}]
[null,{"$f":"INDEX(labels!$A$655:$C$655,1,MATCH(PP_Language,labels!$A$1:$C$1,0))","v":"Error recovery in WNT accountability"}]
[null,{"$f":"INDEX(labels!$A$656:$C$656,1,MATCH(PP_Language,labels!$A$1:$C$1,0))","v":"Explanation of the difference and cause of error recovery"}]
[null,{"$f":"INDEX(labels!$A$172:$C$172,1,MATCH(PP_Language,labels!$A$1:$C$1,0))","v":"Presentation order"}]
[null,null,null,null,null,null,null,null,null,null,null,null,null,null,null,null,null,null,null,null,null,null,null,null,null,{"$f":"\"//notes-remuneration-executive-senior-officials-from13month-specification label {\"&COLUMN($B$926)&\"}\"","v":"//notes-remuneration-executive-senior-officials-from13month-specification label {2}"},null,{"$f":"\"//notes-remuneration-executive-senior-officials-from13month-specification \" & BasisOfPreparationAxis & \" \"  & INDEX(labels!$A$103:$C$103,1,MATCH(PP_Language,labels!$A$1:$C$1,0)) &  \" \"  & INDEX(labels!$A$642:$C$642,1,MATCH(PP_Language,labels!$A$1:$C$1,0)) &  \" {\"&COLUMN($D$926)&\"}\"","v":"//notes-remuneration-executive-senior-officials-from13month-specification Commercial Separate The name (consisting of the initials and last name) of the senior official {4}"},{"$f":"\"//notes-remuneration-executive-senior-officials-from13month-specification \" & BasisOfPreparationAxis & \" \"  & INDEX(labels!$A$103:$C$103,1,MATCH(PP_Language,labels!$A$1:$C$1,0)) &  \" \"  & INDEX(labels!$A$642:$C$642,1,MATCH(PP_Language,labels!$A$1:$C$1,0)) &  \" {\"&COLUMN($E$926)&\"}\"","v":"//notes-remuneration-executive-senior-officials-from13month-specification Commercial Separate The name (consisting of the initials and last name) of the senior official {5}"},{"$f":"\"//notes-remuneration-executive-senior-officials-from13month-specification \" & BasisOfPreparationAxis & \" \"  & INDEX(labels!$A$103:$C$103,1,MATCH(PP_Language,labels!$A$1:$C$1,0)) &  \" \"  & INDEX(labels!$A$642:$C$642,1,MATCH(PP_Language,labels!$A$1:$C$1,0)) &  \" {\"&COLUMN($F$926)&\"}\"","v":"//notes-remuneration-executive-senior-officials-from13month-specification Commercial Separate The name (consisting of the initials and last name) of the senior official {6}"},{"$f":"\"//notes-remuneration-executive-senior-officials-from13month-specification \" & BasisOfPreparationAxis & \" \"  & INDEX(labels!$A$103:$C$103,1,MATCH(PP_Language,labels!$A$1:$C$1,0)) &  \" \"  & INDEX(labels!$A$642:$C$642,1,MATCH(PP_Language,labels!$A$1:$C$1,0)) &  \" {\"&COLUMN($G$926)&\"}\"","v":"//notes-remuneration-executive-senior-officials-from13month-specification Commercial Separate The name (consisting of the initials and last name) of the senior official {7}"},{"$f":"\"//notes-remuneration-executive-senior-officials-from13month-specification \" & BasisOfPreparationAxis & \" \"  & INDEX(labels!$A$103:$C$103,1,MATCH(PP_Language,labels!$A$1:$C$1,0)) &  \" \"  & INDEX(labels!$A$642:$C$642,1,MATCH(PP_Language,labels!$A$1:$C$1,0)) &  \" {\"&COLUMN($H$926)&\"}\"","v":"//notes-remuneration-executive-senior-officials-from13month-specification Commercial Separate The name (consisting of the initials and last name) of the senior official {8}"}]
[null,{"$f":"INDEX(labels!$A$667:$C$667,1,MATCH(PP_Language,labels!$A$1:$C$1,0))","v":"Notes to the financial statements - Remuneration of executive senior officials with employment and without employment from the 13th month, previous period: Specification"}]
[]
[]
[null,null,null,{"$f":"INDEX(labels!$A$642:$C$642,1,MATCH(PP_Language,labels!$A$1:$C$1,0))","v":"The name (consisting of the initials and last name) of the senior official"},{"$f":"INDEX(labels!$A$642:$C$642,1,MATCH(PP_Language,labels!$A$1:$C$1,0))","v":"The name (consisting of the initials and last name) of the senior official"},{"$f":"INDEX(labels!$A$642:$C$642,1,MATCH(PP_Language,labels!$A$1:$C$1,0))","v":"The name (consisting of the initials and last name) of the senior official"},{"$f":"INDEX(labels!$A$642:$C$642,1,MATCH(PP_Language,labels!$A$1:$C$1,0))","v":"The name (consisting of the initials and last name) of the senior official"},{"$f":"INDEX(labels!$A$642:$C$642,1,MATCH(PP_Language,labels!$A$1:$C$1,0))","v":"The name (consisting of the initials and last name) of the senior official"},null,null,null,null,null,null,null,null,null,null,null,null,null,null,null,null,null,{"$f":"\"/notes-remuneration-executive-senior-officials-from13month-previous-specification label {\"&COLUMN($B$930)&\"}\"","v":"/notes-remuneration-executive-senior-officials-from13month-previous-specification label {2}"},null,{"$f":"\"/notes-remuneration-executive-senior-officials-from13month-previous-specification \" & BasisOfPreparationAxis & \" \"  & INDEX(labels!$A$103:$C$103,1,MATCH(PP_Language,labels!$A$1:$C$1,0)) &  \" \"  & INDEX(labels!$A$642:$C$642,1,MATCH(PP_Language,labels!$A$1:$C$1,0)) &  \" {\"&COLUMN($D$930)&\"}\"","v":"/notes-remuneration-executive-senior-officials-from13month-previous-specification Commercial Separate The name (consisting of the initials and last name) of the senior official {4}"},{"$f":"\"/notes-remuneration-executive-senior-officials-from13month-previous-specification \" & BasisOfPreparationAxis & \" \"  & INDEX(labels!$A$103:$C$103,1,MATCH(PP_Language,labels!$A$1:$C$1,0)) &  \" \"  & INDEX(labels!$A$642:$C$642,1,MATCH(PP_Language,labels!$A$1:$C$1,0)) &  \" {\"&COLUMN($E$930)&\"}\"","v":"/notes-remuneration-executive-senior-officials-from13month-previous-specification Commercial Separate The name (consisting of the initials and last name) of the senior official {5}"},{"$f":"\"/notes-remuneration-executive-senior-officials-from13month-previous-specification \" & BasisOfPreparationAxis & \" \"  & INDEX(labels!$A$103:$C$103,1,MATCH(PP_Language,labels!$A$1:$C$1,0)) &  \" \"  & INDEX(labels!$A$642:$C$642,1,MATCH(PP_Language,labels!$A$1:$C$1,0)) &  \" {\"&COLUMN($F$930)&\"}\"","v":"/notes-remuneration-executive-senior-officials-from13month-previous-specification Commercial Separate The name (consisting of the initials and last name) of the senior official {6}"},{"$f":"\"/notes-remuneration-executive-senior-officials-from13month-previous-specification \" & BasisOfPreparationAxis & \" \"  & INDEX(labels!$A$103:$C$103,1,MATCH(PP_Language,labels!$A$1:$C$1,0)) &  \" \"  & INDEX(labels!$A$642:$C$642,1,MATCH(PP_Language,labels!$A$1:$C$1,0)) &  \" {\"&COLUMN($G$930)&\"}\"","v":"/notes-remuneration-executive-senior-officials-from13month-previous-specification Commercial Separate The name (consisting of the initials and last name) of the senior official {7}"},{"$f":"\"/notes-remuneration-executive-senior-officials-from13month-previous-specification \" & BasisOfPreparationAxis & \" \"  & INDEX(labels!$A$103:$C$103,1,MATCH(PP_Language,labels!$A$1:$C$1,0)) &  \" \"  & INDEX(labels!$A$642:$C$642,1,MATCH(PP_Language,labels!$A$1:$C$1,0)) &  \" {\"&COLUMN($H$930)&\"}\"","v":"/notes-remuneration-executive-senior-officials-from13month-previous-specification Commercial Separate The name (consisting of the initials and last name) of the senior official {8}"}]
[null,{"$f":"INDEX(labels!$A$668:$C$668,1,MATCH(PP_Language,labels!$A$1:$C$1,0))","v":"Description The name (consisting of the initials and last name) of the senior official"}]
[null,{"$f":"INDEX(labels!$A$644:$C$644,1,MATCH(PP_Language,labels!$A$1:$C$1,0))","v":"Position(s)"}]
[null,{"$f":"INDEX(labels!$A$659:$C$659,1,MATCH(PP_Language,labels!$A$1:$C$1,0))","v":"Start of employment"}]
[null,{"$f":"INDEX(labels!$A$660:$C$660,1,MATCH(PP_Language,labels!$A$1:$C$1,0))","v":"End of employment"}]
[null,{"$f":"INDEX(labels!$A$645:$C$645,1,MATCH(PP_Language,labels!$A$1:$C$1,0))","v":"Extent of employment as a part-time factor in FTE"}]
[null,{"$f":"INDEX(labels!$A$661:$C$661,1,MATCH(PP_Language,labels!$A$1:$C$1,0))","v":"Employment relationship?"}]
[null,{"$f":"INDEX(labels!$A$662:$C$662,1,MATCH(PP_Language,labels!$A$1:$C$1,0))","v":"Consideration plus taxable expense allowances"}]
[null,{"$f":"INDEX(labels!$A$663:$C$663,1,MATCH(PP_Language,labels!$A$1:$C$1,0))","v":"Post-employment benefits"}]
[]
[null,{"$f":"INDEX(labels!$A$664:$C$664,1,MATCH(PP_Language,labels!$A$1:$C$1,0))","v":"Subtotal"}]
[null,{"$f":"INDEX(labels!$A$665:$C$665,1,MATCH(PP_Language,labels!$A$1:$C$1,0))","v":"Individual applicable remuneration maximum"}]
[null,{"$f":"INDEX(labels!$A$666:$C$666,1,MATCH(PP_Language,labels!$A$1:$C$1,0))","v":"Remuneration"}]
[null,{"$f":"INDEX(labels!$A$172:$C$172,1,MATCH(PP_Language,labels!$A$1:$C$1,0))","v":"Presentation order"}]
[null,null,null,null,null,null,null,null,null,null,null,null,null,null,null,null,null,null,null,null,null,null,null,null,null,{"$f":"\"//notes-remuneration-executive-senior-officials-from13month-previous-specification label {\"&COLUMN($B$944)&\"}\"","v":"//notes-remuneration-executive-senior-officials-from13month-previous-specification label {2}"},null,{"$f":"\"//notes-remuneration-executive-senior-officials-from13month-previous-specification \" & BasisOfPreparationAxis & \" \"  & INDEX(labels!$A$103:$C$103,1,MATCH(PP_Language,labels!$A$1:$C$1,0)) &  \" \"  & INDEX(labels!$A$642:$C$642,1,MATCH(PP_Language,labels!$A$1:$C$1,0)) &  \" {\"&COLUMN($D$944)&\"}\"","v":"//notes-remuneration-executive-senior-officials-from13month-previous-specification Commercial Separate The name (consisting of the initials and last name) of the senior official {4}"},{"$f":"\"//notes-remuneration-executive-senior-officials-from13month-previous-specification \" & BasisOfPreparationAxis & \" \"  & INDEX(labels!$A$103:$C$103,1,MATCH(PP_Language,labels!$A$1:$C$1,0)) &  \" \"  & INDEX(labels!$A$642:$C$642,1,MATCH(PP_Language,labels!$A$1:$C$1,0)) &  \" {\"&COLUMN($E$944)&\"}\"","v":"//notes-remuneration-executive-senior-officials-from13month-previous-specification Commercial Separate The name (consisting of the initials and last name) of the senior official {5}"},{"$f":"\"//notes-remuneration-executive-senior-officials-from13month-previous-specification \" & BasisOfPreparationAxis & \" \"  & INDEX(labels!$A$103:$C$103,1,MATCH(PP_Language,labels!$A$1:$C$1,0)) &  \" \"  & INDEX(labels!$A$642:$C$642,1,MATCH(PP_Language,labels!$A$1:$C$1,0)) &  \" {\"&COLUMN($F$944)&\"}\"","v":"//notes-remuneration-executive-senior-officials-from13month-previous-specification Commercial Separate The name (consisting of the initials and last name) of the senior official {6}"},{"$f":"\"//notes-remuneration-executive-senior-officials-from13month-previous-specification \" & BasisOfPreparationAxis & \" \"  & INDEX(labels!$A$103:$C$103,1,MATCH(PP_Language,labels!$A$1:$C$1,0)) &  \" \"  & INDEX(labels!$A$642:$C$642,1,MATCH(PP_Language,labels!$A$1:$C$1,0)) &  \" {\"&COLUMN($G$944)&\"}\"","v":"//notes-remuneration-executive-senior-officials-from13month-previous-specification Commercial Separate The name (consisting of the initials and last name) of the senior official {7}"},{"$f":"\"//notes-remuneration-executive-senior-officials-from13month-previous-specification \" & BasisOfPreparationAxis & \" \"  & INDEX(labels!$A$103:$C$103,1,MATCH(PP_Language,labels!$A$1:$C$1,0)) &  \" \"  & INDEX(labels!$A$642:$C$642,1,MATCH(PP_Language,labels!$A$1:$C$1,0)) &  \" {\"&COLUMN($H$944)&\"}\"","v":"//notes-remuneration-executive-senior-officials-from13month-previous-specification Commercial Separate The name (consisting of the initials and last name) of the senior official {8}"}]
[null,{"$f":"INDEX(labels!$A$669:$C$669,1,MATCH(PP_Language,labels!$A$1:$C$1,0))","v":"Notes to the financial statements - Remuneration of executive senior officials without employment in the period up to and including the 12th month: Specification"}]
[]
[]
[null,null,null,{"$f":"INDEX(labels!$A$642:$C$642,1,MATCH(PP_Language,labels!$A$1:$C$1,0))","v":"The name (consisting of the initials and last name) of the senior official"},{"$f":"INDEX(labels!$A$642:$C$642,1,MATCH(PP_Language,labels!$A$1:$C$1,0))","v":"The name (consisting of the initials and last name) of the senior official"},{"$f":"INDEX(labels!$A$642:$C$642,1,MATCH(PP_Language,labels!$A$1:$C$1,0))","v":"The name (consisting of the initials and last name) of the senior official"},{"$f":"INDEX(labels!$A$642:$C$642,1,MATCH(PP_Language,labels!$A$1:$C$1,0))","v":"The name (consisting of the initials and last name) of the senior official"},{"$f":"INDEX(labels!$A$642:$C$642,1,MATCH(PP_Language,labels!$A$1:$C$1,0))","v":"The name (consisting of the initials and last name) of the senior official"},null,null,null,null,null,null,null,null,null,null,null,null,null,null,null,null,null,{"$f":"\"/notes-remuneration-executive-senior-officials-without-employment12months-specification label {\"&COLUMN($B$948)&\"}\"","v":"/notes-remuneration-executive-senior-officials-without-employment12months-specification label {2}"},null,{"$f":"\"/notes-remuneration-executive-senior-officials-without-employment12months-specification \" & BasisOfPreparationAxis & \" \"  & INDEX(labels!$A$103:$C$103,1,MATCH(PP_Language,labels!$A$1:$C$1,0)) &  \" \"  & INDEX(labels!$A$642:$C$642,1,MATCH(PP_Language,labels!$A$1:$C$1,0)) &  \" {\"&COLUMN($D$948)&\"}\"","v":"/notes-remuneration-executive-senior-officials-without-employment12months-specification Commercial Separate The name (consisting of the initials and last name) of the senior official {4}"},{"$f":"\"/notes-remuneration-executive-senior-officials-without-employment12months-specification \" & BasisOfPreparationAxis & \" \"  & INDEX(labels!$A$103:$C$103,1,MATCH(PP_Language,labels!$A$1:$C$1,0)) &  \" \"  & INDEX(labels!$A$642:$C$642,1,MATCH(PP_Language,labels!$A$1:$C$1,0)) &  \" {\"&COLUMN($E$948)&\"}\"","v":"/notes-remuneration-executive-senior-officials-without-employment12months-specification Commercial Separate The name (consisting of the initials and last name) of the senior official {5}"},{"$f":"\"/notes-remuneration-executive-senior-officials-without-employment12months-specification \" & BasisOfPreparationAxis & \" \"  & INDEX(labels!$A$103:$C$103,1,MATCH(PP_Language,labels!$A$1:$C$1,0)) &  \" \"  & INDEX(labels!$A$642:$C$642,1,MATCH(PP_Language,labels!$A$1:$C$1,0)) &  \" {\"&COLUMN($F$948)&\"}\"","v":"/notes-remuneration-executive-senior-officials-without-employment12months-specification Commercial Separate The name (consisting of the initials and last name) of the senior official {6}"},{"$f":"\"/notes-remuneration-executive-senior-officials-without-employment12months-specification \" & BasisOfPreparationAxis & \" \"  & INDEX(labels!$A$103:$C$103,1,MATCH(PP_Language,labels!$A$1:$C$1,0)) &  \" \"  & INDEX(labels!$A$642:$C$642,1,MATCH(PP_Language,labels!$A$1:$C$1,0)) &  \" {\"&COLUMN($G$948)&\"}\"","v":"/notes-remuneration-executive-senior-officials-without-employment12months-specification Commercial Separate The name (consisting of the initials and last name) of the senior official {7}"},{"$f":"\"/notes-remuneration-executive-senior-officials-without-employment12months-specification \" & BasisOfPreparationAxis & \" \"  & INDEX(labels!$A$103:$C$103,1,MATCH(PP_Language,labels!$A$1:$C$1,0)) &  \" \"  & INDEX(labels!$A$642:$C$642,1,MATCH(PP_Language,labels!$A$1:$C$1,0)) &  \" {\"&COLUMN($H$948)&\"}\"","v":"/notes-remuneration-executive-senior-officials-without-employment12months-specification Commercial Separate The name (consisting of the initials and last name) of the senior official {8}"}]
[null,{"$f":"INDEX(labels!$A$670:$C$670,1,MATCH(PP_Language,labels!$A$1:$C$1,0))","v":"Description The name (consisting of the initials and last name) of the senior official"}]
[null,{"$f":"INDEX(labels!$A$644:$C$644,1,MATCH(PP_Language,labels!$A$1:$C$1,0))","v":"Position(s)"}]
[null,{"$f":"INDEX(labels!$A$671:$C$671,1,MATCH(PP_Language,labels!$A$1:$C$1,0))","v":"Calendar year"}]
[null,{"$f":"INDEX(labels!$A$672:$C$672,1,MATCH(PP_Language,labels!$A$1:$C$1,0))","v":"Start of the duration of the employment during the calender year"}]
[null,{"$f":"INDEX(labels!$A$673:$C$673,1,MATCH(PP_Language,labels!$A$1:$C$1,0))","v":"End of the employment during the calender year"}]
[null,{"$f":"INDEX(labels!$A$674:$C$674,1,MATCH(PP_Language,labels!$A$1:$C$1,0))","v":"Number of months of employment during the calendar year"}]
[null,{"$f":"INDEX(labels!$A$675:$C$675,1,MATCH(PP_Language,labels!$A$1:$C$1,0))","v":"Extent of employment in hours per calendar year"}]
[null,{"$f":"INDEX(labels!$A$676:$C$676,1,MATCH(PP_Language,labels!$A$1:$C$1,0))","v":"Maximum remuneration per hour during the calender year"}]
[null,{"$f":"INDEX(labels!$A$677:$C$677,1,MATCH(PP_Language,labels!$A$1:$C$1,0))","v":"Maxima on the basis of the standard amounts per month"}]
[null,{"$f":"INDEX(labels!$A$678:$C$678,1,MATCH(PP_Language,labels!$A$1:$C$1,0))","v":"Individual applicable maximum entire period calendar month 1 to 12"}]
[null,{"$f":"INDEX(labels!$A$679:$C$679,1,MATCH(PP_Language,labels!$A$1:$C$1,0))","v":"Actual hourly rate lower than the maximum hourly rate?"}]
[null,{"$f":"INDEX(labels!$A$680:$C$680,1,MATCH(PP_Language,labels!$A$1:$C$1,0))","v":"Hourly rate"}]
[null,{"$f":"INDEX(labels!$A$681:$C$681,1,MATCH(PP_Language,labels!$A$1:$C$1,0))","v":"Remuneration in the relevant period"}]
[null,{"$f":"INDEX(labels!$A$682:$C$682,1,MATCH(PP_Language,labels!$A$1:$C$1,0))","v":"Total remuneration for entire period calendar month 1 to 12"}]
[null,{"$f":"INDEX(labels!$A$651:$C$651,1,MATCH(PP_Language,labels!$A$1:$C$1,0))","v":"Undue payments and amounts not yet received"}]
[null,{"$f":"INDEX(labels!$A$666:$C$666,1,MATCH(PP_Language,labels!$A$1:$C$1,0))","v":"Remuneration"}]
[null,{"$f":"INDEX(labels!$A$652:$C$652,1,MATCH(PP_Language,labels!$A$1:$C$1,0))","v":"Amount exceeding maximum remuneration"}]
[null,{"$f":"INDEX(labels!$A$653:$C$653,1,MATCH(PP_Language,labels!$A$1:$C$1,0))","v":"Reasons for exceeding the maximum amount of remuneration"}]
[null,{"$f":"INDEX(labels!$A$654:$C$654,1,MATCH(PP_Language,labels!$A$1:$C$1,0))","v":"Description of the claim for undue payment"}]
[null,{"$f":"INDEX(labels!$A$655:$C$655,1,MATCH(PP_Language,labels!$A$1:$C$1,0))","v":"Error recovery in WNT accountability"}]
[null,{"$f":"INDEX(labels!$A$656:$C$656,1,MATCH(PP_Language,labels!$A$1:$C$1,0))","v":"Explanation of the difference and cause of error recovery"}]
[null,{"$f":"INDEX(labels!$A$172:$C$172,1,MATCH(PP_Language,labels!$A$1:$C$1,0))","v":"Presentation order"}]
[null,null,null,null,null,null,null,null,null,null,null,null,null,null,null,null,null,null,null,null,null,null,null,null,null,{"$f":"\"//notes-remuneration-executive-senior-officials-without-employment12months-specification label {\"&COLUMN($B$971)&\"}\"","v":"//notes-remuneration-executive-senior-officials-without-employment12months-specification label {2}"},null,{"$f":"\"//notes-remuneration-executive-senior-officials-without-employment12months-specification \" & BasisOfPreparationAxis & \" \"  & INDEX(labels!$A$103:$C$103,1,MATCH(PP_Language,labels!$A$1:$C$1,0)) &  \" \"  & INDEX(labels!$A$642:$C$642,1,MATCH(PP_Language,labels!$A$1:$C$1,0)) &  \" {\"&COLUMN($D$971)&\"}\"","v":"//notes-remuneration-executive-senior-officials-without-employment12months-specification Commercial Separate The name (consisting of the initials and last name) of the senior official {4}"},{"$f":"\"//notes-remuneration-executive-senior-officials-without-employment12months-specification \" & BasisOfPreparationAxis & \" \"  & INDEX(labels!$A$103:$C$103,1,MATCH(PP_Language,labels!$A$1:$C$1,0)) &  \" \"  & INDEX(labels!$A$642:$C$642,1,MATCH(PP_Language,labels!$A$1:$C$1,0)) &  \" {\"&COLUMN($E$971)&\"}\"","v":"//notes-remuneration-executive-senior-officials-without-employment12months-specification Commercial Separate The name (consisting of the initials and last name) of the senior official {5}"},{"$f":"\"//notes-remuneration-executive-senior-officials-without-employment12months-specification \" & BasisOfPreparationAxis & \" \"  & INDEX(labels!$A$103:$C$103,1,MATCH(PP_Language,labels!$A$1:$C$1,0)) &  \" \"  & INDEX(labels!$A$642:$C$642,1,MATCH(PP_Language,labels!$A$1:$C$1,0)) &  \" {\"&COLUMN($F$971)&\"}\"","v":"//notes-remuneration-executive-senior-officials-without-employment12months-specification Commercial Separate The name (consisting of the initials and last name) of the senior official {6}"},{"$f":"\"//notes-remuneration-executive-senior-officials-without-employment12months-specification \" & BasisOfPreparationAxis & \" \"  & INDEX(labels!$A$103:$C$103,1,MATCH(PP_Language,labels!$A$1:$C$1,0)) &  \" \"  & INDEX(labels!$A$642:$C$642,1,MATCH(PP_Language,labels!$A$1:$C$1,0)) &  \" {\"&COLUMN($G$971)&\"}\"","v":"//notes-remuneration-executive-senior-officials-without-employment12months-specification Commercial Separate The name (consisting of the initials and last name) of the senior official {7}"},{"$f":"\"//notes-remuneration-executive-senior-officials-without-employment12months-specification \" & BasisOfPreparationAxis & \" \"  & INDEX(labels!$A$103:$C$103,1,MATCH(PP_Language,labels!$A$1:$C$1,0)) &  \" \"  & INDEX(labels!$A$642:$C$642,1,MATCH(PP_Language,labels!$A$1:$C$1,0)) &  \" {\"&COLUMN($H$971)&\"}\"","v":"//notes-remuneration-executive-senior-officials-without-employment12months-specification Commercial Separate The name (consisting of the initials and last name) of the senior official {8}"}]
[null,{"$f":"INDEX(labels!$A$683:$C$683,1,MATCH(PP_Language,labels!$A$1:$C$1,0))","v":"Notes to the financial statements - Remuneration of executive senior officials without employment in the period up to and including the 12th month, previous period: Specification"}]
[]
[]
[null,null,null,{"$f":"INDEX(labels!$A$642:$C$642,1,MATCH(PP_Language,labels!$A$1:$C$1,0))","v":"The name (consisting of the initials and last name) of the senior official"},{"$f":"INDEX(labels!$A$642:$C$642,1,MATCH(PP_Language,labels!$A$1:$C$1,0))","v":"The name (consisting of the initials and last name) of the senior official"},{"$f":"INDEX(labels!$A$642:$C$642,1,MATCH(PP_Language,labels!$A$1:$C$1,0))","v":"The name (consisting of the initials and last name) of the senior official"},{"$f":"INDEX(labels!$A$642:$C$642,1,MATCH(PP_Language,labels!$A$1:$C$1,0))","v":"The name (consisting of the initials and last name) of the senior official"},{"$f":"INDEX(labels!$A$642:$C$642,1,MATCH(PP_Language,labels!$A$1:$C$1,0))","v":"The name (consisting of the initials and last name) of the senior official"},null,null,null,null,null,null,null,null,null,null,null,null,null,null,null,null,null,{"$f":"\"/notes-remuneration-executive-senior-officials-without-employment12months-previous-specification label {\"&COLUMN($B$975)&\"}\"","v":"/notes-remuneration-executive-senior-officials-without-employment12months-previous-specification label {2}"},null,{"$f":"\"/notes-remuneration-executive-senior-officials-without-employment12months-previous-specification \" & BasisOfPreparationAxis & \" \"  & INDEX(labels!$A$103:$C$103,1,MATCH(PP_Language,labels!$A$1:$C$1,0)) &  \" \"  & INDEX(labels!$A$642:$C$642,1,MATCH(PP_Language,labels!$A$1:$C$1,0)) &  \" {\"&COLUMN($D$975)&\"}\"","v":"/notes-remuneration-executive-senior-officials-without-employment12months-previous-specification Commercial Separate The name (consisting of the initials and last name) of the senior official {4}"},{"$f":"\"/notes-remuneration-executive-senior-officials-without-employment12months-previous-specification \" & BasisOfPreparationAxis & \" \"  & INDEX(labels!$A$103:$C$103,1,MATCH(PP_Language,labels!$A$1:$C$1,0)) &  \" \"  & INDEX(labels!$A$642:$C$642,1,MATCH(PP_Language,labels!$A$1:$C$1,0)) &  \" {\"&COLUMN($E$975)&\"}\"","v":"/notes-remuneration-executive-senior-officials-without-employment12months-previous-specification Commercial Separate The name (consisting of the initials and last name) of the senior official {5}"},{"$f":"\"/notes-remuneration-executive-senior-officials-without-employment12months-previous-specification \" & BasisOfPreparationAxis & \" \"  & INDEX(labels!$A$103:$C$103,1,MATCH(PP_Language,labels!$A$1:$C$1,0)) &  \" \"  & INDEX(labels!$A$642:$C$642,1,MATCH(PP_Language,labels!$A$1:$C$1,0)) &  \" {\"&COLUMN($F$975)&\"}\"","v":"/notes-remuneration-executive-senior-officials-without-employment12months-previous-specification Commercial Separate The name (consisting of the initials and last name) of the senior official {6}"},{"$f":"\"/notes-remuneration-executive-senior-officials-without-employment12months-previous-specification \" & BasisOfPreparationAxis & \" \"  & INDEX(labels!$A$103:$C$103,1,MATCH(PP_Language,labels!$A$1:$C$1,0)) &  \" \"  & INDEX(labels!$A$642:$C$642,1,MATCH(PP_Language,labels!$A$1:$C$1,0)) &  \" {\"&COLUMN($G$975)&\"}\"","v":"/notes-remuneration-executive-senior-officials-without-employment12months-previous-specification Commercial Separate The name (consisting of the initials and last name) of the senior official {7}"},{"$f":"\"/notes-remuneration-executive-senior-officials-without-employment12months-previous-specification \" & BasisOfPreparationAxis & \" \"  & INDEX(labels!$A$103:$C$103,1,MATCH(PP_Language,labels!$A$1:$C$1,0)) &  \" \"  & INDEX(labels!$A$642:$C$642,1,MATCH(PP_Language,labels!$A$1:$C$1,0)) &  \" {\"&COLUMN($H$975)&\"}\"","v":"/notes-remuneration-executive-senior-officials-without-employment12months-previous-specification Commercial Separate The name (consisting of the initials and last name) of the senior official {8}"}]
[null,{"$f":"INDEX(labels!$A$684:$C$684,1,MATCH(PP_Language,labels!$A$1:$C$1,0))","v":"Description The name (consisting of the initials and last name) of the senior official"}]
[null,{"$f":"INDEX(labels!$A$644:$C$644,1,MATCH(PP_Language,labels!$A$1:$C$1,0))","v":"Position(s)"}]
[null,{"$f":"INDEX(labels!$A$671:$C$671,1,MATCH(PP_Language,labels!$A$1:$C$1,0))","v":"Calendar year"}]
[null,{"$f":"INDEX(labels!$A$672:$C$672,1,MATCH(PP_Language,labels!$A$1:$C$1,0))","v":"Start of the duration of the employment during the calender year"}]
[null,{"$f":"INDEX(labels!$A$673:$C$673,1,MATCH(PP_Language,labels!$A$1:$C$1,0))","v":"End of the employment during the calender year"}]
[null,{"$f":"INDEX(labels!$A$674:$C$674,1,MATCH(PP_Language,labels!$A$1:$C$1,0))","v":"Number of months of employment during the calendar year"}]
[null,{"$f":"INDEX(labels!$A$675:$C$675,1,MATCH(PP_Language,labels!$A$1:$C$1,0))","v":"Extent of employment in hours per calendar year"}]
[null,{"$f":"INDEX(labels!$A$676:$C$676,1,MATCH(PP_Language,labels!$A$1:$C$1,0))","v":"Maximum remuneration per hour during the calender year"}]
[null,{"$f":"INDEX(labels!$A$677:$C$677,1,MATCH(PP_Language,labels!$A$1:$C$1,0))","v":"Maxima on the basis of the standard amounts per month"}]
[null,{"$f":"INDEX(labels!$A$678:$C$678,1,MATCH(PP_Language,labels!$A$1:$C$1,0))","v":"Individual applicable maximum entire period calendar month 1 to 12"}]
[null,{"$f":"INDEX(labels!$A$679:$C$679,1,MATCH(PP_Language,labels!$A$1:$C$1,0))","v":"Actual hourly rate lower than the maximum hourly rate?"}]
[null,{"$f":"INDEX(labels!$A$680:$C$680,1,MATCH(PP_Language,labels!$A$1:$C$1,0))","v":"Hourly rate"}]
[null,{"$f":"INDEX(labels!$A$681:$C$681,1,MATCH(PP_Language,labels!$A$1:$C$1,0))","v":"Remuneration in the relevant period"}]
[null,{"$f":"INDEX(labels!$A$682:$C$682,1,MATCH(PP_Language,labels!$A$1:$C$1,0))","v":"Total remuneration for entire period calendar month 1 to 12"}]
[null,{"$f":"INDEX(labels!$A$651:$C$651,1,MATCH(PP_Language,labels!$A$1:$C$1,0))","v":"Undue payments and amounts not yet received"}]
[null,{"$f":"INDEX(labels!$A$666:$C$666,1,MATCH(PP_Language,labels!$A$1:$C$1,0))","v":"Remuneration"}]
[null,{"$f":"INDEX(labels!$A$652:$C$652,1,MATCH(PP_Language,labels!$A$1:$C$1,0))","v":"Amount exceeding maximum remuneration"}]
[null,{"$f":"INDEX(labels!$A$653:$C$653,1,MATCH(PP_Language,labels!$A$1:$C$1,0))","v":"Reasons for exceeding the maximum amount of remuneration"}]
[null,{"$f":"INDEX(labels!$A$654:$C$654,1,MATCH(PP_Language,labels!$A$1:$C$1,0))","v":"Description of the claim for undue payment"}]
[null,{"$f":"INDEX(labels!$A$655:$C$655,1,MATCH(PP_Language,labels!$A$1:$C$1,0))","v":"Error recovery in WNT accountability"}]
[null,{"$f":"INDEX(labels!$A$656:$C$656,1,MATCH(PP_Language,labels!$A$1:$C$1,0))","v":"Explanation of the difference and cause of error recovery"}]
[null,{"$f":"INDEX(labels!$A$172:$C$172,1,MATCH(PP_Language,labels!$A$1:$C$1,0))","v":"Presentation order"}]
[null,null,null,null,null,null,null,null,null,null,null,null,null,null,null,null,null,null,null,null,null,null,null,null,null,{"$f":"\"//notes-remuneration-executive-senior-officials-without-employment12months-previous-specification label {\"&COLUMN($B$998)&\"}\"","v":"//notes-remuneration-executive-senior-officials-without-employment12months-previous-specification label {2}"},null,{"$f":"\"//notes-remuneration-executive-senior-officials-without-employment12months-previous-specification \" & BasisOfPreparationAxis & \" \"  & INDEX(labels!$A$103:$C$103,1,MATCH(PP_Language,labels!$A$1:$C$1,0)) &  \" \"  & INDEX(labels!$A$642:$C$642,1,MATCH(PP_Language,labels!$A$1:$C$1,0)) &  \" {\"&COLUMN($D$998)&\"}\"","v":"//notes-remuneration-executive-senior-officials-without-employment12months-previous-specification Commercial Separate The name (consisting of the initials and last name) of the senior official {4}"},{"$f":"\"//notes-remuneration-executive-senior-officials-without-employment12months-previous-specification \" & BasisOfPreparationAxis & \" \"  & INDEX(labels!$A$103:$C$103,1,MATCH(PP_Language,labels!$A$1:$C$1,0)) &  \" \"  & INDEX(labels!$A$642:$C$642,1,MATCH(PP_Language,labels!$A$1:$C$1,0)) &  \" {\"&COLUMN($E$998)&\"}\"","v":"//notes-remuneration-executive-senior-officials-without-employment12months-previous-specification Commercial Separate The name (consisting of the initials and last name) of the senior official {5}"},{"$f":"\"//notes-remuneration-executive-senior-officials-without-employment12months-previous-specification \" & BasisOfPreparationAxis & \" \"  & INDEX(labels!$A$103:$C$103,1,MATCH(PP_Language,labels!$A$1:$C$1,0)) &  \" \"  & INDEX(labels!$A$642:$C$642,1,MATCH(PP_Language,labels!$A$1:$C$1,0)) &  \" {\"&COLUMN($F$998)&\"}\"","v":"//notes-remuneration-executive-senior-officials-without-employment12months-previous-specification Commercial Separate The name (consisting of the initials and last name) of the senior official {6}"},{"$f":"\"//notes-remuneration-executive-senior-officials-without-employment12months-previous-specification \" & BasisOfPreparationAxis & \" \"  & INDEX(labels!$A$103:$C$103,1,MATCH(PP_Language,labels!$A$1:$C$1,0)) &  \" \"  & INDEX(labels!$A$642:$C$642,1,MATCH(PP_Language,labels!$A$1:$C$1,0)) &  \" {\"&COLUMN($G$998)&\"}\"","v":"//notes-remuneration-executive-senior-officials-without-employment12months-previous-specification Commercial Separate The name (consisting of the initials and last name) of the senior official {7}"},{"$f":"\"//notes-remuneration-executive-senior-officials-without-employment12months-previous-specification \" & BasisOfPreparationAxis & \" \"  & INDEX(labels!$A$103:$C$103,1,MATCH(PP_Language,labels!$A$1:$C$1,0)) &  \" \"  & INDEX(labels!$A$642:$C$642,1,MATCH(PP_Language,labels!$A$1:$C$1,0)) &  \" {\"&COLUMN($H$998)&\"}\"","v":"//notes-remuneration-executive-senior-officials-without-employment12months-previous-specification Commercial Separate The name (consisting of the initials and last name) of the senior official {8}"}]
[null,{"$f":"INDEX(labels!$A$685:$C$685,1,MATCH(PP_Language,labels!$A$1:$C$1,0))","v":"Notes to the financial statements - Remuneration of non-senior officials: Specification"}]
[]
[]
[null,null,null,{"$f":"INDEX(labels!$A$686:$C$686,1,MATCH(PP_Language,labels!$A$1:$C$1,0))","v":"Description of the position of the non-senior official"},{"$f":"INDEX(labels!$A$686:$C$686,1,MATCH(PP_Language,labels!$A$1:$C$1,0))","v":"Description of the position of the non-senior official"},{"$f":"INDEX(labels!$A$686:$C$686,1,MATCH(PP_Language,labels!$A$1:$C$1,0))","v":"Description of the position of the non-senior official"},{"$f":"INDEX(labels!$A$686:$C$686,1,MATCH(PP_Language,labels!$A$1:$C$1,0))","v":"Description of the position of the non-senior official"},{"$f":"INDEX(labels!$A$686:$C$686,1,MATCH(PP_Language,labels!$A$1:$C$1,0))","v":"Description of the position of the non-senior official"},null,null,null,null,null,null,null,null,null,null,null,null,null,null,null,null,null,{"$f":"\"/notes-remuneration-of-non-senior-officials-specification label {\"&COLUMN($B$1002)&\"}\"","v":"/notes-remuneration-of-non-senior-officials-specification label {2}"},null,{"$f":"\"/notes-remuneration-of-non-senior-officials-specification \" & BasisOfPreparationAxis & \" \"  & INDEX(labels!$A$103:$C$103,1,MATCH(PP_Language,labels!$A$1:$C$1,0)) &  \" \"  & INDEX(labels!$A$686:$C$686,1,MATCH(PP_Language,labels!$A$1:$C$1,0)) &  \" {\"&COLUMN($D$1002)&\"}\"","v":"/notes-remuneration-of-non-senior-officials-specification Commercial Separate Description of the position of the non-senior official {4}"},{"$f":"\"/notes-remuneration-of-non-senior-officials-specification \" & BasisOfPreparationAxis & \" \"  & INDEX(labels!$A$103:$C$103,1,MATCH(PP_Language,labels!$A$1:$C$1,0)) &  \" \"  & INDEX(labels!$A$686:$C$686,1,MATCH(PP_Language,labels!$A$1:$C$1,0)) &  \" {\"&COLUMN($E$1002)&\"}\"","v":"/notes-remuneration-of-non-senior-officials-specification Commercial Separate Description of the position of the non-senior official {5}"},{"$f":"\"/notes-remuneration-of-non-senior-officials-specification \" & BasisOfPreparationAxis & \" \"  & INDEX(labels!$A$103:$C$103,1,MATCH(PP_Language,labels!$A$1:$C$1,0)) &  \" \"  & INDEX(labels!$A$686:$C$686,1,MATCH(PP_Language,labels!$A$1:$C$1,0)) &  \" {\"&COLUMN($F$1002)&\"}\"","v":"/notes-remuneration-of-non-senior-officials-specification Commercial Separate Description of the position of the non-senior official {6}"},{"$f":"\"/notes-remuneration-of-non-senior-officials-specification \" & BasisOfPreparationAxis & \" \"  & INDEX(labels!$A$103:$C$103,1,MATCH(PP_Language,labels!$A$1:$C$1,0)) &  \" \"  & INDEX(labels!$A$686:$C$686,1,MATCH(PP_Language,labels!$A$1:$C$1,0)) &  \" {\"&COLUMN($G$1002)&\"}\"","v":"/notes-remuneration-of-non-senior-officials-specification Commercial Separate Description of the position of the non-senior official {7}"},{"$f":"\"/notes-remuneration-of-non-senior-officials-specification \" & BasisOfPreparationAxis & \" \"  & INDEX(labels!$A$103:$C$103,1,MATCH(PP_Language,labels!$A$1:$C$1,0)) &  \" \"  & INDEX(labels!$A$686:$C$686,1,MATCH(PP_Language,labels!$A$1:$C$1,0)) &  \" {\"&COLUMN($H$1002)&\"}\"","v":"/notes-remuneration-of-non-senior-officials-specification Commercial Separate Description of the position of the non-senior official {8}"}]
[null,{"$f":"INDEX(labels!$A$687:$C$687,1,MATCH(PP_Language,labels!$A$1:$C$1,0))","v":"Description Description of the position of the non-senior official"}]
[null,{"$f":"INDEX(labels!$A$659:$C$659,1,MATCH(PP_Language,labels!$A$1:$C$1,0))","v":"Start of employment"}]
[null,{"$f":"INDEX(labels!$A$660:$C$660,1,MATCH(PP_Language,labels!$A$1:$C$1,0))","v":"End of employment"}]
[null,{"$f":"INDEX(labels!$A$645:$C$645,1,MATCH(PP_Language,labels!$A$1:$C$1,0))","v":"Extent of employment as a part-time factor in FTE"}]
[null,{"$f":"INDEX(labels!$A$662:$C$662,1,MATCH(PP_Language,labels!$A$1:$C$1,0))","v":"Consideration plus taxable expense allowances"}]
[null,{"$f":"INDEX(labels!$A$663:$C$663,1,MATCH(PP_Language,labels!$A$1:$C$1,0))","v":"Post-employment benefits"}]
[]
[null,{"$f":"INDEX(labels!$A$688:$C$688,1,MATCH(PP_Language,labels!$A$1:$C$1,0))","v":"Total of remuneration"},null,{"$f":"IF(OR(NOT(0=0),NOT(AND(Stamdata!$D$1007=\"\",Stamdata!$D$1008=\"\"))), - 0+ SUM(Stamdata!$D$1007,Stamdata!$D$1008),\"\")","v":""},{"$f":"IF(OR(NOT(0=0),NOT(AND(Stamdata!$E$1007=\"\",Stamdata!$E$1008=\"\"))), - 0+ SUM(Stamdata!$E$1007,Stamdata!$E$1008),\"\")","v":""},{"$f":"IF(OR(NOT(0=0),NOT(AND(Stamdata!$F$1007=\"\",Stamdata!$F$1008=\"\"))), - 0+ SUM(Stamdata!$F$1007,Stamdata!$F$1008),\"\")","v":""},{"$f":"IF(OR(NOT(0=0),NOT(AND(Stamdata!$G$1007=\"\",Stamdata!$G$1008=\"\"))), - 0+ SUM(Stamdata!$G$1007,Stamdata!$G$1008),\"\")","v":""},{"$f":"IF(OR(NOT(0=0),NOT(AND(Stamdata!$H$1007=\"\",Stamdata!$H$1008=\"\"))), - 0+ SUM(Stamdata!$H$1007,Stamdata!$H$1008),\"\")","v":""}]
[null,{"$f":"INDEX(labels!$A$689:$C$689,1,MATCH(PP_Language,labels!$A$1:$C$1,0))","v":"Individual applicable threshold remuneration"}]
[null,{"$f":"INDEX(labels!$A$690:$C$690,1,MATCH(PP_Language,labels!$A$1:$C$1,0))","v":"Justification of exceeding the maximum remuneration"}]
[null,{"$f":"INDEX(labels!$A$655:$C$655,1,MATCH(PP_Language,labels!$A$1:$C$1,0))","v":"Error recovery in WNT accountability"}]
[null,{"$f":"INDEX(labels!$A$656:$C$656,1,MATCH(PP_Language,labels!$A$1:$C$1,0))","v":"Explanation of the difference and cause of error recovery"}]
[null,{"$f":"INDEX(labels!$A$172:$C$172,1,MATCH(PP_Language,labels!$A$1:$C$1,0))","v":"Presentation order"}]
[null,null,null,null,null,null,null,null,null,null,null,null,null,null,null,null,null,null,null,null,null,null,null,null,null,{"$f":"\"//notes-remuneration-of-non-senior-officials-specification label {\"&COLUMN($B$1016)&\"}\"","v":"//notes-remuneration-of-non-senior-officials-specification label {2}"},null,{"$f":"\"//notes-remuneration-of-non-senior-officials-specification \" & BasisOfPreparationAxis & \" \"  & INDEX(labels!$A$103:$C$103,1,MATCH(PP_Language,labels!$A$1:$C$1,0)) &  \" \"  & INDEX(labels!$A$686:$C$686,1,MATCH(PP_Language,labels!$A$1:$C$1,0)) &  \" {\"&COLUMN($D$1016)&\"}\"","v":"//notes-remuneration-of-non-senior-officials-specification Commercial Separate Description of the position of the non-senior official {4}"},{"$f":"\"//notes-remuneration-of-non-senior-officials-specification \" & BasisOfPreparationAxis & \" \"  & INDEX(labels!$A$103:$C$103,1,MATCH(PP_Language,labels!$A$1:$C$1,0)) &  \" \"  & INDEX(labels!$A$686:$C$686,1,MATCH(PP_Language,labels!$A$1:$C$1,0)) &  \" {\"&COLUMN($E$1016)&\"}\"","v":"//notes-remuneration-of-non-senior-officials-specification Commercial Separate Description of the position of the non-senior official {5}"},{"$f":"\"//notes-remuneration-of-non-senior-officials-specification \" & BasisOfPreparationAxis & \" \"  & INDEX(labels!$A$103:$C$103,1,MATCH(PP_Language,labels!$A$1:$C$1,0)) &  \" \"  & INDEX(labels!$A$686:$C$686,1,MATCH(PP_Language,labels!$A$1:$C$1,0)) &  \" {\"&COLUMN($F$1016)&\"}\"","v":"//notes-remuneration-of-non-senior-officials-specification Commercial Separate Description of the position of the non-senior official {6}"},{"$f":"\"//notes-remuneration-of-non-senior-officials-specification \" & BasisOfPreparationAxis & \" \"  & INDEX(labels!$A$103:$C$103,1,MATCH(PP_Language,labels!$A$1:$C$1,0)) &  \" \"  & INDEX(labels!$A$686:$C$686,1,MATCH(PP_Language,labels!$A$1:$C$1,0)) &  \" {\"&COLUMN($G$1016)&\"}\"","v":"//notes-remuneration-of-non-senior-officials-specification Commercial Separate Description of the position of the non-senior official {7}"},{"$f":"\"//notes-remuneration-of-non-senior-officials-specification \" & BasisOfPreparationAxis & \" \"  & INDEX(labels!$A$103:$C$103,1,MATCH(PP_Language,labels!$A$1:$C$1,0)) &  \" \"  & INDEX(labels!$A$686:$C$686,1,MATCH(PP_Language,labels!$A$1:$C$1,0)) &  \" {\"&COLUMN($H$1016)&\"}\"","v":"//notes-remuneration-of-non-senior-officials-specification Commercial Separate Description of the position of the non-senior official {8}"}]
[null,{"$f":"INDEX(labels!$A$691:$C$691,1,MATCH(PP_Language,labels!$A$1:$C$1,0))","v":"Notes to the financial statements - Remuneration of non-senior officials, previous period: Specification"}]
[]
[]
[null,null,null,{"$f":"INDEX(labels!$A$686:$C$686,1,MATCH(PP_Language,labels!$A$1:$C$1,0))","v":"Description of the position of the non-senior official"},{"$f":"INDEX(labels!$A$686:$C$686,1,MATCH(PP_Language,labels!$A$1:$C$1,0))","v":"Description of the position of the non-senior official"},{"$f":"INDEX(labels!$A$686:$C$686,1,MATCH(PP_Language,labels!$A$1:$C$1,0))","v":"Description of the position of the non-senior official"},{"$f":"INDEX(labels!$A$686:$C$686,1,MATCH(PP_Language,labels!$A$1:$C$1,0))","v":"Description of the position of the non-senior official"},{"$f":"INDEX(labels!$A$686:$C$686,1,MATCH(PP_Language,labels!$A$1:$C$1,0))","v":"Description of the position of the non-senior official"},null,null,null,null,null,null,null,null,null,null,null,null,null,null,null,null,null,{"$f":"\"/notes-remuneration-of-non-senior-officials-previous-specification label {\"&COLUMN($B$1020)&\"}\"","v":"/notes-remuneration-of-non-senior-officials-previous-specification label {2}"},null,{"$f":"\"/notes-remuneration-of-non-senior-officials-previous-specification \" & BasisOfPreparationAxis & \" \"  & INDEX(labels!$A$103:$C$103,1,MATCH(PP_Language,labels!$A$1:$C$1,0)) &  \" \"  & INDEX(labels!$A$686:$C$686,1,MATCH(PP_Language,labels!$A$1:$C$1,0)) &  \" {\"&COLUMN($D$1020)&\"}\"","v":"/notes-remuneration-of-non-senior-officials-previous-specification Commercial Separate Description of the position of the non-senior official {4}"},{"$f":"\"/notes-remuneration-of-non-senior-officials-previous-specification \" & BasisOfPreparationAxis & \" \"  & INDEX(labels!$A$103:$C$103,1,MATCH(PP_Language,labels!$A$1:$C$1,0)) &  \" \"  & INDEX(labels!$A$686:$C$686,1,MATCH(PP_Language,labels!$A$1:$C$1,0)) &  \" {\"&COLUMN($E$1020)&\"}\"","v":"/notes-remuneration-of-non-senior-officials-previous-specification Commercial Separate Description of the position of the non-senior official {5}"},{"$f":"\"/notes-remuneration-of-non-senior-officials-previous-specification \" & BasisOfPreparationAxis & \" \"  & INDEX(labels!$A$103:$C$103,1,MATCH(PP_Language,labels!$A$1:$C$1,0)) &  \" \"  & INDEX(labels!$A$686:$C$686,1,MATCH(PP_Language,labels!$A$1:$C$1,0)) &  \" {\"&COLUMN($F$1020)&\"}\"","v":"/notes-remuneration-of-non-senior-officials-previous-specification Commercial Separate Description of the position of the non-senior official {6}"},{"$f":"\"/notes-remuneration-of-non-senior-officials-previous-specification \" & BasisOfPreparationAxis & \" \"  & INDEX(labels!$A$103:$C$103,1,MATCH(PP_Language,labels!$A$1:$C$1,0)) &  \" \"  & INDEX(labels!$A$686:$C$686,1,MATCH(PP_Language,labels!$A$1:$C$1,0)) &  \" {\"&COLUMN($G$1020)&\"}\"","v":"/notes-remuneration-of-non-senior-officials-previous-specification Commercial Separate Description of the position of the non-senior official {7}"},{"$f":"\"/notes-remuneration-of-non-senior-officials-previous-specification \" & BasisOfPreparationAxis & \" \"  & INDEX(labels!$A$103:$C$103,1,MATCH(PP_Language,labels!$A$1:$C$1,0)) &  \" \"  & INDEX(labels!$A$686:$C$686,1,MATCH(PP_Language,labels!$A$1:$C$1,0)) &  \" {\"&COLUMN($H$1020)&\"}\"","v":"/notes-remuneration-of-non-senior-officials-previous-specification Commercial Separate Description of the position of the non-senior official {8}"}]
[null,{"$f":"INDEX(labels!$A$692:$C$692,1,MATCH(PP_Language,labels!$A$1:$C$1,0))","v":"Description Description of the position of the non-senior official"}]
[null,{"$f":"INDEX(labels!$A$659:$C$659,1,MATCH(PP_Language,labels!$A$1:$C$1,0))","v":"Start of employment"}]
[null,{"$f":"INDEX(labels!$A$660:$C$660,1,MATCH(PP_Language,labels!$A$1:$C$1,0))","v":"End of employment"}]
[null,{"$f":"INDEX(labels!$A$645:$C$645,1,MATCH(PP_Language,labels!$A$1:$C$1,0))","v":"Extent of employment as a part-time factor in FTE"}]
[null,{"$f":"INDEX(labels!$A$662:$C$662,1,MATCH(PP_Language,labels!$A$1:$C$1,0))","v":"Consideration plus taxable expense allowances"}]
[null,{"$f":"INDEX(labels!$A$663:$C$663,1,MATCH(PP_Language,labels!$A$1:$C$1,0))","v":"Post-employment benefits"}]
[]
[null,{"$f":"INDEX(labels!$A$688:$C$688,1,MATCH(PP_Language,labels!$A$1:$C$1,0))","v":"Total of remuneration"},null,{"$f":"IF(OR(NOT(0=0),NOT(AND(Stamdata!$D$1025=\"\",Stamdata!$D$1026=\"\"))), - 0+ SUM(Stamdata!$D$1025,Stamdata!$D$1026),\"\")","v":""},{"$f":"IF(OR(NOT(0=0),NOT(AND(Stamdata!$E$1025=\"\",Stamdata!$E$1026=\"\"))), - 0+ SUM(Stamdata!$E$1025,Stamdata!$E$1026),\"\")","v":""},{"$f":"IF(OR(NOT(0=0),NOT(AND(Stamdata!$F$1025=\"\",Stamdata!$F$1026=\"\"))), - 0+ SUM(Stamdata!$F$1025,Stamdata!$F$1026),\"\")","v":""},{"$f":"IF(OR(NOT(0=0),NOT(AND(Stamdata!$G$1025=\"\",Stamdata!$G$1026=\"\"))), - 0+ SUM(Stamdata!$G$1025,Stamdata!$G$1026),\"\")","v":""},{"$f":"IF(OR(NOT(0=0),NOT(AND(Stamdata!$H$1025=\"\",Stamdata!$H$1026=\"\"))), - 0+ SUM(Stamdata!$H$1025,Stamdata!$H$1026),\"\")","v":""}]
[null,{"$f":"INDEX(labels!$A$172:$C$172,1,MATCH(PP_Language,labels!$A$1:$C$1,0))","v":"Presentation order"}]
[null,null,null,null,null,null,null,null,null,null,null,null,null,null,null,null,null,null,null,null,null,null,null,null,null,{"$f":"\"//notes-remuneration-of-non-senior-officials-previous-specification label {\"&COLUMN($B$1030)&\"}\"","v":"//notes-remuneration-of-non-senior-officials-previous-specification label {2}"},null,{"$f":"\"//notes-remuneration-of-non-senior-officials-previous-specification \" & BasisOfPreparationAxis & \" \"  & INDEX(labels!$A$103:$C$103,1,MATCH(PP_Language,labels!$A$1:$C$1,0)) &  \" \"  & INDEX(labels!$A$686:$C$686,1,MATCH(PP_Language,labels!$A$1:$C$1,0)) &  \" {\"&COLUMN($D$1030)&\"}\"","v":"//notes-remuneration-of-non-senior-officials-previous-specification Commercial Separate Description of the position of the non-senior official {4}"},{"$f":"\"//notes-remuneration-of-non-senior-officials-previous-specification \" & BasisOfPreparationAxis & \" \"  & INDEX(labels!$A$103:$C$103,1,MATCH(PP_Language,labels!$A$1:$C$1,0)) &  \" \"  & INDEX(labels!$A$686:$C$686,1,MATCH(PP_Language,labels!$A$1:$C$1,0)) &  \" {\"&COLUMN($E$1030)&\"}\"","v":"//notes-remuneration-of-non-senior-officials-previous-specification Commercial Separate Description of the position of the non-senior official {5}"},{"$f":"\"//notes-remuneration-of-non-senior-officials-previous-specification \" & BasisOfPreparationAxis & \" \"  & INDEX(labels!$A$103:$C$103,1,MATCH(PP_Language,labels!$A$1:$C$1,0)) &  \" \"  & INDEX(labels!$A$686:$C$686,1,MATCH(PP_Language,labels!$A$1:$C$1,0)) &  \" {\"&COLUMN($F$1030)&\"}\"","v":"//notes-remuneration-of-non-senior-officials-previous-specification Commercial Separate Description of the position of the non-senior official {6}"},{"$f":"\"//notes-remuneration-of-non-senior-officials-previous-specification \" & BasisOfPreparationAxis & \" \"  & INDEX(labels!$A$103:$C$103,1,MATCH(PP_Language,labels!$A$1:$C$1,0)) &  \" \"  & INDEX(labels!$A$686:$C$686,1,MATCH(PP_Language,labels!$A$1:$C$1,0)) &  \" {\"&COLUMN($G$1030)&\"}\"","v":"//notes-remuneration-of-non-senior-officials-previous-specification Commercial Separate Description of the position of the non-senior official {7}"},{"$f":"\"//notes-remuneration-of-non-senior-officials-previous-specification \" & BasisOfPreparationAxis & \" \"  & INDEX(labels!$A$103:$C$103,1,MATCH(PP_Language,labels!$A$1:$C$1,0)) &  \" \"  & INDEX(labels!$A$686:$C$686,1,MATCH(PP_Language,labels!$A$1:$C$1,0)) &  \" {\"&COLUMN($H$1030)&\"}\"","v":"//notes-remuneration-of-non-senior-officials-previous-specification Commercial Separate Description of the position of the non-senior official {8}"}]
[null,{"$f":"INDEX(labels!$A$693:$C$693,1,MATCH(PP_Language,labels!$A$1:$C$1,0))","v":"Notes to the financial statements - Remuneration of supervisory senior officials: Specification"}]
[]
[]
[null,null,null,{"$f":"INDEX(labels!$A$694:$C$694,1,MATCH(PP_Language,labels!$A$1:$C$1,0))","v":"The name (consisting of the initials and last name) of the supervisory senior official"},{"$f":"INDEX(labels!$A$694:$C$694,1,MATCH(PP_Language,labels!$A$1:$C$1,0))","v":"The name (consisting of the initials and last name) of the supervisory senior official"},{"$f":"INDEX(labels!$A$694:$C$694,1,MATCH(PP_Language,labels!$A$1:$C$1,0))","v":"The name (consisting of the initials and last name) of the supervisory senior official"},{"$f":"INDEX(labels!$A$694:$C$694,1,MATCH(PP_Language,labels!$A$1:$C$1,0))","v":"The name (consisting of the initials and last name) of the supervisory senior official"},{"$f":"INDEX(labels!$A$694:$C$694,1,MATCH(PP_Language,labels!$A$1:$C$1,0))","v":"The name (consisting of the initials and last name) of the supervisory senior official"},null,null,null,null,null,null,null,null,null,null,null,null,null,null,null,null,null,{"$f":"\"/notes-remuneration-of-supervisory-senior-officials-specification label {\"&COLUMN($B$1034)&\"}\"","v":"/notes-remuneration-of-supervisory-senior-officials-specification label {2}"},null,{"$f":"\"/notes-remuneration-of-supervisory-senior-officials-specification \" & BasisOfPreparationAxis & \" \"  & INDEX(labels!$A$103:$C$103,1,MATCH(PP_Language,labels!$A$1:$C$1,0)) &  \" \"  & INDEX(labels!$A$694:$C$694,1,MATCH(PP_Language,labels!$A$1:$C$1,0)) &  \" {\"&COLUMN($D$1034)&\"}\"","v":"/notes-remuneration-of-supervisory-senior-officials-specification Commercial Separate The name (consisting of the initials and last name) of the supervisory senior official {4}"},{"$f":"\"/notes-remuneration-of-supervisory-senior-officials-specification \" & BasisOfPreparationAxis & \" \"  & INDEX(labels!$A$103:$C$103,1,MATCH(PP_Language,labels!$A$1:$C$1,0)) &  \" \"  & INDEX(labels!$A$694:$C$694,1,MATCH(PP_Language,labels!$A$1:$C$1,0)) &  \" {\"&COLUMN($E$1034)&\"}\"","v":"/notes-remuneration-of-supervisory-senior-officials-specification Commercial Separate The name (consisting of the initials and last name) of the supervisory senior official {5}"},{"$f":"\"/notes-remuneration-of-supervisory-senior-officials-specification \" & BasisOfPreparationAxis & \" \"  & INDEX(labels!$A$103:$C$103,1,MATCH(PP_Language,labels!$A$1:$C$1,0)) &  \" \"  & INDEX(labels!$A$694:$C$694,1,MATCH(PP_Language,labels!$A$1:$C$1,0)) &  \" {\"&COLUMN($F$1034)&\"}\"","v":"/notes-remuneration-of-supervisory-senior-officials-specification Commercial Separate The name (consisting of the initials and last name) of the supervisory senior official {6}"},{"$f":"\"/notes-remuneration-of-supervisory-senior-officials-specification \" & BasisOfPreparationAxis & \" \"  & INDEX(labels!$A$103:$C$103,1,MATCH(PP_Language,labels!$A$1:$C$1,0)) &  \" \"  & INDEX(labels!$A$694:$C$694,1,MATCH(PP_Language,labels!$A$1:$C$1,0)) &  \" {\"&COLUMN($G$1034)&\"}\"","v":"/notes-remuneration-of-supervisory-senior-officials-specification Commercial Separate The name (consisting of the initials and last name) of the supervisory senior official {7}"},{"$f":"\"/notes-remuneration-of-supervisory-senior-officials-specification \" & BasisOfPreparationAxis & \" \"  & INDEX(labels!$A$103:$C$103,1,MATCH(PP_Language,labels!$A$1:$C$1,0)) &  \" \"  & INDEX(labels!$A$694:$C$694,1,MATCH(PP_Language,labels!$A$1:$C$1,0)) &  \" {\"&COLUMN($H$1034)&\"}\"","v":"/notes-remuneration-of-supervisory-senior-officials-specification Commercial Separate The name (consisting of the initials and last name) of the supervisory senior official {8}"}]
[null,{"$f":"INDEX(labels!$A$695:$C$695,1,MATCH(PP_Language,labels!$A$1:$C$1,0))","v":"Description The name (consisting of the initials and last name) of the supervisory senior official"}]
[null,{"$f":"INDEX(labels!$A$644:$C$644,1,MATCH(PP_Language,labels!$A$1:$C$1,0))","v":"Position(s)"}]
[null,{"$f":"INDEX(labels!$A$659:$C$659,1,MATCH(PP_Language,labels!$A$1:$C$1,0))","v":"Start of employment"}]
[null,{"$f":"INDEX(labels!$A$660:$C$660,1,MATCH(PP_Language,labels!$A$1:$C$1,0))","v":"End of employment"}]
[null,{"$f":"INDEX(labels!$A$696:$C$696,1,MATCH(PP_Language,labels!$A$1:$C$1,0))","v":"Remuneration excluding undue payments"}]
[null,{"$f":"INDEX(labels!$A$665:$C$665,1,MATCH(PP_Language,labels!$A$1:$C$1,0))","v":"Individual applicable remuneration maximum"}]
[null,{"$f":"INDEX(labels!$A$651:$C$651,1,MATCH(PP_Language,labels!$A$1:$C$1,0))","v":"Undue payments and amounts not yet received"}]
[null,{"$f":"INDEX(labels!$A$666:$C$666,1,MATCH(PP_Language,labels!$A$1:$C$1,0))","v":"Remuneration"}]
[null,{"$f":"INDEX(labels!$A$652:$C$652,1,MATCH(PP_Language,labels!$A$1:$C$1,0))","v":"Amount exceeding maximum remuneration"}]
[null,{"$f":"INDEX(labels!$A$653:$C$653,1,MATCH(PP_Language,labels!$A$1:$C$1,0))","v":"Reasons for exceeding the maximum amount of remuneration"}]
[null,{"$f":"INDEX(labels!$A$654:$C$654,1,MATCH(PP_Language,labels!$A$1:$C$1,0))","v":"Description of the claim for undue payment"}]
[null,{"$f":"INDEX(labels!$A$655:$C$655,1,MATCH(PP_Language,labels!$A$1:$C$1,0))","v":"Error recovery in WNT accountability"}]
[null,{"$f":"INDEX(labels!$A$656:$C$656,1,MATCH(PP_Language,labels!$A$1:$C$1,0))","v":"Explanation of the difference and cause of error recovery"}]
[null,{"$f":"INDEX(labels!$A$172:$C$172,1,MATCH(PP_Language,labels!$A$1:$C$1,0))","v":"Presentation order"}]
[null,null,null,null,null,null,null,null,null,null,null,null,null,null,null,null,null,null,null,null,null,null,null,null,null,{"$f":"\"//notes-remuneration-of-supervisory-senior-officials-specification label {\"&COLUMN($B$1049)&\"}\"","v":"//notes-remuneration-of-supervisory-senior-officials-specification label {2}"},null,{"$f":"\"//notes-remuneration-of-supervisory-senior-officials-specification \" & BasisOfPreparationAxis & \" \"  & INDEX(labels!$A$103:$C$103,1,MATCH(PP_Language,labels!$A$1:$C$1,0)) &  \" \"  & INDEX(labels!$A$694:$C$694,1,MATCH(PP_Language,labels!$A$1:$C$1,0)) &  \" {\"&COLUMN($D$1049)&\"}\"","v":"//notes-remuneration-of-supervisory-senior-officials-specification Commercial Separate The name (consisting of the initials and last name) of the supervisory senior official {4}"},{"$f":"\"//notes-remuneration-of-supervisory-senior-officials-specification \" & BasisOfPreparationAxis & \" \"  & INDEX(labels!$A$103:$C$103,1,MATCH(PP_Language,labels!$A$1:$C$1,0)) &  \" \"  & INDEX(labels!$A$694:$C$694,1,MATCH(PP_Language,labels!$A$1:$C$1,0)) &  \" {\"&COLUMN($E$1049)&\"}\"","v":"//notes-remuneration-of-supervisory-senior-officials-specification Commercial Separate The name (consisting of the initials and last name) of the supervisory senior official {5}"},{"$f":"\"//notes-remuneration-of-supervisory-senior-officials-specification \" & BasisOfPreparationAxis & \" \"  & INDEX(labels!$A$103:$C$103,1,MATCH(PP_Language,labels!$A$1:$C$1,0)) &  \" \"  & INDEX(labels!$A$694:$C$694,1,MATCH(PP_Language,labels!$A$1:$C$1,0)) &  \" {\"&COLUMN($F$1049)&\"}\"","v":"//notes-remuneration-of-supervisory-senior-officials-specification Commercial Separate The name (consisting of the initials and last name) of the supervisory senior official {6}"},{"$f":"\"//notes-remuneration-of-supervisory-senior-officials-specification \" & BasisOfPreparationAxis & \" \"  & INDEX(labels!$A$103:$C$103,1,MATCH(PP_Language,labels!$A$1:$C$1,0)) &  \" \"  & INDEX(labels!$A$694:$C$694,1,MATCH(PP_Language,labels!$A$1:$C$1,0)) &  \" {\"&COLUMN($G$1049)&\"}\"","v":"//notes-remuneration-of-supervisory-senior-officials-specification Commercial Separate The name (consisting of the initials and last name) of the supervisory senior official {7}"},{"$f":"\"//notes-remuneration-of-supervisory-senior-officials-specification \" & BasisOfPreparationAxis & \" \"  & INDEX(labels!$A$103:$C$103,1,MATCH(PP_Language,labels!$A$1:$C$1,0)) &  \" \"  & INDEX(labels!$A$694:$C$694,1,MATCH(PP_Language,labels!$A$1:$C$1,0)) &  \" {\"&COLUMN($H$1049)&\"}\"","v":"//notes-remuneration-of-supervisory-senior-officials-specification Commercial Separate The name (consisting of the initials and last name) of the supervisory senior official {8}"}]
[null,{"$f":"INDEX(labels!$A$697:$C$697,1,MATCH(PP_Language,labels!$A$1:$C$1,0))","v":"Notes to the financial statements - Remuneration of supervisory senior officials, previous period: Specification"}]
[]
[]
[null,null,null,{"$f":"INDEX(labels!$A$694:$C$694,1,MATCH(PP_Language,labels!$A$1:$C$1,0))","v":"The name (consisting of the initials and last name) of the supervisory senior official"},{"$f":"INDEX(labels!$A$694:$C$694,1,MATCH(PP_Language,labels!$A$1:$C$1,0))","v":"The name (consisting of the initials and last name) of the supervisory senior official"},{"$f":"INDEX(labels!$A$694:$C$694,1,MATCH(PP_Language,labels!$A$1:$C$1,0))","v":"The name (consisting of the initials and last name) of the supervisory senior official"},{"$f":"INDEX(labels!$A$694:$C$694,1,MATCH(PP_Language,labels!$A$1:$C$1,0))","v":"The name (consisting of the initials and last name) of the supervisory senior official"},{"$f":"INDEX(labels!$A$694:$C$694,1,MATCH(PP_Language,labels!$A$1:$C$1,0))","v":"The name (consisting of the initials and last name) of the supervisory senior official"},null,null,null,null,null,null,null,null,null,null,null,null,null,null,null,null,null,{"$f":"\"/notes-remuneration-of-supervisory-senior-officials-previous-specification label {\"&COLUMN($B$1053)&\"}\"","v":"/notes-remuneration-of-supervisory-senior-officials-previous-specification label {2}"},null,{"$f":"\"/notes-remuneration-of-supervisory-senior-officials-previous-specification \" & BasisOfPreparationAxis & \" \"  & INDEX(labels!$A$103:$C$103,1,MATCH(PP_Language,labels!$A$1:$C$1,0)) &  \" \"  & INDEX(labels!$A$694:$C$694,1,MATCH(PP_Language,labels!$A$1:$C$1,0)) &  \" {\"&COLUMN($D$1053)&\"}\"","v":"/notes-remuneration-of-supervisory-senior-officials-previous-specification Commercial Separate The name (consisting of the initials and last name) of the supervisory senior official {4}"},{"$f":"\"/notes-remuneration-of-supervisory-senior-officials-previous-specification \" & BasisOfPreparationAxis & \" \"  & INDEX(labels!$A$103:$C$103,1,MATCH(PP_Language,labels!$A$1:$C$1,0)) &  \" \"  & INDEX(labels!$A$694:$C$694,1,MATCH(PP_Language,labels!$A$1:$C$1,0)) &  \" {\"&COLUMN($E$1053)&\"}\"","v":"/notes-remuneration-of-supervisory-senior-officials-previous-specification Commercial Separate The name (consisting of the initials and last name) of the supervisory senior official {5}"},{"$f":"\"/notes-remuneration-of-supervisory-senior-officials-previous-specification \" & BasisOfPreparationAxis & \" \"  & INDEX(labels!$A$103:$C$103,1,MATCH(PP_Language,labels!$A$1:$C$1,0)) &  \" \"  & INDEX(labels!$A$694:$C$694,1,MATCH(PP_Language,labels!$A$1:$C$1,0)) &  \" {\"&COLUMN($F$1053)&\"}\"","v":"/notes-remuneration-of-supervisory-senior-officials-previous-specification Commercial Separate The name (consisting of the initials and last name) of the supervisory senior official {6}"},{"$f":"\"/notes-remuneration-of-supervisory-senior-officials-previous-specification \" & BasisOfPreparationAxis & \" \"  & INDEX(labels!$A$103:$C$103,1,MATCH(PP_Language,labels!$A$1:$C$1,0)) &  \" \"  & INDEX(labels!$A$694:$C$694,1,MATCH(PP_Language,labels!$A$1:$C$1,0)) &  \" {\"&COLUMN($G$1053)&\"}\"","v":"/notes-remuneration-of-supervisory-senior-officials-previous-specification Commercial Separate The name (consisting of the initials and last name) of the supervisory senior official {7}"},{"$f":"\"/notes-remuneration-of-supervisory-senior-officials-previous-specification \" & BasisOfPreparationAxis & \" \"  & INDEX(labels!$A$103:$C$103,1,MATCH(PP_Language,labels!$A$1:$C$1,0)) &  \" \"  & INDEX(labels!$A$694:$C$694,1,MATCH(PP_Language,labels!$A$1:$C$1,0)) &  \" {\"&COLUMN($H$1053)&\"}\"","v":"/notes-remuneration-of-supervisory-senior-officials-previous-specification Commercial Separate The name (consisting of the initials and last name) of the supervisory senior official {8}"}]
[null,{"$f":"INDEX(labels!$A$698:$C$698,1,MATCH(PP_Language,labels!$A$1:$C$1,0))","v":"Description The name (consisting of the initials and last name) of the supervisory senior official"}]
[null,{"$f":"INDEX(labels!$A$644:$C$644,1,MATCH(PP_Language,labels!$A$1:$C$1,0))","v":"Position(s)"}]
[null,{"$f":"INDEX(labels!$A$659:$C$659,1,MATCH(PP_Language,labels!$A$1:$C$1,0))","v":"Start of employment"}]
[null,{"$f":"INDEX(labels!$A$660:$C$660,1,MATCH(PP_Language,labels!$A$1:$C$1,0))","v":"End of employment"}]
[null,{"$f":"INDEX(labels!$A$666:$C$666,1,MATCH(PP_Language,labels!$A$1:$C$1,0))","v":"Remuneration"}]
[null,{"$f":"INDEX(labels!$A$665:$C$665,1,MATCH(PP_Language,labels!$A$1:$C$1,0))","v":"Individual applicable remuneration maximum"}]
[null,{"$f":"INDEX(labels!$A$172:$C$172,1,MATCH(PP_Language,labels!$A$1:$C$1,0))","v":"Presentation order"}]
[null,null,null,null,null,null,null,null,null,null,null,null,null,null,null,null,null,null,null,null,null,null,null,null,null,{"$f":"\"//notes-remuneration-of-supervisory-senior-officials-previous-specification label {\"&COLUMN($B$1061)&\"}\"","v":"//notes-remuneration-of-supervisory-senior-officials-previous-specification label {2}"},null,{"$f":"\"//notes-remuneration-of-supervisory-senior-officials-previous-specification \" & BasisOfPreparationAxis & \" \"  & INDEX(labels!$A$103:$C$103,1,MATCH(PP_Language,labels!$A$1:$C$1,0)) &  \" \"  & INDEX(labels!$A$694:$C$694,1,MATCH(PP_Language,labels!$A$1:$C$1,0)) &  \" {\"&COLUMN($D$1061)&\"}\"","v":"//notes-remuneration-of-supervisory-senior-officials-previous-specification Commercial Separate The name (consisting of the initials and last name) of the supervisory senior official {4}"},{"$f":"\"//notes-remuneration-of-supervisory-senior-officials-previous-specification \" & BasisOfPreparationAxis & \" \"  & INDEX(labels!$A$103:$C$103,1,MATCH(PP_Language,labels!$A$1:$C$1,0)) &  \" \"  & INDEX(labels!$A$694:$C$694,1,MATCH(PP_Language,labels!$A$1:$C$1,0)) &  \" {\"&COLUMN($E$1061)&\"}\"","v":"//notes-remuneration-of-supervisory-senior-officials-previous-specification Commercial Separate The name (consisting of the initials and last name) of the supervisory senior official {5}"},{"$f":"\"//notes-remuneration-of-supervisory-senior-officials-previous-specification \" & BasisOfPreparationAxis & \" \"  & INDEX(labels!$A$103:$C$103,1,MATCH(PP_Language,labels!$A$1:$C$1,0)) &  \" \"  & INDEX(labels!$A$694:$C$694,1,MATCH(PP_Language,labels!$A$1:$C$1,0)) &  \" {\"&COLUMN($F$1061)&\"}\"","v":"//notes-remuneration-of-supervisory-senior-officials-previous-specification Commercial Separate The name (consisting of the initials and last name) of the supervisory senior official {6}"},{"$f":"\"//notes-remuneration-of-supervisory-senior-officials-previous-specification \" & BasisOfPreparationAxis & \" \"  & INDEX(labels!$A$103:$C$103,1,MATCH(PP_Language,labels!$A$1:$C$1,0)) &  \" \"  & INDEX(labels!$A$694:$C$694,1,MATCH(PP_Language,labels!$A$1:$C$1,0)) &  \" {\"&COLUMN($G$1061)&\"}\"","v":"//notes-remuneration-of-supervisory-senior-officials-previous-specification Commercial Separate The name (consisting of the initials and last name) of the supervisory senior official {7}"},{"$f":"\"//notes-remuneration-of-supervisory-senior-officials-previous-specification \" & BasisOfPreparationAxis & \" \"  & INDEX(labels!$A$103:$C$103,1,MATCH(PP_Language,labels!$A$1:$C$1,0)) &  \" \"  & INDEX(labels!$A$694:$C$694,1,MATCH(PP_Language,labels!$A$1:$C$1,0)) &  \" {\"&COLUMN($H$1061)&\"}\"","v":"//notes-remuneration-of-supervisory-senior-officials-previous-specification Commercial Separate The name (consisting of the initials and last name) of the supervisory senior official {8}"}]
[null,{"$f":"INDEX(labels!$A$699:$C$699,1,MATCH(PP_Language,labels!$A$1:$C$1,0))","v":"Notes to the financial statements - Executive senior officials and those who are regarded as executive senior official for another 4 years with a remuneration of € 1.700 or less: Specification"}]
[]
[]
[null,null,null,{"$f":"INDEX(labels!$A$642:$C$642,1,MATCH(PP_Language,labels!$A$1:$C$1,0))","v":"The name (consisting of the initials and last name) of the senior official"},{"$f":"INDEX(labels!$A$642:$C$642,1,MATCH(PP_Language,labels!$A$1:$C$1,0))","v":"The name (consisting of the initials and last name) of the senior official"},{"$f":"INDEX(labels!$A$642:$C$642,1,MATCH(PP_Language,labels!$A$1:$C$1,0))","v":"The name (consisting of the initials and last name) of the senior official"},{"$f":"INDEX(labels!$A$642:$C$642,1,MATCH(PP_Language,labels!$A$1:$C$1,0))","v":"The name (consisting of the initials and last name) of the senior official"},{"$f":"INDEX(labels!$A$642:$C$642,1,MATCH(PP_Language,labels!$A$1:$C$1,0))","v":"The name (consisting of the initials and last name) of the senior official"},null,null,null,null,null,null,null,null,null,null,null,null,null,null,null,null,null,{"$f":"\"/notes-remuneration-of-senior-officials1700or-less-specification label {\"&COLUMN($B$1065)&\"}\"","v":"/notes-remuneration-of-senior-officials1700or-less-specification label {2}"},null,{"$f":"\"/notes-remuneration-of-senior-officials1700or-less-specification \" & BasisOfPreparationAxis & \" \"  & INDEX(labels!$A$103:$C$103,1,MATCH(PP_Language,labels!$A$1:$C$1,0)) &  \" \"  & INDEX(labels!$A$642:$C$642,1,MATCH(PP_Language,labels!$A$1:$C$1,0)) &  \" {\"&COLUMN($D$1065)&\"}\"","v":"/notes-remuneration-of-senior-officials1700or-less-specification Commercial Separate The name (consisting of the initials and last name) of the senior official {4}"},{"$f":"\"/notes-remuneration-of-senior-officials1700or-less-specification \" & BasisOfPreparationAxis & \" \"  & INDEX(labels!$A$103:$C$103,1,MATCH(PP_Language,labels!$A$1:$C$1,0)) &  \" \"  & INDEX(labels!$A$642:$C$642,1,MATCH(PP_Language,labels!$A$1:$C$1,0)) &  \" {\"&COLUMN($E$1065)&\"}\"","v":"/notes-remuneration-of-senior-officials1700or-less-specification Commercial Separate The name (consisting of the initials and last name) of the senior official {5}"},{"$f":"\"/notes-remuneration-of-senior-officials1700or-less-specification \" & BasisOfPreparationAxis & \" \"  & INDEX(labels!$A$103:$C$103,1,MATCH(PP_Language,labels!$A$1:$C$1,0)) &  \" \"  & INDEX(labels!$A$642:$C$642,1,MATCH(PP_Language,labels!$A$1:$C$1,0)) &  \" {\"&COLUMN($F$1065)&\"}\"","v":"/notes-remuneration-of-senior-officials1700or-less-specification Commercial Separate The name (consisting of the initials and last name) of the senior official {6}"},{"$f":"\"/notes-remuneration-of-senior-officials1700or-less-specification \" & BasisOfPreparationAxis & \" \"  & INDEX(labels!$A$103:$C$103,1,MATCH(PP_Language,labels!$A$1:$C$1,0)) &  \" \"  & INDEX(labels!$A$642:$C$642,1,MATCH(PP_Language,labels!$A$1:$C$1,0)) &  \" {\"&COLUMN($G$1065)&\"}\"","v":"/notes-remuneration-of-senior-officials1700or-less-specification Commercial Separate The name (consisting of the initials and last name) of the senior official {7}"},{"$f":"\"/notes-remuneration-of-senior-officials1700or-less-specification \" & BasisOfPreparationAxis & \" \"  & INDEX(labels!$A$103:$C$103,1,MATCH(PP_Language,labels!$A$1:$C$1,0)) &  \" \"  & INDEX(labels!$A$642:$C$642,1,MATCH(PP_Language,labels!$A$1:$C$1,0)) &  \" {\"&COLUMN($H$1065)&\"}\"","v":"/notes-remuneration-of-senior-officials1700or-less-specification Commercial Separate The name (consisting of the initials and last name) of the senior official {8}"}]
[null,{"$f":"INDEX(labels!$A$700:$C$700,1,MATCH(PP_Language,labels!$A$1:$C$1,0))","v":"Description The name (consisting of the initials and last name) of the senior official"}]
[null,{"$f":"INDEX(labels!$A$644:$C$644,1,MATCH(PP_Language,labels!$A$1:$C$1,0))","v":"Position(s)"}]
[null,{"$f":"INDEX(labels!$A$172:$C$172,1,MATCH(PP_Language,labels!$A$1:$C$1,0))","v":"Presentation order"}]
[null,null,null,null,null,null,null,null,null,null,null,null,null,null,null,null,null,null,null,null,null,null,null,null,null,{"$f":"\"//notes-remuneration-of-senior-officials1700or-less-specification label {\"&COLUMN($B$1069)&\"}\"","v":"//notes-remuneration-of-senior-officials1700or-less-specification label {2}"},null,{"$f":"\"//notes-remuneration-of-senior-officials1700or-less-specification \" & BasisOfPreparationAxis & \" \"  & INDEX(labels!$A$103:$C$103,1,MATCH(PP_Language,labels!$A$1:$C$1,0)) &  \" \"  & INDEX(labels!$A$642:$C$642,1,MATCH(PP_Language,labels!$A$1:$C$1,0)) &  \" {\"&COLUMN($D$1069)&\"}\"","v":"//notes-remuneration-of-senior-officials1700or-less-specification Commercial Separate The name (consisting of the initials and last name) of the senior official {4}"},{"$f":"\"//notes-remuneration-of-senior-officials1700or-less-specification \" & BasisOfPreparationAxis & \" \"  & INDEX(labels!$A$103:$C$103,1,MATCH(PP_Language,labels!$A$1:$C$1,0)) &  \" \"  & INDEX(labels!$A$642:$C$642,1,MATCH(PP_Language,labels!$A$1:$C$1,0)) &  \" {\"&COLUMN($E$1069)&\"}\"","v":"//notes-remuneration-of-senior-officials1700or-less-specification Commercial Separate The name (consisting of the initials and last name) of the senior official {5}"},{"$f":"\"//notes-remuneration-of-senior-officials1700or-less-specification \" & BasisOfPreparationAxis & \" \"  & INDEX(labels!$A$103:$C$103,1,MATCH(PP_Language,labels!$A$1:$C$1,0)) &  \" \"  & INDEX(labels!$A$642:$C$642,1,MATCH(PP_Language,labels!$A$1:$C$1,0)) &  \" {\"&COLUMN($F$1069)&\"}\"","v":"//notes-remuneration-of-senior-officials1700or-less-specification Commercial Separate The name (consisting of the initials and last name) of the senior official {6}"},{"$f":"\"//notes-remuneration-of-senior-officials1700or-less-specification \" & BasisOfPreparationAxis & \" \"  & INDEX(labels!$A$103:$C$103,1,MATCH(PP_Language,labels!$A$1:$C$1,0)) &  \" \"  & INDEX(labels!$A$642:$C$642,1,MATCH(PP_Language,labels!$A$1:$C$1,0)) &  \" {\"&COLUMN($G$1069)&\"}\"","v":"//notes-remuneration-of-senior-officials1700or-less-specification Commercial Separate The name (consisting of the initials and last name) of the senior official {7}"},{"$f":"\"//notes-remuneration-of-senior-officials1700or-less-specification \" & BasisOfPreparationAxis & \" \"  & INDEX(labels!$A$103:$C$103,1,MATCH(PP_Language,labels!$A$1:$C$1,0)) &  \" \"  & INDEX(labels!$A$642:$C$642,1,MATCH(PP_Language,labels!$A$1:$C$1,0)) &  \" {\"&COLUMN($H$1069)&\"}\"","v":"//notes-remuneration-of-senior-officials1700or-less-specification Commercial Separate The name (consisting of the initials and last name) of the senior official {8}"}]
[null,{"$f":"INDEX(labels!$A$701:$C$701,1,MATCH(PP_Language,labels!$A$1:$C$1,0))","v":"Notes to the financial statements - Total remuneration of a senior official as well as the person who is regarded as a senior official for another 4 years based on his / her former position: Specification"}]
[]
[]
[null,null,null,{"$f":"INDEX(labels!$A$642:$C$642,1,MATCH(PP_Language,labels!$A$1:$C$1,0))","v":"The name (consisting of the initials and last name) of the senior official"},{"$f":"INDEX(labels!$A$642:$C$642,1,MATCH(PP_Language,labels!$A$1:$C$1,0))","v":"The name (consisting of the initials and last name) of the senior official"},{"$f":"INDEX(labels!$A$642:$C$642,1,MATCH(PP_Language,labels!$A$1:$C$1,0))","v":"The name (consisting of the initials and last name) of the senior official"},{"$f":"INDEX(labels!$A$642:$C$642,1,MATCH(PP_Language,labels!$A$1:$C$1,0))","v":"The name (consisting of the initials and last name) of the senior official"},{"$f":"INDEX(labels!$A$642:$C$642,1,MATCH(PP_Language,labels!$A$1:$C$1,0))","v":"The name (consisting of the initials and last name) of the senior official"},null,null,null,null,null,null,null,null,null,null,null,null,null,null,null,null,null,{"$f":"\"/notes-remuneration-of-executive-senior-officials-considered-four-years-specification label {\"&COLUMN($B$1073)&\"}\"","v":"/notes-remuneration-of-executive-senior-officials-considered-four-years-specification label {2}"},null,{"$f":"\"/notes-remuneration-of-executive-senior-officials-considered-four-years-specification \" & BasisOfPreparationAxis & \" \"  & INDEX(labels!$A$103:$C$103,1,MATCH(PP_Language,labels!$A$1:$C$1,0)) &  \" \"  & INDEX(labels!$A$642:$C$642,1,MATCH(PP_Language,labels!$A$1:$C$1,0)) &  \" {\"&COLUMN($D$1073)&\"}\"","v":"/notes-remuneration-of-executive-senior-officials-considered-four-years-specification Commercial Separate The name (consisting of the initials and last name) of the senior official {4}"},{"$f":"\"/notes-remuneration-of-executive-senior-officials-considered-four-years-specification \" & BasisOfPreparationAxis & \" \"  & INDEX(labels!$A$103:$C$103,1,MATCH(PP_Language,labels!$A$1:$C$1,0)) &  \" \"  & INDEX(labels!$A$642:$C$642,1,MATCH(PP_Language,labels!$A$1:$C$1,0)) &  \" {\"&COLUMN($E$1073)&\"}\"","v":"/notes-remuneration-of-executive-senior-officials-considered-four-years-specification Commercial Separate The name (consisting of the initials and last name) of the senior official {5}"},{"$f":"\"/notes-remuneration-of-executive-senior-officials-considered-four-years-specification \" & BasisOfPreparationAxis & \" \"  & INDEX(labels!$A$103:$C$103,1,MATCH(PP_Language,labels!$A$1:$C$1,0)) &  \" \"  & INDEX(labels!$A$642:$C$642,1,MATCH(PP_Language,labels!$A$1:$C$1,0)) &  \" {\"&COLUMN($F$1073)&\"}\"","v":"/notes-remuneration-of-executive-senior-officials-considered-four-years-specification Commercial Separate The name (consisting of the initials and last name) of the senior official {6}"},{"$f":"\"/notes-remuneration-of-executive-senior-officials-considered-four-years-specification \" & BasisOfPreparationAxis & \" \"  & INDEX(labels!$A$103:$C$103,1,MATCH(PP_Language,labels!$A$1:$C$1,0)) &  \" \"  & INDEX(labels!$A$642:$C$642,1,MATCH(PP_Language,labels!$A$1:$C$1,0)) &  \" {\"&COLUMN($G$1073)&\"}\"","v":"/notes-remuneration-of-executive-senior-officials-considered-four-years-specification Commercial Separate The name (consisting of the initials and last name) of the senior official {7}"},{"$f":"\"/notes-remuneration-of-executive-senior-officials-considered-four-years-specification \" & BasisOfPreparationAxis & \" \"  & INDEX(labels!$A$103:$C$103,1,MATCH(PP_Language,labels!$A$1:$C$1,0)) &  \" \"  & INDEX(labels!$A$642:$C$642,1,MATCH(PP_Language,labels!$A$1:$C$1,0)) &  \" {\"&COLUMN($H$1073)&\"}\"","v":"/notes-remuneration-of-executive-senior-officials-considered-four-years-specification Commercial Separate The name (consisting of the initials and last name) of the senior official {8}"}]
[null,{"$f":"INDEX(labels!$A$702:$C$702,1,MATCH(PP_Language,labels!$A$1:$C$1,0))","v":"Description The name (consisting of the initials and last name) of the senior official"}]
[null,{"$f":"INDEX(labels!$A$703:$C$703,1,MATCH(PP_Language,labels!$A$1:$C$1,0))","v":"Remuneration in respect to activities as senior officer"}]
[null,{"$f":"INDEX(labels!$A$704:$C$704,1,MATCH(PP_Language,labels!$A$1:$C$1,0))","v":"Remuneration in respect to other activities as senior officer"}]
[null,{"$f":"INDEX(labels!$A$705:$C$705,1,MATCH(PP_Language,labels!$A$1:$C$1,0))","v":"Remuneration in respect to activities of affiliated companies"}]
[null,{"$f":"INDEX(labels!$A$706:$C$706,1,MATCH(PP_Language,labels!$A$1:$C$1,0))","v":"Double counting caused by charges"}]
[]
[null,{"$f":"INDEX(labels!$A$707:$C$707,1,MATCH(PP_Language,labels!$A$1:$C$1,0))","v":"Subtotal remuneration"},null,{"$f":"IF(OR(NOT(Stamdata!$D$1078=\"\"),NOT(AND(Stamdata!$D$1075=\"\",Stamdata!$D$1076=\"\",Stamdata!$D$1077=\"\"))), - SUM(Stamdata!$D$1078)+ SUM(Stamdata!$D$1075,Stamdata!$D$1076,Stamdata!$D$1077),\"\")","v":""},{"$f":"IF(OR(NOT(Stamdata!$E$1078=\"\"),NOT(AND(Stamdata!$E$1075=\"\",Stamdata!$E$1076=\"\",Stamdata!$E$1077=\"\"))), - SUM(Stamdata!$E$1078)+ SUM(Stamdata!$E$1075,Stamdata!$E$1076,Stamdata!$E$1077),\"\")","v":""},{"$f":"IF(OR(NOT(Stamdata!$F$1078=\"\"),NOT(AND(Stamdata!$F$1075=\"\",Stamdata!$F$1076=\"\",Stamdata!$F$1077=\"\"))), - SUM(Stamdata!$F$1078)+ SUM(Stamdata!$F$1075,Stamdata!$F$1076,Stamdata!$F$1077),\"\")","v":""},{"$f":"IF(OR(NOT(Stamdata!$G$1078=\"\"),NOT(AND(Stamdata!$G$1075=\"\",Stamdata!$G$1076=\"\",Stamdata!$G$1077=\"\"))), - SUM(Stamdata!$G$1078)+ SUM(Stamdata!$G$1075,Stamdata!$G$1076,Stamdata!$G$1077),\"\")","v":""},{"$f":"IF(OR(NOT(Stamdata!$H$1078=\"\"),NOT(AND(Stamdata!$H$1075=\"\",Stamdata!$H$1076=\"\",Stamdata!$H$1077=\"\"))), - SUM(Stamdata!$H$1078)+ SUM(Stamdata!$H$1075,Stamdata!$H$1076,Stamdata!$H$1077),\"\")","v":""}]
[null,{"$f":"INDEX(labels!$A$708:$C$708,1,MATCH(PP_Language,labels!$A$1:$C$1,0))","v":"Name WNT institution in respect to activities as senior officer"}]
[null,{"$f":"INDEX(labels!$A$709:$C$709,1,MATCH(PP_Language,labels!$A$1:$C$1,0))","v":"Name WNT institution in respect to other activities as senior officer"}]
[null,{"$f":"INDEX(labels!$A$710:$C$710,1,MATCH(PP_Language,labels!$A$1:$C$1,0))","v":"Name WNT institution in respect to activities of affiliated companies"}]
[null,{"$f":"INDEX(labels!$A$711:$C$711,1,MATCH(PP_Language,labels!$A$1:$C$1,0))","v":"Remuneration maximum of the institution or allowed higher individual remuneration senior officer"}]
[null,{"$f":"INDEX(labels!$A$651:$C$651,1,MATCH(PP_Language,labels!$A$1:$C$1,0))","v":"Undue payments and amounts not yet received"}]
[null,{"$f":"INDEX(labels!$A$688:$C$688,1,MATCH(PP_Language,labels!$A$1:$C$1,0))","v":"Total of remuneration"}]
[null,{"$f":"INDEX(labels!$A$652:$C$652,1,MATCH(PP_Language,labels!$A$1:$C$1,0))","v":"Amount exceeding maximum remuneration"}]
[null,{"$f":"INDEX(labels!$A$653:$C$653,1,MATCH(PP_Language,labels!$A$1:$C$1,0))","v":"Reasons for exceeding the maximum amount of remuneration"}]
[null,{"$f":"INDEX(labels!$A$654:$C$654,1,MATCH(PP_Language,labels!$A$1:$C$1,0))","v":"Description of the claim for undue payment"}]
[null,{"$f":"INDEX(labels!$A$655:$C$655,1,MATCH(PP_Language,labels!$A$1:$C$1,0))","v":"Error recovery in WNT accountability"}]
[null,{"$f":"INDEX(labels!$A$656:$C$656,1,MATCH(PP_Language,labels!$A$1:$C$1,0))","v":"Explanation of the difference and cause of error recovery"}]
[null,{"$f":"INDEX(labels!$A$172:$C$172,1,MATCH(PP_Language,labels!$A$1:$C$1,0))","v":"Presentation order"}]
[null,null,null,null,null,null,null,null,null,null,null,null,null,null,null,null,null,null,null,null,null,null,null,null,null,{"$f":"\"//notes-remuneration-of-executive-senior-officials-considered-four-years-specification label {\"&COLUMN($B$1093)&\"}\"","v":"//notes-remuneration-of-executive-senior-officials-considered-four-years-specification label {2}"},null,{"$f":"\"//notes-remuneration-of-executive-senior-officials-considered-four-years-specification \" & BasisOfPreparationAxis & \" \"  & INDEX(labels!$A$103:$C$103,1,MATCH(PP_Language,labels!$A$1:$C$1,0)) &  \" \"  & INDEX(labels!$A$642:$C$642,1,MATCH(PP_Language,labels!$A$1:$C$1,0)) &  \" {\"&COLUMN($D$1093)&\"}\"","v":"//notes-remuneration-of-executive-senior-officials-considered-four-years-specification Commercial Separate The name (consisting of the initials and last name) of the senior official {4}"},{"$f":"\"//notes-remuneration-of-executive-senior-officials-considered-four-years-specification \" & BasisOfPreparationAxis & \" \"  & INDEX(labels!$A$103:$C$103,1,MATCH(PP_Language,labels!$A$1:$C$1,0)) &  \" \"  & INDEX(labels!$A$642:$C$642,1,MATCH(PP_Language,labels!$A$1:$C$1,0)) &  \" {\"&COLUMN($E$1093)&\"}\"","v":"//notes-remuneration-of-executive-senior-officials-considered-four-years-specification Commercial Separate The name (consisting of the initials and last name) of the senior official {5}"},{"$f":"\"//notes-remuneration-of-executive-senior-officials-considered-four-years-specification \" & BasisOfPreparationAxis & \" \"  & INDEX(labels!$A$103:$C$103,1,MATCH(PP_Language,labels!$A$1:$C$1,0)) &  \" \"  & INDEX(labels!$A$642:$C$642,1,MATCH(PP_Language,labels!$A$1:$C$1,0)) &  \" {\"&COLUMN($F$1093)&\"}\"","v":"//notes-remuneration-of-executive-senior-officials-considered-four-years-specification Commercial Separate The name (consisting of the initials and last name) of the senior official {6}"},{"$f":"\"//notes-remuneration-of-executive-senior-officials-considered-four-years-specification \" & BasisOfPreparationAxis & \" \"  & INDEX(labels!$A$103:$C$103,1,MATCH(PP_Language,labels!$A$1:$C$1,0)) &  \" \"  & INDEX(labels!$A$642:$C$642,1,MATCH(PP_Language,labels!$A$1:$C$1,0)) &  \" {\"&COLUMN($G$1093)&\"}\"","v":"//notes-remuneration-of-executive-senior-officials-considered-four-years-specification Commercial Separate The name (consisting of the initials and last name) of the senior official {7}"},{"$f":"\"//notes-remuneration-of-executive-senior-officials-considered-four-years-specification \" & BasisOfPreparationAxis & \" \"  & INDEX(labels!$A$103:$C$103,1,MATCH(PP_Language,labels!$A$1:$C$1,0)) &  \" \"  & INDEX(labels!$A$642:$C$642,1,MATCH(PP_Language,labels!$A$1:$C$1,0)) &  \" {\"&COLUMN($H$1093)&\"}\"","v":"//notes-remuneration-of-executive-senior-officials-considered-four-years-specification Commercial Separate The name (consisting of the initials and last name) of the senior official {8}"}]
[null,{"$f":"INDEX(labels!$A$94:$C$94,1,MATCH(PP_Language,labels!$A$1:$C$1,0))","v":"Remuneration of non-supervising senior officials who already have employment with another WNT institution: Specification"}]
[null,{"$f":"INDEX(labels!$A$712:$C$712,1,MATCH(PP_Language,labels!$A$1:$C$1,0))","v":"Notes to the financial statements - Remuneration of non-supervising senior officials who already have employment with another WNT institution: Specification"}]
[]
[]
[null,null,null,{"$f":"INDEX(labels!$A$713:$C$713,1,MATCH(PP_Language,labels!$A$1:$C$1,0))","v":"The name (consisting of the initials and last name) of the non supervisory senior official"},{"$f":"INDEX(labels!$A$713:$C$713,1,MATCH(PP_Language,labels!$A$1:$C$1,0))","v":"The name (consisting of the initials and last name) of the non supervisory senior official"},{"$f":"INDEX(labels!$A$713:$C$713,1,MATCH(PP_Language,labels!$A$1:$C$1,0))","v":"The name (consisting of the initials and last name) of the non supervisory senior official"},{"$f":"INDEX(labels!$A$713:$C$713,1,MATCH(PP_Language,labels!$A$1:$C$1,0))","v":"The name (consisting of the initials and last name) of the non supervisory senior official"},{"$f":"INDEX(labels!$A$713:$C$713,1,MATCH(PP_Language,labels!$A$1:$C$1,0))","v":"The name (consisting of the initials and last name) of the non supervisory senior official"},null,null,null,null,null,null,null,null,null,null,null,null,null,null,null,null,null,{"$f":"\"/notes-remuneration-non-supervisory-senior-officials-other-wnt-institution-specification label {\"&COLUMN($B$1098)&\"}\"","v":"/notes-remuneration-non-supervisory-senior-officials-other-wnt-institution-specification label {2}"},null,{"$f":"\"/notes-remuneration-non-supervisory-senior-officials-other-wnt-institution-specification \" & BasisOfPreparationAxis & \" \"  & INDEX(labels!$A$103:$C$103,1,MATCH(PP_Language,labels!$A$1:$C$1,0)) &  \" \"  & INDEX(labels!$A$713:$C$713,1,MATCH(PP_Language,labels!$A$1:$C$1,0)) &  \" {\"&COLUMN($D$1098)&\"}\"","v":"/notes-remuneration-non-supervisory-senior-officials-other-wnt-institution-specification Commercial Separate The name (consisting of the initials and last name) of the non supervisory senior official {4}"},{"$f":"\"/notes-remuneration-non-supervisory-senior-officials-other-wnt-institution-specification \" & BasisOfPreparationAxis & \" \"  & INDEX(labels!$A$103:$C$103,1,MATCH(PP_Language,labels!$A$1:$C$1,0)) &  \" \"  & INDEX(labels!$A$713:$C$713,1,MATCH(PP_Language,labels!$A$1:$C$1,0)) &  \" {\"&COLUMN($E$1098)&\"}\"","v":"/notes-remuneration-non-supervisory-senior-officials-other-wnt-institution-specification Commercial Separate The name (consisting of the initials and last name) of the non supervisory senior official {5}"},{"$f":"\"/notes-remuneration-non-supervisory-senior-officials-other-wnt-institution-specification \" & BasisOfPreparationAxis & \" \"  & INDEX(labels!$A$103:$C$103,1,MATCH(PP_Language,labels!$A$1:$C$1,0)) &  \" \"  & INDEX(labels!$A$713:$C$713,1,MATCH(PP_Language,labels!$A$1:$C$1,0)) &  \" {\"&COLUMN($F$1098)&\"}\"","v":"/notes-remuneration-non-supervisory-senior-officials-other-wnt-institution-specification Commercial Separate The name (consisting of the initials and last name) of the non supervisory senior official {6}"},{"$f":"\"/notes-remuneration-non-supervisory-senior-officials-other-wnt-institution-specification \" & BasisOfPreparationAxis & \" \"  & INDEX(labels!$A$103:$C$103,1,MATCH(PP_Language,labels!$A$1:$C$1,0)) &  \" \"  & INDEX(labels!$A$713:$C$713,1,MATCH(PP_Language,labels!$A$1:$C$1,0)) &  \" {\"&COLUMN($G$1098)&\"}\"","v":"/notes-remuneration-non-supervisory-senior-officials-other-wnt-institution-specification Commercial Separate The name (consisting of the initials and last name) of the non supervisory senior official {7}"},{"$f":"\"/notes-remuneration-non-supervisory-senior-officials-other-wnt-institution-specification \" & BasisOfPreparationAxis & \" \"  & INDEX(labels!$A$103:$C$103,1,MATCH(PP_Language,labels!$A$1:$C$1,0)) &  \" \"  & INDEX(labels!$A$713:$C$713,1,MATCH(PP_Language,labels!$A$1:$C$1,0)) &  \" {\"&COLUMN($H$1098)&\"}\"","v":"/notes-remuneration-non-supervisory-senior-officials-other-wnt-institution-specification Commercial Separate The name (consisting of the initials and last name) of the non supervisory senior official {8}"}]
[null,{"$f":"INDEX(labels!$A$714:$C$714,1,MATCH(PP_Language,labels!$A$1:$C$1,0))","v":"Description The name (consisting of the initials and last name) of the non supervisory senior official"}]
[null,{"$f":"INDEX(labels!$A$715:$C$715,1,MATCH(PP_Language,labels!$A$1:$C$1,0))","v":"Start date employment"}]
[null,{"$f":"INDEX(labels!$A$716:$C$716,1,MATCH(PP_Language,labels!$A$1:$C$1,0))","v":"Total remuneration per institution amounts x € 1"}]
[null,{"$f":"INDEX(labels!$A$172:$C$172,1,MATCH(PP_Language,labels!$A$1:$C$1,0))","v":"Presentation order"}]
[null,null,null,null,null,null,null,null,null,null,null,null,null,null,null,null,null,null,null,null,null,null,null,null,null,{"$f":"\"//notes-remuneration-non-supervisory-senior-officials-other-wnt-institution-specification label {\"&COLUMN($B$1103)&\"}\"","v":"//notes-remuneration-non-supervisory-senior-officials-other-wnt-institution-specification label {2}"},null,{"$f":"\"//notes-remuneration-non-supervisory-senior-officials-other-wnt-institution-specification \" & BasisOfPreparationAxis & \" \"  & INDEX(labels!$A$103:$C$103,1,MATCH(PP_Language,labels!$A$1:$C$1,0)) &  \" \"  & INDEX(labels!$A$713:$C$713,1,MATCH(PP_Language,labels!$A$1:$C$1,0)) &  \" {\"&COLUMN($D$1103)&\"}\"","v":"//notes-remuneration-non-supervisory-senior-officials-other-wnt-institution-specification Commercial Separate The name (consisting of the initials and last name) of the non supervisory senior official {4}"},{"$f":"\"//notes-remuneration-non-supervisory-senior-officials-other-wnt-institution-specification \" & BasisOfPreparationAxis & \" \"  & INDEX(labels!$A$103:$C$103,1,MATCH(PP_Language,labels!$A$1:$C$1,0)) &  \" \"  & INDEX(labels!$A$713:$C$713,1,MATCH(PP_Language,labels!$A$1:$C$1,0)) &  \" {\"&COLUMN($E$1103)&\"}\"","v":"//notes-remuneration-non-supervisory-senior-officials-other-wnt-institution-specification Commercial Separate The name (consisting of the initials and last name) of the non supervisory senior official {5}"},{"$f":"\"//notes-remuneration-non-supervisory-senior-officials-other-wnt-institution-specification \" & BasisOfPreparationAxis & \" \"  & INDEX(labels!$A$103:$C$103,1,MATCH(PP_Language,labels!$A$1:$C$1,0)) &  \" \"  & INDEX(labels!$A$713:$C$713,1,MATCH(PP_Language,labels!$A$1:$C$1,0)) &  \" {\"&COLUMN($F$1103)&\"}\"","v":"//notes-remuneration-non-supervisory-senior-officials-other-wnt-institution-specification Commercial Separate The name (consisting of the initials and last name) of the non supervisory senior official {6}"},{"$f":"\"//notes-remuneration-non-supervisory-senior-officials-other-wnt-institution-specification \" & BasisOfPreparationAxis & \" \"  & INDEX(labels!$A$103:$C$103,1,MATCH(PP_Language,labels!$A$1:$C$1,0)) &  \" \"  & INDEX(labels!$A$713:$C$713,1,MATCH(PP_Language,labels!$A$1:$C$1,0)) &  \" {\"&COLUMN($G$1103)&\"}\"","v":"//notes-remuneration-non-supervisory-senior-officials-other-wnt-institution-specification Commercial Separate The name (consisting of the initials and last name) of the non supervisory senior official {7}"},{"$f":"\"//notes-remuneration-non-supervisory-senior-officials-other-wnt-institution-specification \" & BasisOfPreparationAxis & \" \"  & INDEX(labels!$A$103:$C$103,1,MATCH(PP_Language,labels!$A$1:$C$1,0)) &  \" \"  & INDEX(labels!$A$713:$C$713,1,MATCH(PP_Language,labels!$A$1:$C$1,0)) &  \" {\"&COLUMN($H$1103)&\"}\"","v":"//notes-remuneration-non-supervisory-senior-officials-other-wnt-institution-specification Commercial Separate The name (consisting of the initials and last name) of the non supervisory senior official {8}"}]
[null,{"$f":"INDEX(labels!$A$717:$C$717,1,MATCH(PP_Language,labels!$A$1:$C$1,0))","v":"Notes to the financial statements - Remuneration of a senior official with a total remuneration of € 1,700 or more concerning anti cumulation - Cumulated: Specification"}]
[]
[]
[null,null,null,{"$f":"INDEX(labels!$A$713:$C$713,1,MATCH(PP_Language,labels!$A$1:$C$1,0))","v":"The name (consisting of the initials and last name) of the non supervisory senior official"},{"$f":"INDEX(labels!$A$713:$C$713,1,MATCH(PP_Language,labels!$A$1:$C$1,0))","v":"The name (consisting of the initials and last name) of the non supervisory senior official"},{"$f":"INDEX(labels!$A$713:$C$713,1,MATCH(PP_Language,labels!$A$1:$C$1,0))","v":"The name (consisting of the initials and last name) of the non supervisory senior official"},{"$f":"INDEX(labels!$A$713:$C$713,1,MATCH(PP_Language,labels!$A$1:$C$1,0))","v":"The name (consisting of the initials and last name) of the non supervisory senior official"},{"$f":"INDEX(labels!$A$713:$C$713,1,MATCH(PP_Language,labels!$A$1:$C$1,0))","v":"The name (consisting of the initials and last name) of the non supervisory senior official"},null,null,null,null,null,null,null,null,null,null,null,null,null,null,null,null,null,{"$f":"\"/notes-senior-officials-remuneration1700or-more-accumulated label {\"&COLUMN($B$1107)&\"}\"","v":"/notes-senior-officials-remuneration1700or-more-accumulated label {2}"},null,{"$f":"\"/notes-senior-officials-remuneration1700or-more-accumulated \" & BasisOfPreparationAxis & \" \"  & INDEX(labels!$A$103:$C$103,1,MATCH(PP_Language,labels!$A$1:$C$1,0)) &  \" \"  & INDEX(labels!$A$713:$C$713,1,MATCH(PP_Language,labels!$A$1:$C$1,0)) &  \" {\"&COLUMN($D$1107)&\"}\"","v":"/notes-senior-officials-remuneration1700or-more-accumulated Commercial Separate The name (consisting of the initials and last name) of the non supervisory senior official {4}"},{"$f":"\"/notes-senior-officials-remuneration1700or-more-accumulated \" & BasisOfPreparationAxis & \" \"  & INDEX(labels!$A$103:$C$103,1,MATCH(PP_Language,labels!$A$1:$C$1,0)) &  \" \"  & INDEX(labels!$A$713:$C$713,1,MATCH(PP_Language,labels!$A$1:$C$1,0)) &  \" {\"&COLUMN($E$1107)&\"}\"","v":"/notes-senior-officials-remuneration1700or-more-accumulated Commercial Separate The name (consisting of the initials and last name) of the non supervisory senior official {5}"},{"$f":"\"/notes-senior-officials-remuneration1700or-more-accumulated \" & BasisOfPreparationAxis & \" \"  & INDEX(labels!$A$103:$C$103,1,MATCH(PP_Language,labels!$A$1:$C$1,0)) &  \" \"  & INDEX(labels!$A$713:$C$713,1,MATCH(PP_Language,labels!$A$1:$C$1,0)) &  \" {\"&COLUMN($F$1107)&\"}\"","v":"/notes-senior-officials-remuneration1700or-more-accumulated Commercial Separate The name (consisting of the initials and last name) of the non supervisory senior official {6}"},{"$f":"\"/notes-senior-officials-remuneration1700or-more-accumulated \" & BasisOfPreparationAxis & \" \"  & INDEX(labels!$A$103:$C$103,1,MATCH(PP_Language,labels!$A$1:$C$1,0)) &  \" \"  & INDEX(labels!$A$713:$C$713,1,MATCH(PP_Language,labels!$A$1:$C$1,0)) &  \" {\"&COLUMN($G$1107)&\"}\"","v":"/notes-senior-officials-remuneration1700or-more-accumulated Commercial Separate The name (consisting of the initials and last name) of the non supervisory senior official {7}"},{"$f":"\"/notes-senior-officials-remuneration1700or-more-accumulated \" & BasisOfPreparationAxis & \" \"  & INDEX(labels!$A$103:$C$103,1,MATCH(PP_Language,labels!$A$1:$C$1,0)) &  \" \"  & INDEX(labels!$A$713:$C$713,1,MATCH(PP_Language,labels!$A$1:$C$1,0)) &  \" {\"&COLUMN($H$1107)&\"}\"","v":"/notes-senior-officials-remuneration1700or-more-accumulated Commercial Separate The name (consisting of the initials and last name) of the non supervisory senior official {8}"}]
[null,{"$f":"INDEX(labels!$A$718:$C$718,1,MATCH(PP_Language,labels!$A$1:$C$1,0))","v":"Description The name (consisting of the initials and last name) of the non supervisory senior official"}]
[null,{"$f":"INDEX(labels!$A$719:$C$719,1,MATCH(PP_Language,labels!$A$1:$C$1,0))","v":"Cumulated total remuneration at all institutions concerning anti cumalation approach"}]
[null,{"$f":"INDEX(labels!$A$720:$C$720,1,MATCH(PP_Language,labels!$A$1:$C$1,0))","v":"The remuneration maximum or higher individual remuneration than the remuneration maximum"}]
[null,{"$f":"INDEX(labels!$A$651:$C$651,1,MATCH(PP_Language,labels!$A$1:$C$1,0))","v":"Undue payments and amounts not yet received"}]
[null,{"$f":"INDEX(labels!$A$652:$C$652,1,MATCH(PP_Language,labels!$A$1:$C$1,0))","v":"Amount exceeding maximum remuneration"}]
[null,{"$f":"INDEX(labels!$A$653:$C$653,1,MATCH(PP_Language,labels!$A$1:$C$1,0))","v":"Reasons for exceeding the maximum amount of remuneration"}]
[null,{"$f":"INDEX(labels!$A$654:$C$654,1,MATCH(PP_Language,labels!$A$1:$C$1,0))","v":"Description of the claim for undue payment"}]
[null,{"$f":"INDEX(labels!$A$655:$C$655,1,MATCH(PP_Language,labels!$A$1:$C$1,0))","v":"Error recovery in WNT accountability"}]
[null,{"$f":"INDEX(labels!$A$656:$C$656,1,MATCH(PP_Language,labels!$A$1:$C$1,0))","v":"Explanation of the difference and cause of error recovery"}]
[null,{"$f":"INDEX(labels!$A$172:$C$172,1,MATCH(PP_Language,labels!$A$1:$C$1,0))","v":"Presentation order"}]
[null,null,null,null,null,null,null,null,null,null,null,null,null,null,null,null,null,null,null,null,null,null,null,null,null,{"$f":"\"//notes-senior-officials-remuneration1700or-more-accumulated label {\"&COLUMN($B$1118)&\"}\"","v":"//notes-senior-officials-remuneration1700or-more-accumulated label {2}"},null,{"$f":"\"//notes-senior-officials-remuneration1700or-more-accumulated \" & BasisOfPreparationAxis & \" \"  & INDEX(labels!$A$103:$C$103,1,MATCH(PP_Language,labels!$A$1:$C$1,0)) &  \" \"  & INDEX(labels!$A$713:$C$713,1,MATCH(PP_Language,labels!$A$1:$C$1,0)) &  \" {\"&COLUMN($D$1118)&\"}\"","v":"//notes-senior-officials-remuneration1700or-more-accumulated Commercial Separate The name (consisting of the initials and last name) of the non supervisory senior official {4}"},{"$f":"\"//notes-senior-officials-remuneration1700or-more-accumulated \" & BasisOfPreparationAxis & \" \"  & INDEX(labels!$A$103:$C$103,1,MATCH(PP_Language,labels!$A$1:$C$1,0)) &  \" \"  & INDEX(labels!$A$713:$C$713,1,MATCH(PP_Language,labels!$A$1:$C$1,0)) &  \" {\"&COLUMN($E$1118)&\"}\"","v":"//notes-senior-officials-remuneration1700or-more-accumulated Commercial Separate The name (consisting of the initials and last name) of the non supervisory senior official {5}"},{"$f":"\"//notes-senior-officials-remuneration1700or-more-accumulated \" & BasisOfPreparationAxis & \" \"  & INDEX(labels!$A$103:$C$103,1,MATCH(PP_Language,labels!$A$1:$C$1,0)) &  \" \"  & INDEX(labels!$A$713:$C$713,1,MATCH(PP_Language,labels!$A$1:$C$1,0)) &  \" {\"&COLUMN($F$1118)&\"}\"","v":"//notes-senior-officials-remuneration1700or-more-accumulated Commercial Separate The name (consisting of the initials and last name) of the non supervisory senior official {6}"},{"$f":"\"//notes-senior-officials-remuneration1700or-more-accumulated \" & BasisOfPreparationAxis & \" \"  & INDEX(labels!$A$103:$C$103,1,MATCH(PP_Language,labels!$A$1:$C$1,0)) &  \" \"  & INDEX(labels!$A$713:$C$713,1,MATCH(PP_Language,labels!$A$1:$C$1,0)) &  \" {\"&COLUMN($G$1118)&\"}\"","v":"//notes-senior-officials-remuneration1700or-more-accumulated Commercial Separate The name (consisting of the initials and last name) of the non supervisory senior official {7}"},{"$f":"\"//notes-senior-officials-remuneration1700or-more-accumulated \" & BasisOfPreparationAxis & \" \"  & INDEX(labels!$A$103:$C$103,1,MATCH(PP_Language,labels!$A$1:$C$1,0)) &  \" \"  & INDEX(labels!$A$713:$C$713,1,MATCH(PP_Language,labels!$A$1:$C$1,0)) &  \" {\"&COLUMN($H$1118)&\"}\"","v":"//notes-senior-officials-remuneration1700or-more-accumulated Commercial Separate The name (consisting of the initials and last name) of the non supervisory senior official {8}"}]
[null,{"$f":"INDEX(labels!$A$721:$C$721,1,MATCH(PP_Language,labels!$A$1:$C$1,0))","v":"Notes to the financial statements - Senior officer with a total salary of € 1,700 or less to which the anti-cumulation provision applies: Specification"}]
[]
[]
[null,null,null,{"$f":"INDEX(labels!$A$642:$C$642,1,MATCH(PP_Language,labels!$A$1:$C$1,0))","v":"The name (consisting of the initials and last name) of the senior official"},{"$f":"INDEX(labels!$A$642:$C$642,1,MATCH(PP_Language,labels!$A$1:$C$1,0))","v":"The name (consisting of the initials and last name) of the senior official"},{"$f":"INDEX(labels!$A$642:$C$642,1,MATCH(PP_Language,labels!$A$1:$C$1,0))","v":"The name (consisting of the initials and last name) of the senior official"},{"$f":"INDEX(labels!$A$642:$C$642,1,MATCH(PP_Language,labels!$A$1:$C$1,0))","v":"The name (consisting of the initials and last name) of the senior official"},{"$f":"INDEX(labels!$A$642:$C$642,1,MATCH(PP_Language,labels!$A$1:$C$1,0))","v":"The name (consisting of the initials and last name) of the senior official"},null,null,null,null,null,null,null,null,null,null,null,null,null,null,null,null,null,{"$f":"\"/notes-senior-official-remuneration1700or-less-anti-cumulation-approach label {\"&COLUMN($B$1122)&\"}\"","v":"/notes-senior-official-remuneration1700or-less-anti-cumulation-approach label {2}"},null,{"$f":"\"/notes-senior-official-remuneration1700or-less-anti-cumulation-approach \" & BasisOfPreparationAxis & \" \"  & INDEX(labels!$A$103:$C$103,1,MATCH(PP_Language,labels!$A$1:$C$1,0)) &  \" \"  & INDEX(labels!$A$642:$C$642,1,MATCH(PP_Language,labels!$A$1:$C$1,0)) &  \" {\"&COLUMN($D$1122)&\"}\"","v":"/notes-senior-official-remuneration1700or-less-anti-cumulation-approach Commercial Separate The name (consisting of the initials and last name) of the senior official {4}"},{"$f":"\"/notes-senior-official-remuneration1700or-less-anti-cumulation-approach \" & BasisOfPreparationAxis & \" \"  & INDEX(labels!$A$103:$C$103,1,MATCH(PP_Language,labels!$A$1:$C$1,0)) &  \" \"  & INDEX(labels!$A$642:$C$642,1,MATCH(PP_Language,labels!$A$1:$C$1,0)) &  \" {\"&COLUMN($E$1122)&\"}\"","v":"/notes-senior-official-remuneration1700or-less-anti-cumulation-approach Commercial Separate The name (consisting of the initials and last name) of the senior official {5}"},{"$f":"\"/notes-senior-official-remuneration1700or-less-anti-cumulation-approach \" & BasisOfPreparationAxis & \" \"  & INDEX(labels!$A$103:$C$103,1,MATCH(PP_Language,labels!$A$1:$C$1,0)) &  \" \"  & INDEX(labels!$A$642:$C$642,1,MATCH(PP_Language,labels!$A$1:$C$1,0)) &  \" {\"&COLUMN($F$1122)&\"}\"","v":"/notes-senior-official-remuneration1700or-less-anti-cumulation-approach Commercial Separate The name (consisting of the initials and last name) of the senior official {6}"},{"$f":"\"/notes-senior-official-remuneration1700or-less-anti-cumulation-approach \" & BasisOfPreparationAxis & \" \"  & INDEX(labels!$A$103:$C$103,1,MATCH(PP_Language,labels!$A$1:$C$1,0)) &  \" \"  & INDEX(labels!$A$642:$C$642,1,MATCH(PP_Language,labels!$A$1:$C$1,0)) &  \" {\"&COLUMN($G$1122)&\"}\"","v":"/notes-senior-official-remuneration1700or-less-anti-cumulation-approach Commercial Separate The name (consisting of the initials and last name) of the senior official {7}"},{"$f":"\"/notes-senior-official-remuneration1700or-less-anti-cumulation-approach \" & BasisOfPreparationAxis & \" \"  & INDEX(labels!$A$103:$C$103,1,MATCH(PP_Language,labels!$A$1:$C$1,0)) &  \" \"  & INDEX(labels!$A$642:$C$642,1,MATCH(PP_Language,labels!$A$1:$C$1,0)) &  \" {\"&COLUMN($H$1122)&\"}\"","v":"/notes-senior-official-remuneration1700or-less-anti-cumulation-approach Commercial Separate The name (consisting of the initials and last name) of the senior official {8}"}]
[null,{"$f":"INDEX(labels!$A$722:$C$722,1,MATCH(PP_Language,labels!$A$1:$C$1,0))","v":"Description The name (consisting of the initials and last name) of the senior official"}]
[null,{"$f":"INDEX(labels!$A$644:$C$644,1,MATCH(PP_Language,labels!$A$1:$C$1,0))","v":"Position(s)"}]
[null,{"$f":"INDEX(labels!$A$723:$C$723,1,MATCH(PP_Language,labels!$A$1:$C$1,0))","v":"All other WNT Institutions where the employed managing senior officials is also a managing senior official"}]
[null,{"$f":"INDEX(labels!$A$651:$C$651,1,MATCH(PP_Language,labels!$A$1:$C$1,0))","v":"Undue payments and amounts not yet received"}]
[null,{"$f":"INDEX(labels!$A$652:$C$652,1,MATCH(PP_Language,labels!$A$1:$C$1,0))","v":"Amount exceeding maximum remuneration"}]
[null,{"$f":"INDEX(labels!$A$653:$C$653,1,MATCH(PP_Language,labels!$A$1:$C$1,0))","v":"Reasons for exceeding the maximum amount of remuneration"}]
[null,{"$f":"INDEX(labels!$A$654:$C$654,1,MATCH(PP_Language,labels!$A$1:$C$1,0))","v":"Description of the claim for undue payment"}]
[null,{"$f":"INDEX(labels!$A$655:$C$655,1,MATCH(PP_Language,labels!$A$1:$C$1,0))","v":"Error recovery in WNT accountability"}]
[null,{"$f":"INDEX(labels!$A$656:$C$656,1,MATCH(PP_Language,labels!$A$1:$C$1,0))","v":"Explanation of the difference and cause of error recovery"}]
[null,{"$f":"INDEX(labels!$A$172:$C$172,1,MATCH(PP_Language,labels!$A$1:$C$1,0))","v":"Presentation order"}]
[null,null,null,null,null,null,null,null,null,null,null,null,null,null,null,null,null,null,null,null,null,null,null,null,null,{"$f":"\"//notes-senior-official-remuneration1700or-less-anti-cumulation-approach label {\"&COLUMN($B$1133)&\"}\"","v":"//notes-senior-official-remuneration1700or-less-anti-cumulation-approach label {2}"},null,{"$f":"\"//notes-senior-official-remuneration1700or-less-anti-cumulation-approach \" & BasisOfPreparationAxis & \" \"  & INDEX(labels!$A$103:$C$103,1,MATCH(PP_Language,labels!$A$1:$C$1,0)) &  \" \"  & INDEX(labels!$A$642:$C$642,1,MATCH(PP_Language,labels!$A$1:$C$1,0)) &  \" {\"&COLUMN($D$1133)&\"}\"","v":"//notes-senior-official-remuneration1700or-less-anti-cumulation-approach Commercial Separate The name (consisting of the initials and last name) of the senior official {4}"},{"$f":"\"//notes-senior-official-remuneration1700or-less-anti-cumulation-approach \" & BasisOfPreparationAxis & \" \"  & INDEX(labels!$A$103:$C$103,1,MATCH(PP_Language,labels!$A$1:$C$1,0)) &  \" \"  & INDEX(labels!$A$642:$C$642,1,MATCH(PP_Language,labels!$A$1:$C$1,0)) &  \" {\"&COLUMN($E$1133)&\"}\"","v":"//notes-senior-official-remuneration1700or-less-anti-cumulation-approach Commercial Separate The name (consisting of the initials and last name) of the senior official {5}"},{"$f":"\"//notes-senior-official-remuneration1700or-less-anti-cumulation-approach \" & BasisOfPreparationAxis & \" \"  & INDEX(labels!$A$103:$C$103,1,MATCH(PP_Language,labels!$A$1:$C$1,0)) &  \" \"  & INDEX(labels!$A$642:$C$642,1,MATCH(PP_Language,labels!$A$1:$C$1,0)) &  \" {\"&COLUMN($F$1133)&\"}\"","v":"//notes-senior-official-remuneration1700or-less-anti-cumulation-approach Commercial Separate The name (consisting of the initials and last name) of the senior official {6}"},{"$f":"\"//notes-senior-official-remuneration1700or-less-anti-cumulation-approach \" & BasisOfPreparationAxis & \" \"  & INDEX(labels!$A$103:$C$103,1,MATCH(PP_Language,labels!$A$1:$C$1,0)) &  \" \"  & INDEX(labels!$A$642:$C$642,1,MATCH(PP_Language,labels!$A$1:$C$1,0)) &  \" {\"&COLUMN($G$1133)&\"}\"","v":"//notes-senior-official-remuneration1700or-less-anti-cumulation-approach Commercial Separate The name (consisting of the initials and last name) of the senior official {7}"},{"$f":"\"//notes-senior-official-remuneration1700or-less-anti-cumulation-approach \" & BasisOfPreparationAxis & \" \"  & INDEX(labels!$A$103:$C$103,1,MATCH(PP_Language,labels!$A$1:$C$1,0)) &  \" \"  & INDEX(labels!$A$642:$C$642,1,MATCH(PP_Language,labels!$A$1:$C$1,0)) &  \" {\"&COLUMN($H$1133)&\"}\"","v":"//notes-senior-official-remuneration1700or-less-anti-cumulation-approach Commercial Separate The name (consisting of the initials and last name) of the senior official {8}"}]
[null,{"$f":"INDEX(labels!$A$95:$C$95,1,MATCH(PP_Language,labels!$A$1:$C$1,0))","v":"Share based payments"}]
[null,{"$f":"INDEX(labels!$A$724:$C$724,1,MATCH(PP_Language,labels!$A$1:$C$1,0))","v":"Notes to the financial statements - Share based payments"}]
[null,null,null,null,null,null,null,null,null,null,null,null,null,null,null,null,null,null,null,null,null,null,null,null,null,{"$f":"\"/notes-share-based-payments label {\"&COLUMN($B$1136)&\"}\"","v":"/notes-share-based-payments label {2}"},null,{"$f":"\"/notes-share-based-payments \" & BasisOfPreparationAxis & \" \"  & INDEX(labels!$A$103:$C$103,1,MATCH(PP_Language,labels!$A$1:$C$1,0)) &  \" \"  &  \" {\"&COLUMN($D$1136)&\"}\"","v":"/notes-share-based-payments Commercial Separate  {4}"}]
[null,{"$f":"INDEX(labels!$A$725:$C$725,1,MATCH(PP_Language,labels!$A$1:$C$1,0))","v":"Disclosure of share based payments"}]
[null,{"$f":"INDEX(labels!$A$726:$C$726,1,MATCH(PP_Language,labels!$A$1:$C$1,0))","v":"Description of the policy for hedging of granted share options of share based payments"}]
[null,{"$f":"INDEX(labels!$A$727:$C$727,1,MATCH(PP_Language,labels!$A$1:$C$1,0))","v":"Description of the position of granted not yet exercised options relating to share based payments"}]
[null,{"$f":"INDEX(labels!$A$728:$C$728,1,MATCH(PP_Language,labels!$A$1:$C$1,0))","v":"Average price of purchased treasury shares relating to share based payments"}]
[null,{"$f":"INDEX(labels!$A$729:$C$729,1,MATCH(PP_Language,labels!$A$1:$C$1,0))","v":"Description of purchase commitments of shares(certificates) relating to share based payments"}]
[null,null,null,null,null,null,null,null,null,null,null,null,null,null,null,null,null,null,null,null,null,null,null,null,null,{"$f":"\"//notes-share-based-payments label {\"&COLUMN($B$1142)&\"}\"","v":"//notes-share-based-payments label {2}"},null,{"$f":"\"//notes-share-based-payments \" & BasisOfPreparationAxis & \" \"  & INDEX(labels!$A$103:$C$103,1,MATCH(PP_Language,labels!$A$1:$C$1,0)) &  \" \"  &  \" {\"&COLUMN($D$1142)&\"}\"","v":"//notes-share-based-payments Commercial Separate  {4}"}]
[null,{"$f":"INDEX(labels!$A$96:$C$96,1,MATCH(PP_Language,labels!$A$1:$C$1,0))","v":"Rights granted not yet exercised"}]
[null,{"$f":"INDEX(labels!$A$730:$C$730,1,MATCH(PP_Language,labels!$A$1:$C$1,0))","v":"Notes to the financial statements - Rights granted not yet exercised"}]
[null,null,null,null,null,null,null,null,null,null,null,null,null,null,null,null,null,null,null,null,null,null,null,null,null,{"$f":"\"/notes-rights-granted-not-yet-exercised label {\"&COLUMN($B$1145)&\"}\"","v":"/notes-rights-granted-not-yet-exercised label {2}"},null,{"$f":"\"/notes-rights-granted-not-yet-exercised \" & BasisOfPreparationAxis & \" \"  & INDEX(labels!$A$103:$C$103,1,MATCH(PP_Language,labels!$A$1:$C$1,0)) &  \" \"  &  \" {\"&COLUMN($D$1145)&\"}\"","v":"/notes-rights-granted-not-yet-exercised Commercial Separate  {4}"}]
[null,{"$f":"INDEX(labels!$A$731:$C$731,1,MATCH(PP_Language,labels!$A$1:$C$1,0))","v":"Disclosure of rights granted, not yet exercised"}]
[null,{"$f":"INDEX(labels!$A$732:$C$732,1,MATCH(PP_Language,labels!$A$1:$C$1,0))","v":"Description of reasons for granting rights to supervisory directors to take or obtain (certificates of) shares in the capital of the company or subsidiary"}]
[null,{"$f":"INDEX(labels!$A$733:$C$733,1,MATCH(PP_Language,labels!$A$1:$C$1,0))","v":"Description of the criteria for granting or exercising rights (certificates of) to acquire or receive shares in capital of company or daughter company"}]
[null,{"$f":"INDEX(labels!$A$734:$C$734,1,MATCH(PP_Language,labels!$A$1:$C$1,0))","v":"Conditions applying to number of granted rights (certificates of) to acquire or receive shares in capital of company or daughter company in the financial year"}]
[null,{"$f":"INDEX(labels!$A$735:$C$735,1,MATCH(PP_Language,labels!$A$1:$C$1,0))","v":"Description of the main conditions that apply to the exercise of the rights not yet exercised at the end of the financial year"}]
[null,{"$f":"INDEX(labels!$A$736:$C$736,1,MATCH(PP_Language,labels!$A$1:$C$1,0))","v":"Description of the financing arrangements that apply to the granting of the rights not yet exercised at the end of the financial year"}]
[null,{"$f":"INDEX(labels!$A$737:$C$737,1,MATCH(PP_Language,labels!$A$1:$C$1,0))","v":"Disclosure of the purchase of treasury shares or issuance of new shares on behalf of exercising the rights granted"}]
[null,{"$f":"INDEX(labels!$A$738:$C$738,1,MATCH(PP_Language,labels!$A$1:$C$1,0))","v":"Description of other data that are important for the assessment of the value of the granted rights not yet exercised at the end of the financial year"}]
[null,{"$f":"INDEX(labels!$A$739:$C$739,1,MATCH(PP_Language,labels!$A$1:$C$1,0))","v":"Disclosure of hedging of rights granted"}]
[null,{"$f":"INDEX(labels!$A$740:$C$740,1,MATCH(PP_Language,labels!$A$1:$C$1,0))","v":"Description of the policy for hedging of rights granted"}]
[null,{"$f":"INDEX(labels!$A$741:$C$741,1,MATCH(PP_Language,labels!$A$1:$C$1,0))","v":"Description of purchase commitments of shares or certificates of shares on behalf of rights granted"}]
[null,{"$f":"INDEX(labels!$A$742:$C$742,1,MATCH(PP_Language,labels!$A$1:$C$1,0))","v":"Type of shares or certificates that the rights granted not yet exercised by the end of the financial year claim rights provides"}]
[null,null,null,null,null,null,null,null,null,null,null,null,null,null,null,null,null,null,null,null,null,null,null,null,null,{"$f":"\"//notes-rights-granted-not-yet-exercised label {\"&COLUMN($B$1158)&\"}\"","v":"//notes-rights-granted-not-yet-exercised label {2}"},null,{"$f":"\"//notes-rights-granted-not-yet-exercised \" & BasisOfPreparationAxis & \" \"  & INDEX(labels!$A$103:$C$103,1,MATCH(PP_Language,labels!$A$1:$C$1,0)) &  \" \"  &  \" {\"&COLUMN($D$1158)&\"}\"","v":"//notes-rights-granted-not-yet-exercised Commercial Separate  {4}"}]
[null,{"$f":"INDEX(labels!$A$97:$C$97,1,MATCH(PP_Language,labels!$A$1:$C$1,0))","v":"Loans, advances and guarantees on behalf of managing and supervisory directors"}]
[null,{"$f":"INDEX(labels!$A$743:$C$743,1,MATCH(PP_Language,labels!$A$1:$C$1,0))","v":"Notes to the financial statements - Loans, advances and guarantees: On behalf of managing and supervisory directors"}]
[null,null,null,null,null,null,null,null,null,null,null,null,null,null,null,null,null,null,null,null,null,null,null,null,null,{"$f":"\"/notes-loans-advances-guarantees label {\"&COLUMN($B$1161)&\"}\"","v":"/notes-loans-advances-guarantees label {2}"},null,{"$f":"\"/notes-loans-advances-guarantees \" & BasisOfPreparationAxis & \" \"  & INDEX(labels!$A$103:$C$103,1,MATCH(PP_Language,labels!$A$1:$C$1,0)) &  \" \"  &  \" {\"&COLUMN($D$1161)&\"}\"","v":"/notes-loans-advances-guarantees Commercial Separate  {4}"}]
[null,{"$f":"INDEX(labels!$A$744:$C$744,1,MATCH(PP_Language,labels!$A$1:$C$1,0))","v":"Disclosure of loans, advances and guarantees on behalf of managing and supervisory directors"}]
[null,{"$f":"INDEX(labels!$A$745:$C$745,1,MATCH(PP_Language,labels!$A$1:$C$1,0))","v":"Description of other significant conditions of loans, advances and guarantees on behalf of managing and supervisory directors"}]
[null,null,null,null,null,null,null,null,null,null,null,null,null,null,null,null,null,null,null,null,null,null,null,null,null,{"$f":"\"//notes-loans-advances-guarantees label {\"&COLUMN($B$1164)&\"}\"","v":"//notes-loans-advances-guarantees label {2}"},null,{"$f":"\"//notes-loans-advances-guarantees \" & BasisOfPreparationAxis & \" \"  & INDEX(labels!$A$103:$C$103,1,MATCH(PP_Language,labels!$A$1:$C$1,0)) &  \" \"  &  \" {\"&COLUMN($D$1164)&\"}\"","v":"//notes-loans-advances-guarantees Commercial Separate  {4}"}]
[null,{"$f":"INDEX(labels!$A$746:$C$746,1,MATCH(PP_Language,labels!$A$1:$C$1,0))","v":"Notes to the financial statements - Other notes"}]
[null,null,null,null,null,null,null,null,null,null,null,null,null,null,null,null,null,null,null,null,null,null,null,null,null,{"$f":"\"/notes-other-notes label {\"&COLUMN($B$1166)&\"}\"","v":"/notes-other-notes label {2}"},null,{"$f":"\"/notes-other-notes \" & BasisOfPreparationAxis & \" \"  & INDEX(labels!$A$103:$C$103,1,MATCH(PP_Language,labels!$A$1:$C$1,0)) &  \" \"  &  \" {\"&COLUMN($D$1166)&\"}\"","v":"/notes-other-notes Commercial Separate  {4}"}]
[null,{"$f":"INDEX(labels!$A$747:$C$747,1,MATCH(PP_Language,labels!$A$1:$C$1,0))","v":"Disclosure of deviations from regulations based on true and fair view requirements"}]
[null,{"$f":"INDEX(labels!$A$748:$C$748,1,MATCH(PP_Language,labels!$A$1:$C$1,0))","v":"Notification of differences and reasons that resulted in changes in the grouping of balance sheet items or income statement items"}]
[null,null,null,null,null,null,null,null,null,null,null,null,null,null,null,null,null,null,null,null,null,null,null,null,null,{"$f":"\"//notes-other-notes label {\"&COLUMN($B$1169)&\"}\"","v":"//notes-other-notes label {2}"},null,{"$f":"\"//notes-other-notes \" & BasisOfPreparationAxis & \" \"  & INDEX(labels!$A$103:$C$103,1,MATCH(PP_Language,labels!$A$1:$C$1,0)) &  \" \"  &  \" {\"&COLUMN($D$1169)&\"}\"","v":"//notes-other-notes Commercial Separate  {4}"}]
[null,{"$f":"INDEX(labels!$A$749:$C$749,1,MATCH(PP_Language,labels!$A$1:$C$1,0))","v":"Signing of the financial statements"}]
[]
[null,null,null,{"$f":"INDEX(labels!$A$750:$C$750,1,MATCH(PP_Language,labels!$A$1:$C$1,0))","v":"Name of managing, supervisory directors and representative"},{"$f":"INDEX(labels!$A$750:$C$750,1,MATCH(PP_Language,labels!$A$1:$C$1,0))","v":"Name of managing, supervisory directors and representative"},{"$f":"INDEX(labels!$A$750:$C$750,1,MATCH(PP_Language,labels!$A$1:$C$1,0))","v":"Name of managing, supervisory directors and representative"},{"$f":"INDEX(labels!$A$750:$C$750,1,MATCH(PP_Language,labels!$A$1:$C$1,0))","v":"Name of managing, supervisory directors and representative"},{"$f":"INDEX(labels!$A$750:$C$750,1,MATCH(PP_Language,labels!$A$1:$C$1,0))","v":"Name of managing, supervisory directors and representative"},null,null,null,null,null,null,null,null,null,null,null,null,null,null,null,null,null,{"$f":"\"/signing-financial-statements label {\"&COLUMN($B$1172)&\"}\"","v":"/signing-financial-statements label {2}"},null,{"$f":"\"/signing-financial-statements \"  & INDEX(labels!$A$750:$C$750,1,MATCH(PP_Language,labels!$A$1:$C$1,0)) &  \" {\"&COLUMN($D$1172)&\"}\"","v":"/signing-financial-statements Name of managing, supervisory directors and representative {4}"},{"$f":"\"/signing-financial-statements \"  & INDEX(labels!$A$750:$C$750,1,MATCH(PP_Language,labels!$A$1:$C$1,0)) &  \" {\"&COLUMN($E$1172)&\"}\"","v":"/signing-financial-statements Name of managing, supervisory directors and representative {5}"},{"$f":"\"/signing-financial-statements \"  & INDEX(labels!$A$750:$C$750,1,MATCH(PP_Language,labels!$A$1:$C$1,0)) &  \" {\"&COLUMN($F$1172)&\"}\"","v":"/signing-financial-statements Name of managing, supervisory directors and representative {6}"},{"$f":"\"/signing-financial-statements \"  & INDEX(labels!$A$750:$C$750,1,MATCH(PP_Language,labels!$A$1:$C$1,0)) &  \" {\"&COLUMN($G$1172)&\"}\"","v":"/signing-financial-statements Name of managing, supervisory directors and representative {7}"},{"$f":"\"/signing-financial-statements \"  & INDEX(labels!$A$750:$C$750,1,MATCH(PP_Language,labels!$A$1:$C$1,0)) &  \" {\"&COLUMN($H$1172)&\"}\"","v":"/signing-financial-statements Name of managing, supervisory directors and representative {8}"}]
[null,{"$f":"INDEX(labels!$A$751:$C$751,1,MATCH(PP_Language,labels!$A$1:$C$1,0))","v":"Description Name of managing, supervisory directors and representative"}]
[null,{"$f":"INDEX(labels!$A$752:$C$752,1,MATCH(PP_Language,labels!$A$1:$C$1,0))","v":"Type of director"}]
[null,{"$f":"INDEX(labels!$A$753:$C$753,1,MATCH(PP_Language,labels!$A$1:$C$1,0))","v":"Name of the legal entity which functions as managing or supervisory director"}]
[null,{"$f":"INDEX(labels!$A$754:$C$754,1,MATCH(PP_Language,labels!$A$1:$C$1,0))","v":"Location of signing by managing and supervisory directors"}]
[null,{"$f":"INDEX(labels!$A$755:$C$755,1,MATCH(PP_Language,labels!$A$1:$C$1,0))","v":"Date of signing by managing and supervisory directors"}]
[null,{"$f":"INDEX(labels!$A$756:$C$756,1,MATCH(PP_Language,labels!$A$1:$C$1,0))","v":"Signed by director (Y/N)"}]
[null,{"$f":"INDEX(labels!$A$757:$C$757,1,MATCH(PP_Language,labels!$A$1:$C$1,0))","v":"Reason why the director did not sign"}]
[null,{"$f":"INDEX(labels!$A$172:$C$172,1,MATCH(PP_Language,labels!$A$1:$C$1,0))","v":"Presentation order"}]
[null,null,null,null,null,null,null,null,null,null,null,null,null,null,null,null,null,null,null,null,null,null,null,null,null,{"$f":"\"//signing-financial-statements label {\"&COLUMN($B$1181)&\"}\"","v":"//signing-financial-statements label {2}"},null,{"$f":"\"//signing-financial-statements \"  & INDEX(labels!$A$750:$C$750,1,MATCH(PP_Language,labels!$A$1:$C$1,0)) &  \" {\"&COLUMN($D$1181)&\"}\"","v":"//signing-financial-statements Name of managing, supervisory directors and representative {4}"},{"$f":"\"//signing-financial-statements \"  & INDEX(labels!$A$750:$C$750,1,MATCH(PP_Language,labels!$A$1:$C$1,0)) &  \" {\"&COLUMN($E$1181)&\"}\"","v":"//signing-financial-statements Name of managing, supervisory directors and representative {5}"},{"$f":"\"//signing-financial-statements \"  & INDEX(labels!$A$750:$C$750,1,MATCH(PP_Language,labels!$A$1:$C$1,0)) &  \" {\"&COLUMN($F$1181)&\"}\"","v":"//signing-financial-statements Name of managing, supervisory directors and representative {6}"},{"$f":"\"//signing-financial-statements \"  & INDEX(labels!$A$750:$C$750,1,MATCH(PP_Language,labels!$A$1:$C$1,0)) &  \" {\"&COLUMN($G$1181)&\"}\"","v":"//signing-financial-statements Name of managing, supervisory directors and representative {7}"},{"$f":"\"//signing-financial-statements \"  & INDEX(labels!$A$750:$C$750,1,MATCH(PP_Language,labels!$A$1:$C$1,0)) &  \" {\"&COLUMN($H$1181)&\"}\"","v":"//signing-financial-statements Name of managing, supervisory directors and representative {8}"}]

{"sheet":"Enumerations","index":1,"n_rows":934,"n_cols":9,"rows_kept":934,"cut":false,"hidden":true,"merged":[]}
[null,"Besloten vennootschap met beperkte aansprakelijkheid","Groot",111,"Ja","Commercieel","AED","Na","Bestuurder (huidig)"]
[null,"Commanditaire vennootschap","Klein",116,"Nee","Fiscaal","AFN","Voor","Bestuurder (voormalig)"]
[null,"Cooperatie","Micro",121,null,null,"ALL",null,"Commissaris (huidig)"]
[null,"Naamloze vennootschap","Middelgroot",127,null,null,"AMD",null,"Commissaris (voormalig)"]
[null,"Onderlinge waarborgmaatschappij",null,128,null,null,"ANG"]
[null,"Stichting",null,129,null,null,"AOA"]
[null,"Vennootschap onder firma",null,143,null,null,"ARS"]
[null,"Vereniging",null,150,null,null,"AUD"]
[null,null,null,161,null,null,"AWG"]
[null,null,null,162,null,null,"AZN"]
[null,null,null,163,null,null,"BAM"]
[null,null,null,164,null,null,"BBD"]
[null,null,null,170,null,null,"BDT"]
[null,null,null,210,null,null,"BGN"]
[null,null,null,220,null,null,"BHD"]
[null,null,null,240,null,null,"BIF"]
[null,null,null,311,null,null,"BMD"]
[null,null,null,312,null,null,"BND"]
[null,null,null,321,null,null,"BOB"]
[null,null,null,322,null,null,"BOV"]
[null,null,null,610,null,null,"BRL"]
[null,null,null,620,null,null,"BSD"]
[null,null,null,812,null,null,"BTN"]
[null,null,null,892,null,null,"BWP"]
[null,null,null,893,null,null,"BYR"]
[null,null,null,899,null,null,"BZD"]
[null,null,null,910,null,null,"CAD"]
[null,null,null,990,null,null,"CDF"]
[null,null,null,1011,null,null,"CHE"]
[null,null,null,1012,null,null,"CHF"]
[null,null,null,1013,null,null,"CHW"]
[null,null,null,1020,null,null,"CLF"]
[null,null,null,1031,null,null,"CLP"]
[null,null,null,1032,null,null,"CNY"]
[null,null,null,1039,null,null,"COP"]
[null,null,null,1041,null,null,"COU"]
[null,null,null,1042,null,null,"CRC"]
[null,null,null,1051,null,null,"CUC"]
[null,null,null,1052,null,null,"CUP"]
[null,null,null,1061,null,null,"CVE"]
[null,null,null,1062,null,null,"CZK"]
[null,null,null,1071,null,null,"DJF"]
[null,null,null,1072,null,null,"DKK"]
[null,null,null,1073,null,null,"DOP"]
[null,null,null,1081,null,null,"DZD"]
[null,null,null,1083,null,null,"EGP"]
[null,null,null,1084,null,null,"ERN"]
[null,null,null,1085,null,null,"ETB"]
[null,null,null,1086,null,null,"EUR"]
[null,null,null,1089,null,null,"FJD"]
[null,null,null,1091,null,null,"FKP"]
[null,null,null,1092,null,null,"GBP"]
[null,null,null,1101,null,null,"GEL"]
[null,null,null,1102,null,null,"GHS"]
[null,null,null,1103,null,null,"GIP"]
[null,null,null,1104,null,null,"GMD"]
[null,null,null,1105,null,null,"GNF"]
[null,null,null,1106,null,null,"GTQ"]
[null,null,null,1107,null,null,"GYD"]
[null,null,null,1200,null,null,"HKD"]
[null,null,null,1310,null,null,"HNL"]
[null,null,null,1320,null,null,"HRK"]
[null,null,null,1330,null,null,"HTG"]
[null,null,null,1391,null,null,"HUF"]
[null,null,null,1392,null,null,"IDR"]
[null,null,null,1393,null,null,"ILS"]
[null,null,null,1394,null,null,"INR"]
[null,null,null,1395,null,null,"IQD"]
[null,null,null,1396,null,null,"IRR"]
[null,null,null,1399,null,null,"ISK"]
[null,null,null,1411,null,null,"JMD"]
[null,null,null,1412,null,null,"JOD"]
[null,null,null,1413,null,null,"JPY"]
[null,null,null,1414,null,null,"KES"]
[null,null,null,1419,null,null,"KGS"]
[null,null,null,1420,null,null,"KHR"]
[null,null,null,1431,null,null,"KMF"]
[null,null,null,1439,null,null,"KPW"]
[null,null,null,1511,null,null,"KRW"]
[null,null,null,1512,null,null,"KWD"]
[null,null,null,1520,null,null,"KYD"]
[null,null,null,1621,null,null,"KZT"]
[null,null,null,1622,null,null,"LAK"]
[null,null,null,1624,null,null,"LBP"]
[null,null,null,1629,null,null,"LKR"]
[null,null,null,1711,null,null,"LRD"]
[null,null,null,1722,null,null,"LSL"]
[null,null,null,1723,null,null,"LTL"]
[null,null,null,1724,null,null,"LYD"]
[null,null,null,1729,null,null,"MAD"]
[null,null,null,1811,null,null,"MDL"]
[null,null,null,1813,null,null,"MGA"]
[null,null,null,1814,null,null,"MKD"]
[null,null,null,1820,null,null,"MMK"]
[null,null,null,1910,null,null,"MNT"]
[null,null,null,2011,null,null,"MOP"]
[null,null,null,2012,null,null,"MRO"]
[null,null,null,2013,null,null,"MRU"]
[null,null,null,2015,null,null,"MUR"]
[null,null,null,2016,null,null,"MVR"]
[null,null,null,2017,null,null,"MWK"]
[null,null,null,2020,null,null,"MXN"]
[null,null,null,2030,null,null,"MXV"]
[null,null,null,2041,null,null,"MYR"]
[null,null,null,2042,null,null,"MZN"]
[null,null,null,2051,null,null,"NAD"]
[null,null,null,2052,null,null,"NGN"]
[null,null,null,2053,null,null,"NIO"]
[null,null,null,2059,null,null,"NOK"]
[null,null,null,2060,null,null,"NPR"]
[null,null,null,2110,null,null,"NZD"]
[null,null,null,2120,null,null,"OMR"]
[null,null,null,2211,null,null,"PAB"]
[null,null,null,2219,null,null,"PEN"]
[null,null,null,2221,null,null,"PGK"]
[null,null,null,2222,null,null,"PHP"]
[null,null,null,2223,null,null,"PKR"]
[null,null,null,2229,null,null,"PLN"]
[null,null,null,2311,null,null,"PYG"]
[null,null,null,2312,null,null,"QAR"]
[null,null,null,2313,null,null,"RON"]
[null,null,null,2314,null,null,"RSD"]
[null,null,null,2319,null,null,"RUB"]
[null,null,null,2320,null,null,"RWF"]
[null,null,null,2331,null,null,"SAR"]
[null,null,null,2332,null,null,"SBD"]
[null,null,null,2341,null,null,"SCR"]
[null,null,null,2342,null,null,"SDG"]
[null,null,null,2343,null,null,"SEK"]
[null,null,null,2344,null,null,"SGD"]
[null,null,null,2349,null,null,"SHP"]
[null,null,null,2351,null,null,"SLL"]
[null,null,null,2352,null,null,"SOS"]
[null,null,null,2362,null,null,"SRD"]
[null,null,null,2363,null,null,"SSP"]
[null,null,null,2364,null,null,"STD"]
[null,null,null,2365,null,null,"STN"]
[null,null,null,2369,null,null,"SYP"]
[null,null,null,2370,null,null,"SZL"]
[null,null,null,2391,null,null,"THB"]
[null,null,null,2399,null,null,"TJS"]
[null,null,null,2410,null,null,"TMT"]
[null,null,null,2420,null,null,"TND"]
[null,null,null,2431,null,null,"TOP"]
[null,null,null,2432,null,null,"TRY"]
[null,null,null,2433,null,null,"TTD"]
[null,null,null,2434,null,null,"TWD"]
[null,null,null,2441,null,null,"TZS"]
[null,null,null,2442,null,null,"UAH"]
[null,null,null,2443,null,null,"UGX"]
[null,null,null,2444,null,null,"USD"]
[null,null,null,2445,null,null,"USN"]
[null,null,null,2446,null,null,"UYI"]
[null,null,null,2451,null,null,"UYU"]
[null,null,null,2452,null,null,"UZS"]
[null,null,null,2453,null,null,"VES"]
[null,null,null,2454,null,null,"VND"]
[null,null,null,2511,null,null,"VUV"]
[null,null,null,2512,null,null,"WST"]
[null,null,null,2521,null,null,"XAF"]
[null,null,null,2529,null,null,"XAG"]
[null,null,null,2530,null,null,"XAU"]
[null,null,null,2540,null,null,"XBA"]
[null,null,null,2550,null,null,"XBB"]
[null,null,null,2561,null,null,"XBC"]
[null,null,null,2562,null,null,"XBD"]
[null,null,null,2571,null,null,"XCD"]
[null,null,null,2572,null,null,"XDR"]
[null,null,null,2573,null,null,"XFU"]
[null,null,null,2591,null,null,"XOF"]
[null,null,null,2592,null,null,"XPD"]
[null,null,null,2593,null,null,"XPF"]
[null,null,null,2594,null,null,"XPT"]
[null,null,null,2599,null,null,"XSU"]
[null,null,null,2611,null,null,"XTS"]
[null,null,null,2612,null,null,"XUA"]
[null,null,null,2620,null,null,"XXX"]
[null,null,null,2630,null,null,"YER"]
[null,null,null,2640,null,null,"ZAR"]
[null,null,null,2651,null,null,"ZMW"]
[null,null,null,2652]
[null,null,null,2660]
[null,null,null,2670]
[null,null,null,2680]
[null,null,null,2711]
[null,null,null,2712]
[null,null,null,2720]
[null,null,null,2731]
[null,null,null,2732]
[null,null,null,2733]
[null,null,null,2740]
[null,null,null,2751]
[null,null,null,2752]
[null,null,null,2790]
[null,null,null,2811]
[null,null,null,2812]
[null,null,null,2813]
[null,null,null,2814]
[null,null,null,2815]
[null,null,null,2821]
[null,null,null,2822]
[null,null,null,2823]
[null,null,null,2824]
[null,null,null,2825]
[null,null,null,2829]
[null,null,null,2830]
[null,null,null,2841]
[null,null,null,2849]
[null,null,null,2891]
[null,null,null,2892]
[null,null,null,2893]
[null,null,null,2894]
[null,null,null,2895]
[null,null,null,2896]
[null,null,null,2899]
[null,null,null,2910]
[null,null,null,2931]
[null,null,null,2932]
[null,null,null,3011]
[null,null,null,3012]
[null,null,null,3020]
[null,null,null,3030]
[null,null,null,3040]
[null,null,null,3091]
[null,null,null,3092]
[null,null,null,3099]
[null,null,null,3102]
[null,null,null,3103]
[null,null,null,3109]
[null,null,null,3211]
[null,null,null,3212]
[null,null,null,3213]
[null,null,null,3220]
[null,null,null,3230]
[null,null,null,3240]
[null,null,null,3291]
[null,null,null,3311]
[null,null,null,3313]
[null,null,null,3314]
[null,null,null,3315]
[null,null,null,3316]
[null,null,null,3317]
[null,null,null,3319]
[null,null,null,3321]
[null,null,null,3323]
[null,null,null,3324]
[null,null,null,3329]
[null,null,null,3512]
[null,null,null,3513]
[null,null,null,3514]
[null,null,null,3520]
[null,null,null,3530]
[null,null,null,3600]
[null,null,null,3700]
[null,null,null,3811]
[null,null,null,3812]
[null,null,null,3821]
[null,null,null,3822]
[null,null,null,3831]
[null,null,null,3832]
[null,null,null,3900]
[null,null,null,4110]
[null,null,null,4120]
[null,null,null,4212]
[null,null,null,4213]
[null,null,null,4221]
[null,null,null,4222]
[null,null,null,4291]
[null,null,null,4299]
[null,null,null,4311]
[null,null,null,4312]
[null,null,null,4313]
[null,null,null,4321]
[null,null,null,4329]
[null,null,null,4331]
[null,null,null,4332]
[null,null,null,4333]
[null,null,null,4334]
[null,null,null,4339]
[null,null,null,4391]
[null,null,null,4532]
[null,null,null,4611]
[null,null,null,4612]
[null,null,null,4613]
[null,null,null,4614]
[null,null,null,4615]
[null,null,null,4616]
[null,null,null,4617]
[null,null,null,4618]
[null,null,null,4619]
[null,null,null,4622]
[null,null,null,4632]
[null,null,null,4634]
[null,null,null,4635]
[null,null,null,4636]
[null,null,null,4637]
[null,null,null,4639]
[null,null,null,4645]
[null,null,null,4648]
[null,null,null,4651]
[null,null,null,4652]
[null,null,null,4661]
[null,null,null,4662]
[null,null,null,4663]
[null,null,null,4664]
[null,null,null,4665]
[null,null,null,4666]
[null,null,null,4711]
[null,null,null,4721]
[null,null,null,4723]
[null,null,null,4725]
[null,null,null,4726]
[null,null,null,4730]
[null,null,null,4741]
[null,null,null,4742]
[null,null,null,4753]
[null,null,null,4761]
[null,null,null,4762]
[null,null,null,4763]
[null,null,null,4765]
[null,null,null,4773]
[null,null,null,4775]
[null,null,null,4777]
[null,null,null,4782]
[null,null,null,4910]
[null,null,null,4920]
[null,null,null,4931]
[null,null,null,4932]
[null,null,null,4941]
[null,null,null,4942]
[null,null,null,4950]
[null,null,null,5010]
[null,null,null,5030]
[null,null,null,5110]
[null,null,null,5121]
[null,null,null,5221]
[null,null,null,5222]
[null,null,null,5223]
[null,null,null,5310]
[null,null,null,5530]
[null,null,null,5590]
[null,null,null,5621]
[null,null,null,5629]
[null,null,null,5630]
[null,null,null,5811]
[null,null,null,5812]
[null,null,null,5813]
[null,null,null,5814]
[null,null,null,5819]
[null,null,null,5821]
[null,null,null,5829]
[null,null,null,5912]
[null,null,null,5913]
[null,null,null,5914]
[null,null,null,5920]
[null,null,null,6010]
[null,null,null,6020]
[null,null,null,6110]
[null,null,null,6120]
[null,null,null,6130]
[null,null,null,6190]
[null,null,null,6201]
[null,null,null,6202]
[null,null,null,6203]
[null,null,null,6209]
[null,null,null,6311]
[null,null,null,6312]
[null,null,null,6391]
[null,null,null,6399]
[null,null,null,6411]
[null,null,null,6420]
[null,null,null,6491]
[null,null,null,6499]
[null,null,null,6520]
[null,null,null,6611]
[null,null,null,6612]
[null,null,null,6621]
[null,null,null,6622]
[null,null,null,6630]
[null,null,null,6810]
[null,null,null,6831]
[null,null,null,6832]
[null,null,null,7021]
[null,null,null,7112]
[null,null,null,7220]
[null,null,null,7311]
[null,null,null,7312]
[null,null,null,7320]
[null,null,null,7430]
[null,null,null,7490]
[null,null,null,7500]
[null,null,null,7712]
[null,null,null,7721]
[null,null,null,7722]
[null,null,null,7731]
[null,null,null,7732]
[null,null,null,7733]
[null,null,null,7734]
[null,null,null,7735]
[null,null,null,7740]
[null,null,null,7810]
[null,null,null,7830]
[null,null,null,7911]
[null,null,null,7912]
[null,null,null,7990]
[null,null,null,8010]
[null,null,null,8020]
[null,null,null,8030]
[null,null,null,8110]
[null,null,null,8121]
[null,null,null,8129]
[null,null,null,8130]
[null,null,null,8211]
[null,null,null,8219]
[null,null,null,8220]
[null,null,null,8230]
[null,null,null,8291]
[null,null,null,8292]
[null,null,null,8411]
[null,null,null,8412]
[null,null,null,8413]
[null,null,null,8421]
[null,null,null,8422]
[null,null,null,8424]
[null,null,null,8425]
[null,null,null,8430]
[null,null,null,8541]
[null,null,null,8542]
[null,null,null,8553]
[null,null,null,8560]
[null,null,null,8621]
[null,null,null,8710]
[null,null,null,8720]
[null,null,null,8891]
[null,null,null,9002]
[null,null,null,9003]
[null,null,null,9103]
[null,null,null,9313]
[null,null,null,9411]
[null,null,null,9412]
[null,null,null,9420]
[null,null,null,9492]
[null,null,null,9511]
[null,null,null,9512]
[null,null,null,9521]
[null,null,null,9522]
[null,null,null,9523]
[null,null,null,9524]
[null,null,null,9525]
[null,null,null,9529]
[null,null,null,9604]
[null,null,null,9609]
[null,null,null,9700]
[null,null,null,9810]
[null,null,null,9820]
[null,null,null,9900]
[null,null,null,1131]
[null,null,null,1132]
[null,null,null,1133]
[null,null,null,1134]
[null,null,null,1191]
[null,null,null,1192]
[null,null,null,1193]
[null,null,null,1199]
[null,null,null,1241]
[null,null,null,1242]
[null,null,null,1251]
[null,null,null,1252]
[null,null,null,1253]
[null,null,null,1254]
[null,null,null,1301]
[null,null,null,1302]
[null,null,null,1303]
[null,null,null,1304]
[null,null,null,1305]
[null,null,null,1309]
[null,null,null,1411]
[null,null,null,1412]
[null,null,null,1421]
[null,null,null,1422]
[null,null,null,1451]
[null,null,null,1452]
[null,null,null,1461]
[null,null,null,1462]
[null,null,null,1463]
[null,null,null,1471]
[null,null,null,1472]
[null,null,null,1473]
[null,null,null,1479]
[null,null,null,1491]
[null,null,null,1499]
[null,null,null,10821]
[null,null,null,10822]
[null,null,null,16101]
[null,null,null,16102]
[null,null,null,16231]
[null,null,null,16239]
[null,null,null,17121]
[null,null,null,17122]
[null,null,null,17129]
[null,null,null,17211]
[null,null,null,17212]
[null,null,null,18121]
[null,null,null,18122]
[null,null,null,18123]
[null,null,null,18124]
[null,null,null,18125]
[null,null,null,18129]
[null,null,null,19201]
[null,null,null,19202]
[null,null,null,20141]
[null,null,null,20149]
[null,null,null,23611]
[null,null,null,23612]
[null,null,null,29201]
[null,null,null,29202]
[null,null,null,31011]
[null,null,null,31012]
[null,null,null,32501]
[null,null,null,32502]
[null,null,null,32991]
[null,null,null,32999]
[null,null,null,33121]
[null,null,null,33122]
[null,null,null,33123]
[null,null,null,33221]
[null,null,null,33222]
[null,null,null,33223]
[null,null,null,35111]
[null,null,null,35112]
[null,null,null,35113]
[null,null,null,42111]
[null,null,null,42112]
[null,null,null,43221]
[null,null,null,43222]
[null,null,null,43991]
[null,null,null,43992]
[null,null,null,43993]
[null,null,null,43999]
[null,null,null,45111]
[null,null,null,45112]
[null,null,null,45191]
[null,null,null,45192]
[null,null,null,45193]
[null,null,null,45194]
[null,null,null,45201]
[null,null,null,45202]
[null,null,null,45203]
[null,null,null,45204]
[null,null,null,45205]
[null,null,null,45311]
[null,null,null,45312]
[null,null,null,45401]
[null,null,null,45402]
[null,null,null,46211]
[null,null,null,46212]
[null,null,null,46213]
[null,null,null,46214]
[null,null,null,46215]
[null,null,null,46216]
[null,null,null,46217]
[null,null,null,46218]
[null,null,null,46219]
[null,null,null,46231]
[null,null,null,46232]
[null,null,null,46241]
[null,null,null,46242]
[null,null,null,46311]
[null,null,null,46312]
[null,null,null,46331]
[null,null,null,46332]
[null,null,null,46381]
[null,null,null,46382]
[null,null,null,46383]
[null,null,null,46384]
[null,null,null,46389]
[null,null,null,46411]
[null,null,null,46412]
[null,null,null,46421]
[null,null,null,46422]
[null,null,null,46423]
[null,null,null,46424]
[null,null,null,46425]
[null,null,null,46429]
[null,null,null,46431]
[null,null,null,46432]
[null,null,null,46433]
[null,null,null,46434]
[null,null,null,46435]
[null,null,null,46436]
[null,null,null,46441]
[null,null,null,46442]
[null,null,null,46461]
[null,null,null,46462]
[null,null,null,46471]
[null,null,null,46472]
[null,null,null,46473]
[null,null,null,46491]
[null,null,null,46492]
[null,null,null,46493]
[null,null,null,46494]
[null,null,null,46495]
[null,null,null,46496]
[null,null,null,46497]
[null,null,null,46498]
[null,null,null,46499]
[null,null,null,46681]
[null,null,null,46682]
[null,null,null,46691]
[null,null,null,46692]
[null,null,null,46693]
[null,null,null,46694]
[null,null,null,46695]
[null,null,null,46696]
[null,null,null,46697]
[null,null,null,46699]
[null,null,null,46711]
[null,null,null,46712]
[null,null,null,46713]
[null,null,null,46721]
[null,null,null,46722]
[null,null,null,46723]
[null,null,null,46731]
[null,null,null,46732]
[null,null,null,46733]
[null,null,null,46734]
[null,null,null,46735]
[null,null,null,46736]
[null,null,null,46737]
[null,null,null,46738]
[null,null,null,46739]
[null,null,null,46741]
[null,null,null,46742]
[null,null,null,46751]
[null,null,null,46752]
[null,null,null,46761]
[null,null,null,46762]
[null,null,null,46769]
[null,null,null,46771]
[null,null,null,46772]
[null,null,null,46779]
[null,null,null,46901]
[null,null,null,46902]
[null,null,null,47191]
[null,null,null,47192]
[null,null,null,47221]
[null,null,null,47222]
[null,null,null,47241]
[null,null,null,47242]
[null,null,null,47291]
[null,null,null,47292]
[null,null,null,47293]
[null,null,null,47299]
[null,null,null,47431]
[null,null,null,47432]
[null,null,null,47511]
[null,null,null,47512]
[null,null,null,47513]
[null,null,null,47521]
[null,null,null,47522]
[null,null,null,47523]
[null,null,null,47524]
[null,null,null,47525]
[null,null,null,47526]
[null,null,null,47527]
[null,null,null,47528]
[null,null,null,47541]
[null,null,null,47542]
[null,null,null,47543]
[null,null,null,47544]
[null,null,null,47591]
[null,null,null,47592]
[null,null,null,47593]
[null,null,null,47594]
[null,null,null,47595]
[null,null,null,47596]
[null,null,null,47597]
[null,null,null,47641]
[null,null,null,47642]
[null,null,null,47643]
[null,null,null,47644]
[null,null,null,47711]
[null,null,null,47712]
[null,null,null,47713]
[null,null,null,47714]
[null,null,null,47715]
[null,null,null,47716]
[null,null,null,47717]
[null,null,null,47718]
[null,null,null,47721]
[null,null,null,47722]
[null,null,null,47741]
[null,null,null,47742]
[null,null,null,47761]
[null,null,null,47762]
[null,null,null,47763]
[null,null,null,47781]
[null,null,null,47782]
[null,null,null,47783]
[null,null,null,47789]
[null,null,null,47791]
[null,null,null,47792]
[null,null,null,47793]
[null,null,null,47811]
[null,null,null,47819]
[null,null,null,47891]
[null,null,null,47892]
[null,null,null,47899]
[null,null,null,47911]
[null,null,null,47912]
[null,null,null,47913]
[null,null,null,47914]
[null,null,null,47915]
[null,null,null,47916]
[null,null,null,47918]
[null,null,null,47919]
[null,null,null,47991]
[null,null,null,47992]
[null,null,null,47999]
[null,null,null,49391]
[null,null,null,49392]
[null,null,null,49393]
[null,null,null,50201]
[null,null,null,50202]
[null,null,null,50401]
[null,null,null,50402]
[null,null,null,50403]
[null,null,null,52101]
[null,null,null,52102]
[null,null,null,52109]
[null,null,null,52241]
[null,null,null,52242]
[null,null,null,52291]
[null,null,null,52292]
[null,null,null,53201]
[null,null,null,53202]
[null,null,null,55101]
[null,null,null,55102]
[null,null,null,55201]
[null,null,null,55202]
[null,null,null,56101]
[null,null,null,56102]
[null,null,null,59111]
[null,null,null,59112]
[null,null,null,64191]
[null,null,null,64192]
[null,null,null,64193]
[null,null,null,64194]
[null,null,null,64301]
[null,null,null,64302]
[null,null,null,64303]
[null,null,null,64921]
[null,null,null,64922]
[null,null,null,64923]
[null,null,null,64924]
[null,null,null,65111]
[null,null,null,65112]
[null,null,null,65113]
[null,null,null,65121]
[null,null,null,65122]
[null,null,null,65301]
[null,null,null,65302]
[null,null,null,65303]
[null,null,null,65309]
[null,null,null,66191]
[null,null,null,66192]
[null,null,null,66193]
[null,null,null,66291]
[null,null,null,66292]
[null,null,null,66293]
[null,null,null,66299]
[null,null,null,68201]
[null,null,null,68202]
[null,null,null,68203]
[null,null,null,68204]
[null,null,null,69101]
[null,null,null,69102]
[null,null,null,69103]
[null,null,null,69104]
[null,null,null,69105]
[null,null,null,69201]
[null,null,null,69202]
[null,null,null,69203]
[null,null,null,69204]
[null,null,null,69209]
[null,null,null,70101]
[null,null,null,70102]
[null,null,null,70221]
[null,null,null,70222]
[null,null,null,71111]
[null,null,null,71112]
[null,null,null,71201]
[null,null,null,71202]
[null,null,null,71203]
[null,null,null,72111]
[null,null,null,72112]
[null,null,null,72113]
[null,null,null,72191]
[null,null,null,72192]
[null,null,null,72193]
[null,null,null,72199]
[null,null,null,74101]
[null,null,null,74102]
[null,null,null,74103]
[null,null,null,74201]
[null,null,null,74202]
[null,null,null,74203]
[null,null,null,77111]
[null,null,null,77112]
[null,null,null,77291]
[null,null,null,77292]
[null,null,null,77299]
[null,null,null,77391]
[null,null,null,77399]
[null,null,null,78201]
[null,null,null,78202]
[null,null,null,78203]
[null,null,null,81221]
[null,null,null,81222]
[null,null,null,81229]
[null,null,null,82991]
[null,null,null,82992]
[null,null,null,82999]
[null,null,null,84231]
[null,null,null,84232]
[null,null,null,85201]
[null,null,null,85202]
[null,null,null,85203]
[null,null,null,85311]
[null,null,null,85312]
[null,null,null,85313]
[null,null,null,85314]
[null,null,null,85321]
[null,null,null,85322]
[null,null,null,85323]
[null,null,null,85511]
[null,null,null,85519]
[null,null,null,85521]
[null,null,null,85522]
[null,null,null,85591]
[null,null,null,85592]
[null,null,null,85599]
[null,null,null,86101]
[null,null,null,86102]
[null,null,null,86103]
[null,null,null,86104]
[null,null,null,86221]
[null,null,null,86222]
[null,null,null,86231]
[null,null,null,86232]
[null,null,null,86911]
[null,null,null,86912]
[null,null,null,86913]
[null,null,null,86919]
[null,null,null,86921]
[null,null,null,86922]
[null,null,null,86923]
[null,null,null,86924]
[null,null,null,86925]
[null,null,null,86929]
[null,null,null,87301]
[null,null,null,87302]
[null,null,null,87901]
[null,null,null,87902]
[null,null,null,88101]
[null,null,null,88102]
[null,null,null,88103]
[null,null,null,88991]
[null,null,null,88992]
[null,null,null,88993]
[null,null,null,88999]
[null,null,null,90011]
[null,null,null,90012]
[null,null,null,90013]
[null,null,null,90041]
[null,null,null,90042]
[null,null,null,91011]
[null,null,null,91012]
[null,null,null,91019]
[null,null,null,91021]
[null,null,null,91022]
[null,null,null,91041]
[null,null,null,91042]
[null,null,null,92001]
[null,null,null,92009]
[null,null,null,93111]
[null,null,null,93112]
[null,null,null,93113]
[null,null,null,93119]
[null,null,null,93121]
[null,null,null,93122]
[null,null,null,93123]
[null,null,null,93124]
[null,null,null,93125]
[null,null,null,93126]
[null,null,null,93127]
[null,null,null,93128]
[null,null,null,93129]
[null,null,null,93141]
[null,null,null,93142]
[null,null,null,93143]
[null,null,null,93144]
[null,null,null,93145]
[null,null,null,93146]
[null,null,null,93149]
[null,null,null,93151]
[null,null,null,93152]
[null,null,null,93191]
[null,null,null,93192]
[null,null,null,93193]
[null,null,null,93194]
[null,null,null,93195]
[null,null,null,93196]
[null,null,null,93199]
[null,null,null,93211]
[null,null,null,93212]
[null,null,null,93291]
[null,null,null,93299]
[null,null,null,94911]
[null,null,null,94919]
[null,null,null,94991]
[null,null,null,94992]
[null,null,null,94993]
[null,null,null,94994]
[null,null,null,94995]
[null,null,null,94996]
[null,null,null,94997]
[null,null,null,96011]
[null,null,null,96012]
[null,null,null,96013]
[null,null,null,96021]
[null,null,null,96022]
[null,null,null,96031]
[null,null,null,96032]

{"sheet":"labels","index":2,"n_rows":757,"n_cols":3,"rows_kept":757,"cut":false,"hidden":false,"merged":[]}
["id","en","nl"]
[0,"Document and entity information","Informatie over de rapportage en de rechtspersoon"]
[1,"Entity information","Informatie over de rechtspersoon"]
[2,"Name of the legal entity","Naam van de rechtspersoon"]
[3,"Legal form of the legal entity","Rechtsvorm van de rechtspersoon"]
[4,"Registered office of the legal entity","Zetel van de rechtspersoon"]
[5,"Registration number at the Chamber of Commerce","Registratienummer bij de Kamer van Koophandel"]
[6,"Business names","Handelsnamen"]
[7,"Classification of the legal entity based on the legal size criteria","Classificatie van de rechtspersoon op basis van de wettelijke groottecriteria"]
[8,"SBI-code","SBI-code"]
[9,"Address of the legal entity","Adres van de rechtspersoon"]
[10,"Description of location NL","Locatieomschrijving NL"]
[11,"Street name NL","Straatnaam NL"]
[12,"House number NL","Huisnummer NL"]
[13,"House number addition","Huisnummer toevoeging"]
[14,"PO box number","Postbusnummer"]
[15,"Postal code NL","Postcode NL"]
[16,"Place of residence NL","Vestigingsplaats NL"]
[17,"Description of location abroad","Locatieomschrijving buitenland"]
[18,"Street name abroad","Straatnaam buitenland"]
[19,"House number abroad","Huisnummer buitenland"]
[20,"Postal code abroad","Postcode buitenland"]
[21,"Place of residence abroad","Vestigingsplaats buitenland"]
[22,"Name region","Regionaam"]
[23,"Country name, ISO","Landnaam, ISO"]
[24,"Document information","Informatie over de rapportage"]
[25,"Title of the document","Titel van het document"]
[26,"Start date of the period concerning the financial statement","Startdatum van de periode waarop de jaarrekening betrekking heeft"]
[27,"End date of the period concerning the financial statement","Einddatum van de periode waarop de jaarrekening betrekking heeft"]
[28,"Start date of the previous period concerning the financial statement","Startdatum van de voorgaande periode waarop de jaarrekening betrekking heeft"]
[29,"End date of the previous period concerning the financial statement","Einddatum van de voorgaande periode waarop de jaarrekening betrekking heeft"]
[30,"Reporting period different than annual (Y/N)","Rapportageperiode afwijkend van een jaar (J/N)"]
[31,"Description of the reason for deviating from an annual reporting period","Beschrijving van de reden voor het afwijken van een rapportageperiode van een jaar"]
[32,"Description of the impact on comparative figures when deviating from an annual reporting period","Beschrijving van het effect op de vergelijkende cijfers bij het afwijken van rapportageperiode van een jaar"]
[33,"Basis of preparation","Type grondslag"]
[34,"Presentation currency of the document","Rapporteringsvaluta van het document"]
[35,"Units in which the figures in the financial statements are expressed","Geldeenheid waarin de cijfers in de jaarrekening zijn uitgedrukt"]
[36,"Date of preparation of the financial statements","Datum van opmaak van de jaarrekening"]
[37,"Financial statements adopted (Y/N)","Jaarrekening vastgesteld (J/N)"]
[38,"Date of adoption of the financial statements","Datum van vaststelling van de jaarrekening"]
[39,"Resubmission of document due to substantive and insurmountable inaccuracies (Y/N)","Heraanlevering van het document op basis van inhoudelijk en onoverkomelijke onjuistheden (J/N)"]
[40,"Explanation of resubmission of the document due to substantive and insurmountable inaccuracies","Toelichting op heraanlevering van het document op basis van inhoudelijk en onoverkomelijke onjuistheden"]
[41,"Resubmission of the document due to technical and/or process-related inaccuracies (Y/N)","Heraanlevering van het document op basis van technische en/of procesmatige onjuistheden (J/N)"]
[42,"Explanation of resubmission of document due to technical and/or process-related inaccuracies","Toelichting op heraanlevering van het document op basis van technische en/of procesmatige onjuistheden"]
[43,"Email address","E-mailadres"]
[44,"Multi-annual overview","Meerjarenoverzicht"]
[45,"Report of the Supervisory Board","Verslag van de Raad van Commissarissen"]
[46,"Financial statements","Jaarrekening"]
[47,"Consolidated financial statements","Geconsolideerde jaarrekening"]
[48,"Consolidated balance sheet","Geconsolideerde balans"]
[49,"Consolidated income statement","Geconsolideerde winst-en-verliesrekening"]
[50,"Notes to the consolidated financial statements","Toelichting op de geconsolideerde jaarrekening"]
[51,"General notes","Algemene toelichting"]
[52,"General accounting principles","Algemene grondslagen voor verslaggeving"]
[53,"Accounting principles","Grondslagen"]
[54,"Balance sheet","Balans"]
[55,"Intangible assets","Immateriële vaste activa"]
[56,"Property, plant and equipment","Materiële vaste activa"]
[57,"Investment properties","Vastgoedbeleggingen"]
[58,"Financial assets","Financiële vaste activa"]
[59,"Inventories","Voorraden"]
[60,"Construction contracts","Onderhanden projecten"]
[61,"Receivables","Vorderingen"]
[62,"Securities","Effecten"]
[63,"Cash and cash equivalents","Liquide middelen"]
[64,"Equity","Eigen vermogen"]
[65,"Provisions","Voorzieningen"]
[66,"Non-current liabilities","Langlopende schulden"]
[67,"Current liabilities","Kortlopende schulden"]
[68,"Off-balance sheet commitments","Niet in de balans opgenomen verplichtingen"]
[69,"Income statement","Winst-en-verliesrekening"]
[70,"Net revenue","Netto-omzet"]
[71,"Changes in construction contracts","Wijziging in onderhanden projecten in opdracht van derden"]
[72,"Gross margin","Brutomarge"]
[73,"Other operating income","Overige bedrijfsopbrengsten"]
[74,"Expenses of employee benefits: breakdown","Lasten uit hoofde van personeelsbeloningen: uitsplitsing"]
[75,"Depreciation of property, plant and equipment and amortisation of intangible assets","Afschrijvingen op immateriële en materiële vaste activa"]
[76,"Other changes in the value of intangible assets and property, plant and equipment","Overige waardeveranderingen van immateriële en materiële vaste activa"]
[77,"Changes in the value of investment properties","Waardeveranderingen van vastgoedbeleggingen"]
[78,"Other operating expenses","Overige bedrijfskosten"]
[79,"Changes in value of financial assets and of securities","Waardeveranderingen van financiële vaste activa en van effecten"]
[80,"Financial income and expense","Financiële baten en lasten"]
[81,"Share in results of participating interests","Aandeel in resultaat van deelnemingen"]
[82,"Income tax expense","Belastingen"]
[83,"Exceptional items","Bijzondere posten"]
[84,"Earnings per share","Winst per aandeel"]
[85,"Income and expenses in relation to group companies: Breakdown","Baten en lasten uit verhouding met groepsmaatschappijen: Uitsplitsing"]
[86,"Income and expenses in relation to other affiliated companies: Breakdown","Baten en lasten uit verhouding met overige verbonden maatschappijen: Uitsplitsing"]
[87,"Other notes","Overige toelichtingen"]
[88,"Licensing agreements","Concessies"]
[89,"Average number of employees","Gemiddeld aantal werknemers"]
[90,"Financial instruments","Financiële instrumenten"]
[91,"Remuneration of managing and supervisory directors","Bezoldiging van bestuurders en commissarissen"]
[92,"Remuneration of non-supervising senior officials who already have employment with another WNT institution: Specification","Bezoldiging van niet toezichthoudende topfunctionarissen die reeds dienstbetrekking hebben bij andere WNT-instelling: Specificatie"]
[93,"Share based payments","Op aandelen gebaseerde betalingen"]
[94,"Rights granted not yet exercised","Nog niet uitgeoefende verleende rechten"]
[95,"Loans, advances and guarantees on behalf of managing and supervisory directors","Leningen, voorschotten en garanties ten behoeve van bestuurders en commissarissen"]
[96,"Segment information","Gesegmenteerde informatie"]
[97,"Auditors fees","Accountantshonoraria"]
[98,"Subsequent events","Gebeurtenissen na balansdatum"]
[99,"Company financial statements","Enkelvoudige jaarrekening"]
[100,"Current","Huidig"]
[101,"Separate","Enkelvoudig"]
[102,"Previous","Voorgaand"]
[103,"Balance sheet before or after appropriation of results","Balans voor of na resultaatbestemming"]
[104,"Total of non-current assets","Totaal van vaste activa"]
[105,"Construction contracts (assets)","Onderhanden projecten (activa)"]
[106,"Total of current assets","Totaal van vlottende activa"]
[107,"Total of assets","Totaal van activa"]
[108,"Share capital paid called up","Gestort en opgevraagd aandelenkapitaal"]
[109,"Share premium","Agio"]
[110,"Revaluation reserves","Herwaarderingsreserves"]
[111,"Other legal reserves","Andere wettelijke reserves"]
[112,"Statutory reserves","Statutaire reserves"]
[113,"Fiscal reinvestment reserve","Fiscale herinvesteringsreserve"]
[114,"Other reserves","Overige reserves"]
[115,"Other fiscal reserves","Overige fiscale reserves"]
[116,"Result after taxes for the year","Resultaat na belastingen van het boekjaar"]
[117,"Undistributed profit","Niet verdeelde winsten"]
[118,"Total of equity","Totaal van eigen vermogen"]
[119,"Total of equity and liabilities","Totaal van passiva"]
[120,"Notes to the financial statements","Toelichting op de jaarrekening"]
[121,"Notes to the financial statements - General notes","Toelichting op de jaarrekening - Algemene toelichting"]
[122,"Description of the most important activities of the entity","Beschrijving van de belangrijkste activiteiten van de rechtspersoon"]
[123,"Description of the location of the actual activities","Beschrijving van de locatie van de feitelijke activiteiten"]
[124,"Notes to the financial statements - General notes: Going concern","Toelichting op de jaarrekening - Algemene toelichting: Continuïteit"]
[125,"Disclosure of going concern","Informatieverschaffing over continuïteit"]
[126,"Description of the uncertainties relating to the ability of the entity to continue as going concern","Beschrijving van de ernstige onzekerheden omtrent de continuïteit van de organisatie"]
[127,"Description of the basis of preparation of the financial statements when not going concern basis","Beschrijving van de grondslag van waardering wanneer dit niet op continuïteitsbasis is"]
[128,"Description of the effect of not applying going concern basis on equity and results","Beschrijving van de invloed van het niet waarderen op continuïteitsbasis op het vermogen en resultaat"]
[129,"Notes to the financial statements - General notes: Group structure","Toelichting op de jaarrekening - Algemene toelichting: Groepsverhoudingen"]
[130,"Disclosure of group structure","Informatieverschaffing over groepsverhoudingen"]
[131,"Name of the entity which prepares the consolidated financial statements of the group to which the legal entity belongs","Naam van de maatschappij die de geconsolideerde jaarrekening opstelt van het groepsdeel waartoe de rechtspersoon behoort"]
[132,"Location of the entity which prepares the consolidated financial statements of the group to which the legal entity belongs","Woonplaats van de maatschappij die de geconsolideerde jaarrekening opstelt van het groepsdeel waartoe de rechtspersoon behoort"]
[133,"Notes to the financial statements - General notes: Estimates","Toelichting op de jaarrekening - Algemene toelichting: Schattingen"]
[134,"Disclosure of estimates","Informatieverschaffing over schattingen"]
[135,"Notes to the financial statements - General notes: Consolidation","Toelichting op de jaarrekening - Algemene toelichting: Consolidatie"]
[136,"Disclosure of consolidation","Informatieverschaffing over consolidatie"]
[137,"Description of the exemption of consolidation in connection with the application of Section 2:408","Beschrijving van de vrijstelling van consolidatie in verband met toepassing van artikel 2:408"]
[138,"Description of the reason for not consolidating a subsidiary","Beschrijving van de reden voor het niet meeconsolideren van een dochtermaatschappij"]
[139,"Description of application and reason for application consolidation exemption for venture capital investment company","Beschrijving van toepassing en reden van toepassing consolidatievrijstelling voor participatiemaatschappij of beleggingsmaatschappij"]
[140,"Notification of legal entity for which legal entity issued a liability claim in accordance with article 403","Vermelding van de rechtspersonen waarvoor de rechtspersoon een aansprakelijkstelling overeenkomstig Art. 2:403 heeft afgegeven"]
[141,"Notes to the financial statements - General notes: Mergers and acquisitions","Toelichting op de jaarrekening - Algemene toelichting: Fusies en overnames"]
[142,"Disclosure of mergers and acquisitions","Informatieverschaffing over fusies en overnames"]
[143,"Notes to the financial statements - General notes: Business activities that are not continued sustainably","Toelichting op de jaarrekening - Algemene toelichting: Bedrijfsactiviteiten die niet duurzaam worden voortgezet"]
[144,"Disclosure of discontinued business activities that are not continued sustainably","Informatieverschaffing over beëindiging van bedrijfsactiviteiten"]
[145,"Description of the result before taxes that is achieved with the sale of assets of a business activity that is not continued on a sustainable basis","Beschrijving van het resultaat voor belastingen dat wordt behaald met de verkoop van activa van een bedrijfsactiviteit die niet duurzaam wordt voortgezet"]
[146,"Description of the nature of the initial event of business activities that are not continued sustainablys","Beschrijving van de aard van de initiële gebeurtenis bij de beëindiging van bedijfsactiviteiten"]
[147,"Description of the time of the initial event of business activities that are not continued sustainably","Beschrijving van het tijdstip van de initiële gebeurtenis bij de beëindiging van bedijfsactiviteiten"]
[148,"Description of the time or time period when the discontinuation of operations will be finalised","Beschrijving van het tijdstip waarop of de periode waarin de beëindiging van bedijfsactiviteiten zal zijn afgerond"]
[149,"Expected time of receipt of net proceeds from the sale of assets for which the legal person has entered into a binding agreement for a business activities that are not continued sustainably","Verwachte tijdstip van ontvangst van nettoverkoopbrengst van activa waarvoor de rechtspersoon een bindende overeenkomst is aangegaan van een bedrijfsactiviteit die niet duurzaam wordt voortgezet"]
[150,"Expected time of receipt of net proceeds from the sale of debt capital for which the legal person has entered into a binding agreement for a business activities that are not continued sustainably","Verwachte tijdstip van ontvangst van nettoverkoopbrengst van vreemd vermogen waarvoor de rechtspersoon een bindende overeenkomst is aangegaan van een bedrijfsactiviteit die niet duurzaam wordt voortgezet"]
[151,"Description of the result before taxes that is achieved with the settlement of items of the loan capital of a business activity that is not continued sustainably","Beschrijving van het resultaat voor belastingen dat wordt behaald met de afwikkeling van posten van het vreemd vermogen van een bedrijfsactiviteit die niet duurzaam wordt voortgezet"]
[152,"Notes to the financial statements - General accounting principles","Toelichting op de jaarrekening - Algemene grondslagen voor verslaggeving"]
[153,"Description of the accounting standards used to prepare the financial statements","Beschrijving van de standaarden op basis waarvan de jaarrekening is opgesteld"]
[154,"Description of the standards applied earlier than the latest entry dates according to the new Guidelines","Beschrijving van de standaarden die eerder worden toegepast dan de uiterste ingangsdata volgens de nieuwe Richtlijnen"]
[155,"Explanation of comparability with the previous year","Toelichting inzake de vergelijkbaarheid met het voorgaande jaar"]
[156,"Disclosure of fair value information when the report is prepared on historical cost basis","Informatieverschaffing over de actuele waarde bij toepassing van de historische prijsgrondslag"]
[157,"Disclosure of the differences in valuation between fiscal and commercial accounting principles","Informatieverschaffing over de verschillen tussen de waardering volgens fiscale en commerciële grondslagen"]
[158,"Description of the extent to which indirect costs have been taken into account when determining the manufacturing price","Beschrijving van de mate waarin bij de bepaling van de vervaardigingsprijs rekening is gehouden met indirecte kosten"]
[159,"Description of the functional currency","Beschrijving van de functionele valuta"]
[160,"Description of the reason why the presentation currency is different from the functional currency","Beschrijving van de reden waarom de presentatievaluta afwijkt van de functionele valuta"]
[161,"Description of the reason for changing the presentation currency","Beschrijving van de reden voor het wijzigen van de presentatievaluta"]
[162,"Disclosure of deviation in prior period figures due to a revision","Informatieverschaffing over afwijkingen in bedragen van het voorgaande boekjaar als gevolg van een herziening"]
[163,"Notes to the financial statements - General accounting principles: Changes in accounting estimates","Toelichting op de jaarrekening - Algemene grondslagen voor verslaggeving: Schattingswijzigingen"]
[164,"Notes to the types and quantitative effects of changes in accounting estimates if of importance in the reporting period or subsequent periods","Toelichting op de aard en de kwantitatieve effecten van een schattingswijziging indien deze van belang is voor de verslagperiode of toekomstige perioden"]
[165,"Notes to the financial statements - General accounting principles: Change in accounting estimates: Specification","Toelichting op de jaarrekening - Algemene grondslagen voor verslaggeving: Schattingswijzigingen: Specificatie"]
[166,"Change in accounting estimates","Schattingswijziging"]
[167,"Description Change in accounting estimates","Omschrijving Schattingswijziging"]
[168,"Description of the change in accounting estimates","Beschrijving van de schattingswijziging"]
[169,"Description of the change in accounting estimates on the current period","Beschrijving van het effect van de schattingswijziging op de huidige periode"]
[170,"Presentation order","Presentatievolgorde"]
[171,"Notes to the financial statements - General accounting principles: Changes in accounting policies","Toelichting op de jaarrekening - Algemene grondslagen voor verslaggeving: Stelselwijzigingen"]
[172,"Disclosure of changes in accounting policies","Informatieverschaffing over stelselwijzigingen"]
[173,"Notes to the financial statements - General accounting principles: Change in accounting policies: Specification","Toelichting op de jaarrekening - Algemene grondslagen voor verslaggeving: Stelselwijzigingen: Specificatie"]
[174,"Change in accounting policies","Stelselwijziging"]
[175,"Description Change in accounting policies","Omschrijving Stelselwijziging"]
[176,"Description of the reason for change in accounting policies","Beschrijving van de reden tot het doorvoeren van een stelselwijziging"]
[177,"Description of the method of processing the effects of the change in accounting policies","Beschrijving van de wijze van verwerken van de effecten van de stelselwijziging"]
[178,"Description of the meaning of the system change for capital and result","Beschrijving van de betekenis van de stelselwijziging voor vermogen en resultaat"]
[179,"Description of the effect of the change in accounting policies on individual items","Beschrijving van de betekenis van de stelselwijziging op individuele posten"]
[180,"Notes to the financial statements - General accounting principles: Prior period errors","Toelichting op de jaarrekening - Algemene grondslagen voor verslaggeving: Foutherstel"]
[181,"Disclosure of prior period errors","Informatieverschaffing over foutherstel"]
[182,"Notes to the financial statements - General accounting principles: Prior period errors: Specification","Toelichting op de jaarrekening - Algemene grondslagen voor verslaggeving: Foutherstel: Specificatie"]
[183,"Prior period errors","Foutenherstel"]
[184,"Description Prior period errors","Omschrijving Foutenherstel"]
[185,"Description of nature and extent of the material error","Beschrijving van de aard en omvang van de materiële fout"]
[186,"Description of the effect of the correction of the material error","Beschrijving van het effect van het herstel van de materiële fout"]
[187,"Notes to the financial statements - General accounting principles: Foreign currency translation","Toelichting op de jaarrekening - Algemene grondslagen voor verslaggeving: Omrekening van vreemde valuta"]
[188,"Policy of conversion of amounts denominated in foreign currency","Grondslag van omrekening van in vreemde valuta luidende bedragen"]
[189,"Basis of Conversion and Processing of Exchange Rate Differences Relating to Foreign Currency Transactions for the Balance Sheet","Grondslag van de wijze van omrekening en de verwerking van valutakoersverschillen met betrekking tot transacties in vreemde valuta voor de balans"]
[190,"Policy of translation for hyperinflation in business operations abroad","Grondslag van omrekening inzake hyperinflatie bij bedrijfsuitoefening in het buitenland"]
[191,"Policy of foreign currency translation and the processing of foreign currency translation differences in foreign currency transactions","Grondslagen voor de wijze van omrekening en de verwerking van valutakoersverschillen met betrekking tot transacties in vreemde valuta"]
[192,"Policy of foreign currency translation and the processing of foreign currency translation differences with regard to business activities abroad","Grondslagen voor de wijze van omrekening en de verwerking van valutakoersverschillen met betrekking tot bedrijfsuitoefening in het buitenland"]
[193,"Accounting policies for the calculation and processing of exchange rate differences relating to business operations abroad for the balance sheet","Grondslagen van de wijze van omrekening en de verwerking van valutakoersverschillen met betrekking tot bedrijfsuitoefening in het buitenland voor de balans"]
[194,"Principles of the method of calculating and accounting for foreign exchange differences related to the conduct of business abroad for the profit and loss account","Grondslagen van de wijze van omrekening en de verwerking van valutakoersverschillen met betrekking tot bedrijfsuitoefening in het buitenland voor de winst-en-verliesrekening"]
[195,"Accounting policies for the translation and treatment of exchange rate differences relating to goodwill and the fair value adjustment for the acquisition of a business abroad for the balance sheet","Grondslagen van de wijze van omrekening en de verwerking van valutakoersverschillen met betrekking tot goodwill en de aanpassing naar reële waarde voor de verwerving van een bedrijfsuitoefening in het buitenland voor de balans"]
[196,"Accounting policies for the translation and treatment of exchange rate differences relating to goodwill and the fair value adjustment for the acquisition of a business abroad for the profit and loss account","Grondslagen voor de wijze van omrekening en de verwerking van valutakoersverschillen met betrekking tot goodwill en de aanpassing naar reële waarde voor de verwerving van een bedrijfsuitoefening in het buitenland voor de winst-en-verliesrekening"]
[197,"Principles for the method of conversion and the treatment of exchange rate differences relating to goodwill and the adjustment to fair value for the acquisition of a business activity abroad","Grondslagen voor de wijze van omrekening en de verwerking van valutakoersverschillen met betrekking tot goodwill en de aanpassing naar reële waarde voor de verwerving van een bedrijfsuitoefening in het buitenland"]
[198,"Notes to the financial statements - General accounting principles: Leases","Toelichting op de jaarrekening - Algemene grondslagen voor verslaggeving: Leases"]
[199,"Policy of leases","Grondslag van leases"]
[200,"Policy of finance leases","Grondslag van financiële leases"]
[201,"Policy of operating leases","Grondslag van operationele leases"]
[202,"Notes to the financial statements - General accounting principles: Share based payments","Toelichting op de jaarrekening - Algemene grondslagen voor verslaggeving: Op aandelen gebaseerde betalingen"]
[203,"Policy of share based payments","Grondslag van op aandelen gebaseerde betalingen"]
[204,"Notes to the financial statements - General accounting principles: Exceptional items","Toelichting op de jaarrekening - Algemene grondslagen voor verslaggeving: Bijzondere posten"]
[205,"Policy of exceptional items","Grondslag van bijzondere posten"]
[206,"Notes to the financial statements - General accounting principles: Pension arrangements","Toelichting op de jaarrekening - Algemene grondslagen voor verslaggeving: Pensioenregelingen"]
[207,"Policy of pension arrangements","Grondslag van pensioenregelingen"]
[208,"Notes to the financial statements - General accounting principles: Financial instruments","Toelichting op de jaarrekening - Algemene grondslagen voor verslaggeving: Financiële instrumenten"]
[209,"Policy of financial instruments","Grondslag van financiële instrumenten"]
[210,"Policy of current value of financial instruments","Grondslag van actuele waarde van financiële instrumenten"]
[211,"Notes to the financial statements - Accounting principles applied to the valuation of assets and liabilities","Toelichting op de jaarrekening - Grondslagen voor de waardering van activa en passiva"]
[212,"Policy of intangible assets","Grondslag van immateriële vaste activa"]
[213,"Policy of impairment of intangible assets","Grondslag van bijzondere waardeverminderingen van immateriële vaste activa"]
[214,"Policy of reversal of impairment of intangible assets","Grondslag van terugneming van bijzondere waardeverminderingen van immateriële vaste activa"]
[215,"Policy of costs relating to the incorporation and issuance of shares","Grondslag van kosten die verband houden met de oprichting en met de uitgifte van aandelen"]
[216,"Policy of development costs","Grondslag van kosten van ontwikkeling"]
[217,"Policy of costs of acquisition of patents, trademarks and other rights","Grondslag van kosten van verwerving ter zake van concessies, vergunningen en rechten van intellectuele eigendom"]
[218,"Policy of costs of goodwill acquired from third party","Grondslag van kosten van goodwill die van derden is verkregen"]
[219,"Policy of prepayments of intangible assets","Grondslag van vooruitbetalingen op immateriële vaste activa"]
[220,"Policy of intangible assets other","Grondslag van overige immateriële vaste activa"]
[221,"Policy of property, plant and equipment","Grondslag van materiële vaste activa"]
[222,"Policy of impairment of property, plant and equipment","Grondslag van bijzondere waardeverminderingen van materiële vaste activa"]
[223,"Policy of reversal of impairment of property, plant and equipment","Grondslag van terugneming van bijzondere waardeverminderingen van materiële vaste activa"]
[224,"Policy of land and buildings","Grondslag van bedrijfsgebouwen en -terreinen"]
[225,"Policy of machinery","Grondslag van machines en installaties"]
[226,"Policy of other tangible assets","Grondslag van andere vaste bedrijfsmiddelen"]
[227,"Policy of Property, plant and equipment in progress and prepayments of property, plant and equipment","Grondslag van materiële vaste bedrijfsactiva in uitvoering en vooruitbetalingen op materiële vaste activa"]
[228,"Policy of property, plant and equipment not used in the production process","Grondslag van niet aan het productieproces dienstbare materiële vaste activa"]
[229,"Policy of processing of repair and maintenance costs","Grondslag van de verwerking van kosten van herstel en groot onderhoud"]
[230,"Policy of investment properties","Grondslag van vastgoedbeleggingen"]
[231,"Policy of impairment of investment properties","Grondslag van bijzondere waardeverminderingen van vastgoedbeleggingen"]
[232,"Policy of real estate in development","Grondslag van vastgoed in ontwikkeling"]
[233,"Policy of financial assets","Grondslag van financiële vaste activa"]
[234,"Policy of impairment of financial assets","Grondslag van bijzondere waardeverminderingen van financiële vaste activa"]
[235,"Policy of reversal of impairment of financial assets","Grondslag van terugneming van bijzondere waardeverminderingen van financiële vaste activa"]
[236,"Policy of shares, certificates of shares and other types of participating interests in group companies","Grondslag van aandelen, certificaten van aandelen en andere vormen van deelneming in groepsmaatschappijen"]
[237,"Policy of investments in participating interests in other affiliated companies","Grondslag van deelnemingen in overige verbonden maatschappijen"]
[238,"Policy of receivables from group companies","Grondslag van vorderingen op groepsmaatschappijen"]
[239,"Policy of receivables from other affiliated companies","Grondslag van vorderingen op overige verbonden maatschappijen"]
[240,"Policy of other investments in participating interests","Grondslag van andere deelnemingen"]
[241,"Policy of receivables from other legal entities and companies with a participating interest in the legal entity or from participating interests of the legal entity","Grondslag van vorderingen op andere rechtspersonen en vennootschappen die een deelneming hebben in de rechtspersoon of waarin de rechtspersoon een deelneming heeft"]
[242,"Policy of receivables from loans and advances to participants or registered shareholders","Grondslag van vorderingen uit hoofde van leningen en voorschotten aan leden of houders van aandelen op naam"]
[243,"Policy of other securities","Grondslag van overige effecten"]
[244,"Policy of other receivables","Grondslag van overige vorderingen"]
[245,"Policy of deferred tax assets","Grondslag van latente belastingvorderingen"]
[246,"Policy of other financial assets","Grondslag van overige financiële vaste activa"]
[247,"Policy of non-current assets","Grondslag van vaste activa"]
[248,"Policy of impairment of non-current assets","Grondslag van bijzondere waardeverminderingen van vaste activa"]
[249,"Policy of reversal of impairment of non-current assets","Grondslag van terugneming van bijzondere waardeverminderingen van vaste activa"]
[250,"Policy of changes in value of non-current securities and investments in participating interests (debit)","Grondslag van waardeveranderingen van de tot de vaste activa behorende effecten en deelnemingen (debet)"]
[251,"Policy of inventories","Grondslag van voorraden"]
[252,"Policy of the realisable value of inventories","Grondslag van de opbrengstwaarde van voorraden"]
[253,"Policy of raw materials and consumables","Grondslag van grond- en hulpstoffen"]
[254,"Policy of work in progress","Grondslag van onderhanden werk"]
[255,"Policy of finished and trade goods","Grondslag van gereed product en handelsgoederen"]
[256,"Policy of prepayments of inventories","Grondslag van vooruitbetalingen op voorraden"]
[257,"Basis of the net realizable value of agricultural stocks","Grondslag van de opbrengstwaarde van agrarische voorraden"]
[258,"Policy of construction contracts","Grondslag van onderhanden projecten"]
[259,"Policy of receivables","Grondslag van vorderingen"]
[260,"Policy of trade receivables","Grondslag van vorderingen op handelsdebiteuren"]
[261,"Policy of called-up contributions for issued share capital","Grondslag van opgevraagde stortingen van geplaatst kapitaal"]
[262,"Policy of pension receivables","Grondslag van pensioenvordering"]
[263,"Policy of tax receivables","Grondslag van belastingvorderingen"]
[264,"Policy of prepayments and accrued income","Grondslag van overlopende activa"]
[265,"Policy of current securities","Grondslag van kortlopende effecten"]
[266,"Policy of cash and cash equivalents","Grondslag van liquide middelen"]
[267,"Policy of current assets","Grondslag van vlottende activa"]
[268,"Policy of equity","Grondslag van eigen vermogen"]
[269,"Policy of share capital paid called up","Grondslag van gestort en opgevraagd aandelenkapitaal"]
[270,"Policy of share premium","Grondslag van agio"]
[271,"Policy of revaluation reserves","Grondslag van herwaarderingsreserves"]
[272,"Policy of other legal reserves, distinguished by their nature","Grondslag van andere wettelijke reserves, onderscheiden naar hun aard"]
[273,"Policy of statutory reserves","Grondslag van statutaire reserves"]
[274,"Policy of fiscal reinvestment reserve","Grondslag van fiscale herinvesteringsreserve"]
[275,"Policy of other reserves","Grondslag van overige reserves"]
[276,"Policy of other fiscal reserves","Grondslag van overige fiscale reserves"]
[277,"Policy of result after taxes for the year","Grondslag van resultaat na belastingen van het boekjaar"]
[278,"Policy of undistributed profit","Grondslag van niet verdeelde winsten"]
[279,"Policy of provisions","Grondslag van voorzieningen"]
[280,"Policy of provision for repair costs","Grondslag van voorziening voor herstelkosten"]
[281,"Policy of provision for tax liabilities","Grondslag van voorzieningen voor belastingverplichtingen"]
[282,"Policy of provisions for pension obligations","Grondslag van voorzieningen voor pensioenverplichtingen"]
[283,"Policy of environmental provision","Grondslag van voorziening voor opruiming van aanwezige milieuvervuiling"]
[284,"Policy of provision for legal proceedings","Grondslag van voorziening uit hoofde van claims, geschillen en rechtsgedingen"]
[285,"Policy of provision for major maintenance","Grondslag van voorziening voor groot onderhoud"]
[286,"Policy of provision for disposal obligations","Grondslag van voorziening voor verwijderingsverplichtingen"]
[287,"Policy of provision for onerous contracts","Grondslag van voorziening voor verlieslatende contracten"]
[288,"Policy of restructuring provision","Grondslag van voorziening in verband met reorganisaties"]
[289,"Policy of provision relating to participating interest","Grondslag van voorziening in verband met deelnemingen"]
[290,"Policy of deferred tax liabilities","Grondslag van latente belastingverplichtingen"]
[291,"Policy of warranty provision","Grondslag van garantievoorziening"]
[292,"Policy of provision for jubilee benefits","Grondslag van voorziening voor jubileumuitkeringen"]
[293,"Policy of provision for insurance of disability risks","Grondslag van voorziening voor verzekering van arbeidsongeschiktheidsrisico's"]
[294,"Policy of provision for obligations due to illness or disability","Grondslag van voorziening voor verplichtingen uit hoofde van ziekte of arbeidsongeschiktheid"]
[295,"Policy of provision of employee benefits","Grondslag van voorziening uit hoofde van personeelsbeloningen"]
[296,"Policy of other provisions","Grondslag van overige voorzieningen"]
[297,"Policy of non-current liabilities","Grondslag van langlopende schulden"]
[298,"Policy of subordinated liabilities","Grondslag van achtergestelde schulden"]
[299,"Policy of convertible borrowings","Grondslag van converteerbare leningen"]
[300,"Policy of debentures, mortgage bonds and other loans","Grondslag van obligatieleningen, pandbrieven en andere leningen"]
[301,"Policy of finance lease liabilities","Grondslag van financiële lease verplichtingen"]
[302,"Policy of payables to banks","Grondslag van schulden aan banken"]
[303,"Policy of advances received on orders not yet deducted for asset items","Grondslag van ontvangen vooruitbetalingen op bestellingen voor zover niet reeds op actiefposten in mindering gebracht"]
[304,"Policy of trade payables","Grondslag van schulden aan leveranciers en handelskredieten"]
[305,"Policy of cheques and bills of exchange payables","Grondslag van te betalen wissels en cheques"]
[306,"Policy of payables to group companies","Grondslag van schulden aan groepsmaatschappijen"]
[307,"Policy of payables to other affiliated companies","Grondslag van schulden aan overige verbonden partijen"]
[308,"Policy of payables to other legal entities and companies with a participating interest in the legal entity or to participating interests of the legal entity","Grondslag van schulden aan rechtspersonen en vennootschappen die een deelneming hebben in de rechtspersoon of waarin de rechtspersoon een deelneming heeft"]
[309,"Policy of payables relating to income taxes","Grondslag van schulden uit hoofde van belastingen naar de winst"]
[310,"Policy of payables relating to taxes and social security contributions","Grondslag van schulden ter zake van belastingen en premies van sociale verzekeringen"]
[311,"Policy of pension related payables","Grondslag van schulden ter zake van pensioenen"]
[312,"Policy of old-age obligation","Grondslag van oudedagsverplichting"]
[313,"Policy of tax payables","Grondslag van belastingverplichtingen"]
[314,"Policy of negative goodwill","Grondslag van negatieve goodwill"]
[315,"Policy of other payables","Grondslag van overige schulden"]
[316,"Policy of accruals and deferred income","Grondslag van overlopende passiva"]
[317,"Policy of current liabilities","Grondslag van kortlopende schulden"]
[318,"Policy of repayment obligations of non-current borrowings","Grondslag van aflossingsverplichtingen van langlopende leningen"]
[319,"Policy of debts due to vacation days","Grondslag van schulden uit hoofde van vakantiedagen"]
[320,"Policy of debts due to holiday pay","Grondslag van schulden uit hoofde van vakantiegeld"]
[321,"Policy of dividend to be distributed to holders of preference shares","Grondslag van uit te keren dividend aan houders van preferente aandelen"]
[322,"Notes to the financial statements - Accounting principles for the determination of the result","Toelichting op de jaarrekening - Grondslagen voor de bepaling van het resultaat"]
[323,"Accounting principles for determining the result","Grondslagen voor de bepaling van het resultaat"]
[324,"Policy of revenue recognition","Grondslag van omzetverantwoording"]
[325,"Policy of gross operating result","Grondslag van bruto-bedrijfsresultaat"]
[326,"Policy of selling expenses","Grondslag van verkoopkosten"]
[327,"Policy of general and administrative expenses","Grondslag van algemene beheerskosten"]
[328,"Policy of sum of expenses","Grondslag van som der kosten"]
[329,"Policy of government subsidies","Grondslag van overheidssubsidies"]
[330,"Policy of expenses of employee benefits","Grondslag van lasten uit hoofde van personeelsbeloningen"]
[331,"Policy of wages","Grondslag van lonen"]
[332,"Policy of social security contributions","Grondslag van sociale lasten"]
[333,"Applied policy of pension costs","Grondslag van pensioenlasten"]
[334,"Policy of other expenses of employee benefits","Grondslag van overige lasten uit hoofde van personeelsbeloningen"]
[335,"Basis for processing the compensation received under the NOW scheme","Grondslag van verwerking van de ontvangen tegemoetkoming uit hoofde van de NOW-regeling"]
[336,"Policy of amortisation of intangible assets and depreciation of property, plant and equipment","Grondslag van afschrijvingen op immateriële en materiële vaste activa"]
[337,"Policy of amortisation of intangible assets","Grondslag van afschrijvingen op immateriële vaste activa"]
[338,"Policy of depreciation of property, plant and equipment","Grondslag van afschrijvingen op materiële vaste activa"]
[339,"Policy of changes in the value of intangible asPolicy of sets and property, plant and equipment","Grondslag van waardeveranderingen van immateriële en materiële vaste activa"]
[340,"Policy of changes in the value of intangible assets","Grondslag van waardeveranderingen van immateriële vaste activa"]
[341,"Policy of changes in the fair value of real estate investments","Grondslag van wijziging in de reële waarde van vastgoedbeleggingen"]
[342,"Policy of changes in the value of financial assets and of securities that are part of the current assets","Grondslag van wijzigingen in de waarde van de financiële vaste activa en van de effecten die tot de vlottende activa behoren"]
[343,"Policy of decrease in the value of current assets, provided they surpass the regular decrease in value","Grondslag van waardeverminderingen van vlottende activa, voor zover zij de bij de rechtspersoon gebruikelijke waardeverminderingen overtreffen"]
[344,"Policy of other operating expenses","Grondslag van overige bedrijfskosten"]
[345,"Policy of operating result","Grondslag van bedrijfsresultaat"]
[346,"Policy of released from revaluation reserve","Grondslag van uit herwaarderingsreserve vrijgevallen bedragen"]
[347,"Policy of financial income and expenses","Grondslag van financiële baten en lasten"]
[348,"Policy of income of securities and receivables, that are part of non-current assets","Grondslag van opbrengsten van andere effecten en vorderingen, die tot de vaste activa behoren"]
[349,"Policy of other interest income and related income","Grondslag van overige rentebaten en soortgelijke opbrengsten"]
[350,"Policy of interest expenses and related expenses","Grondslag van rentelasten en soortgelijke kosten"]
[351,"Policy of result before tax","Grondslag van resultaat voor belastingen"]
[352,"Policy of income tax expense","Grondslag van belastingen over de winst of het verlies"]
[353,"Policy of share in results of participating interests","Grondslag van aandeel in resultaat van ondernemingen waarin wordt deelgenomen"]
[354,"Policy of result after tax","Grondslag van resultaat na belastingen"]
[355,"Notes to the financial statements - Intangible assets: Breakdown","Toelichting op de jaarrekening - Immateriële vaste activa: Uitsplitsing"]
[356,"Costs relating to the incorporation and issuance of shares","Kosten die verband houden met de oprichting en met de uitgifte van aandelen"]
[357,"Other intangible assets","Overige immateriële vaste activa"]
[358,"Total of intangible assets","Totaal van immateriële vaste activa"]
[359,"Notes to the financial statements - Intangible assets","Toelichting op de jaarrekening - Immateriële vaste activa"]
[360,"Disclosure of intangible assets","Informatieverschaffing over immateriële vaste activa"]
[361,"Disclosure of the current value of intangible assets","Informatieverschaffing over de actuele waarde van immateriële vaste activa"]
[362,"Description of intangible assets with limited ownership","Beschrijving van immateriële vaste activa met beperkte eigendomsrechten"]
[363,"Description of intangible assets put up as collateral for debts","Beschrijving van immateriële vaste activa ter zekerheid gesteld voor schulden"]
[364,"Description of the impairment of intangible assets","Beschrijving van bijzondere waardeverminderingen van immateriële vaste activa"]
[365,"Disclosure of costs of goodwill acquired from third party","Informatieverschaffing over kosten van goodwill die van derden is verkregen"]
[366,"Description of the commitments relating to acquisitions of intangible assets","Beschrijving van verplichtingen uit hoofde van verwerving van immateriële vaste activa"]
[367,"Description of the capitalised interest on intangible assets during the period","Beschrijving van de geactiveerde rente op immateriële vaste activa gedurende de verslagperiode"]
[368,"Description of the reason and factors that played a significant part in determining that the amortisation term of intangible assets exceeds twenty years","Beschrijving van de reden en factoren die een significante rol hebben gespeeld bij de bepaling dat de afschrijvingstermijn van immateriële vaste activa langer dan twintig jaar bedraagt"]
[369,"Description of an individual intangible asset of importance","Beschrijving van een individueel immaterieel vast actief dat van groot belang is voor de rechtspersoon"]
[370,"Notes to the financial statements - Intangible assets: Other amounts: Breakdown","Toelichting op de jaarrekening - Immateriële vaste activa: Overige bedragen: Uitsplitsing"]
[371,"Intangible assets with limited ownership","Immateriële vaste activa met beperkte eigendomsrechten"]
[372,"Intangible assets put up as collateral for debts","Immateriële vaste activa ter zekerheid gesteld voor schulden"]
[373,"Notes to the financial statements - Intangible assets: Accumulated revaluations","Toelichting op de jaarrekening - Immateriële vaste activa: Cumulatieve herwaarderingen"]
[374,"Sum of the revaluations related to intangible assets","Som der herwaarderingen die betrekking hebben op de immateriële vaste activa"]
[375,"Notes to the financial statements - Property, plant & equipment","Toelichting op de jaarrekening - Materiële vaste activa"]
[376,"Disclosure of property, plant and equipment","Informatieverschaffing over materiële vaste activa"]
[377,"Disclosure of the current value of property, plant and equipment","Informatieverschaffing over de actuele waarde van materiële vaste activa"]
[378,"Description of property, plant and equipment of which the legal entity does not have legal ownership","Beschrijving van materiële vaste activa waarvan de rechtspersoon niet de juridische eigendom bezit"]
[379,"Description of property, plant and equipment serving as collateral for commitments","Beschrijving van materiële vaste activa die als zekerheid dienen voor verplichtingen"]
[380,"Description of the impairment of property, plant and equipment","Beschrijving van bijzondere waardeverminderingen van materiële vaste activa"]
[381,"Description of the capitalised interest on property, plant and equipment during the period","Beschrijving van de geactiveerde rente op materiële vaste activa gedurende de verslagperiode"]
[382,"Disclosure of finance lease of property, plant and equipment","Informatieverschaffing over de financiële lease van materiële vaste activa"]
[383,"Description of the nature and extent of other important movements of property, plant and equipment","Beschrijving van de aard en omvang van overige mutaties van de materiële vaste activa die van belang zijn"]
[384,"Disclosure of property plant equipment of the deduction of the reinvestment reserve from the acquisition or production costs of an asset","Informatieverschaffing over materiële vaste activa van de fiscale herinvesteringsreserve in mindering gebracht op de aanschaffings- of voortbrengingskosten van een bedrijfsmiddel"]
[385,"Description of the application of the transitional provision regarding the change in accounting policy from current value to historical cost price","Beschrijving van de toepassing van de overgangsbepaling m.b.t. de stelselwijziging van waardering tegen actuele waarde naar historische kostprijs"]
[386,"Description of the size of the unrealized revaluation regarding the change in accounting policy from current value to historical cost price","Beschrijving van de omvang van de nog niet gerealiseerde herwaardering m.b.t. de stelselwijziging van waardering tegen actuele waarde naar historische kostprijs"]
[387,"Notes to the financial statements - Property, plant and equipment: Accumulated revaluations","Toelichting op de jaarrekening - Materiële vaste activa: Cumulatieve herwaarderingen"]
[388,"Sum of the revaluations concerning property, plant and equipment","Som der herwaarderingen die betrekking hebben op de materiële vaste activa"]
[389,"Notes to the financial statements - Investment properties","Toelichting op de jaarrekening - Vastgoedbeleggingen"]
[390,"Disclosure of investment properties","Informatieverschaffing over vastgoedbeleggingen"]
[391,"Disclosure of fair value of investment properties","Informatieverschaffing over de reële waarde van vastgoedbeleggingen"]
[392,"Description of restrictions with regard to the applicability of investment properties, as well as the extent of this restriction","Beschrijving van beperkingen met betrekking tot de aanwendbaarheid van vastgoedbeleggingen, alsmede de omvang van deze beperking"]
[393,"Description of limitations with regard to the collectability of revenues, as well as the extent of this restriction","Beschrijving van beperkingen met betrekking tot de inbaarheid van opbrengsten, alsmede de omvang van deze beperking"]
[394,"Description of the impairment of investment properties","Beschrijving van bijzondere waardeverminderingen van vastgoedbeleggingen"]
[395,"Description of contractual obligations to purchase, construct or develop investment properties or for repairs, maintenance or enhancements of investment properties","Beschrijving van contractuele verplichtingen tot aankoop, bouw of ontwikkeling van vastgoedbeleggingen of voor reparatie, onderhoud of verbeteringen van vastgoedbeleggingen"]
[396,"Notes to the financial statements - Financial assets","Toelichting op de jaarrekening - Financiële vaste activa"]
[397,"Disclosure of financial assets","Informatieverschaffing over financiële vaste activa"]
[398,"Description of the assumptions on which the present value of expected future cash flows is based for assets measured at current value that may yield income as an investment","Beschrijving van de aannames waarop de contante waarde van de verwachte toekomstige kasstromen zijn gebaseerd voor activa gewaardeerd tegen actuele waarde die opbrengsten kunnen opleveren als belegging"]
[399,"Description of the approximation method for assets valuation at current value that generates income as investment","Beschrijving van toegepaste benaderingsmethode voor activa gewaardeerd tegen actuele waarde die opbrengsten kunnen opleveren als belegging"]
[400,"Description of the impairment of financial assets","Beschrijving van bijzondere waardeverminderingen van financiële vaste activa"]
[401,"Disclosure of deferred tax assets","Informatieverschaffing over latente belastingvorderingen"]
[402,"Description of reasons for not applying Article 2: 389 of the Dutch Civil Code to the separate financial statements","Beschrijving van gegronde redenen waarom deelneming niet volgens de netto-vermogenswaardemethode gewaardeerd is"]
[403,"Notes to the financial statements - Financial assets: Accumulated revaluations","Toelichting op de jaarrekening - Financiële vaste activa: Cumulatieve herwaarderingen"]
[404,"Sum of the revaluations of financial assets","Som der herwaarderingen die betrekking hebben op de financiële vaste activa"]
[405,"Notes to the financial statements - Inventories","Toelichting op de jaarrekening - Voorraden"]
[406,"Disclosure of inventories","Informatieverschaffing over voorraden"]
[407,"Description of the capitalised interest of inventories during the period","Beschrijving van de geactiveerde rente op voorraden gedurende de verslagperiode"]
[408,"Description of inventories of which the legal entity does not have legal ownership","Beschrijving van voorraden waarvan de rechtspersoon niet de juridische eigendom bezit"]
[409,"Description of commitments to purchase or sell inventories","Beschrijving van verplichtingen tot aan- of verkoop van voorraden"]
[410,"Disclosure of cost method of inventories","Beschrijving van kostprijsmethode van voorraden"]
[411,"Disclosure of the current value of agricultural inventories","Informatieverschaffing over de actuele waarde van agrarische voorraden"]
[412,"Disclosure of revaluations of agricultural inventories valued at current value","Informatieverschaffing over herwaarderingen van agrarische voorraden gewaardeerd tegen actuele waarde"]
[413,"Description to what extent the influence of taxes on the valuation of agricultural stocks at current value has been taken into account","Beschrijving in hoeverre rekening is gehouden met de invloed van belastingen bij de waardering van agrarische voorraden tegen actuele waarde"]
[414,"Description of the book value of inventories that are valued at lower realizable value","Beschrijving van de boekwaarde van voorraden die worden gewaardeerd tegen lagere opbrengstwaarde"]
[415,"Notes to the financial statements - Inventories: Current value: Breakdown","Toelichting op de jaarrekening - Voorraden: Actuele waarde: Uitsplitsing"]
[416,"Book value of inventories that are valued at lower realisable value","Boekwaarde van voorraden die worden gewaardeerd tegen lagere opbrengstwaarde"]
[417,"Notes to the financial statements - Construction contracts","Toelichting op de jaarrekening - Onderhanden projecten"]
[418,"Disclosure of construction contracts","Informatieverschaffing over onderhanden projecten"]
[419,"Notes to the financial statements - Receivables: Breakdown","Toelichting op de jaarrekening - Vorderingen: Uitsplitsing"]
[420,"Called-up contributions for issued share capital","Opgevraagde stortingen van geplaatst kapitaal"]
[421,"Other receivables","Overige vorderingen"]
[422,"Total of receivables","Totaal van vorderingen"]
[423,"Notes to the financial statements - Receivables","Toelichting op de jaarrekening - Vorderingen"]
[424,"Disclosure of receivables","Informatieverschaffing over vorderingen"]
[425,"Disclosure of prepayments and accrued income","Informatieverschaffing over overlopende activa"]
[426,"Description of receivables of which the legal entity does not have legal ownership","Beschrijving van vorderingen waarvan de rechtspersoon niet de juridische eigendom bezit"]
[427,"Disclosure of receivables with a maturity exceeding one year","Informatieverschaffing over vorderingen met een looptijd langer dan een jaar"]
[428,"Notes to the financial statements - Receivables: Breakdown maturity","Toelichting op de jaarrekening - Vorderingen: Uitsplitsing looptijd"]
[429,"Receivables with a maturity exceeding one year","Vorderingen met een looptijd langer dan een jaar"]
[430,"Notes to the financial statements - Securities","Toelichting op de jaarrekening - Effecten"]
[431,"Disclosure of securities","Informatieverschaffing over effecten"]
[432,"Disclosure of fair value of securities","Informatieverschaffing over de reële waarde van effecten"]
[433,"Notes to the financial statements - Cash and cash equivalents","Toelichting op de jaarrekening - Liquide middelen"]
[434,"Disclosure of cash and cash equivalents","Informatieverschaffing over liquide middelen"]
[435,"Disclosure of cheques and bills of exchange","Informatieverschaffing over wissels en cheques"]
[436,"Notes to the financial statements - Equity","Toelichting op de jaarrekening - Eigen vermogen"]
[437,"Disclosure of equity","Informatieverschaffing over eigen vermogen"]
[438,"Disclosure of continuity with impact on equity","Informatieverschaffing over de continuïteit met effect op het eigen vermogen"]
[439,"Disclosure of important subsequent events with an impact on equity","Informatieverschaffing over belangrijke mutaties na balansdatum met effect op het eigen vermogen"]
[440,"Disclosure of guaranteed equity","Informatieverschaffing over garantievermogen"]
[441,"Description of the withheld part of the result in equity","Beschrijving van het ingehouden deel van de jaarwinst binnen het eigen vermogen"]
[442,"Share capital","Aandelenkapitaal"]
[443,"Notes to the financial statements - Share capital: Statement of changes in number of shares: Specification","Toelichting op de jaarrekening - Aandelenkapitaal: Mutatieoverzicht in aantal aandelen: Specificatie"]
[444,"Share capital (number of shares)","Aandelenkapitaal (aantal aandelen)"]
[445,"Description Share capital (number of shares)","Omschrijving Aandelenkapitaal (aantal aandelen)"]
[446,"Number of shares at the beginning of the period","Aantal aandelen aan het begin van de periode"]
[447,"Shares issued","Aandelen uitgegeven"]
[448,"Shares purchased","Aandelen ingekocht"]
[449,"Shares granted","Aandelen toegekend"]
[450,"Shares sold","Aandelen verkocht"]
[451,"Shares withdrawn","Aandelen ingetrokken"]
[452,"Shares distributed as dividend","Aandelen verstrekt als dividend"]
[453,"Other movements","Overige mutaties"]
[454,"Total of movements during the period","Totaal van mutaties gedurende de periode"]
[455,"Number of shares at the end of the period","Aantal aandelen aan het einde van de periode"]
[456,"Notes to the financial statements - Share capital, previous period: Statement of changes in number of shares: Specification","Toelichting op de jaarrekening - Aandelenkapitaal, voorgaande periode: Mutatieoverzicht in aantal aandelen: Specificatie"]
[457,"Description Share capital (number of shares)","Omschrijving Aandelenkapitaal (aantal aandelen)"]
[458,"Notes to the financial statements - Share capital","Toelichting op de jaarrekening - Aandelenkapitaal"]
[459,"Disclosure of share capital paid called up","Informatieverschaffing over gestort en opgevraagd aandelenkapitaal"]
[460,"Disclosure of treasury shares","Informatieverschaffing over eigen aandelen"]
[461,"Description of the purchase or sale of treasury shares or certificates thereof","Beschrijving van de verwerving en vervreemding van eigen aandelen en certificaten daarvan"]
[462,"Indication of the manner in which payments have been made on shares that were due and payable during the financial year or were made voluntarily","Opgave van de wijze waarop stortingen op aandelen zijn verricht die in het boekjaar opeisbaar werden of vrijwillig zijn verricht"]
[463,"Notes to the financial statements - Share capital: Other amounts: Breakdown","Toelichting op de jaarrekening - Aandelenkapitaal: Overige bedragen: Uitsplitsing"]
[464,"Share capital issued","Geplaatst aandelenkapitaal"]
[465,"Share capital paid","Gestort aandelenkapitaal"]
[466,"Registered capital","Maatschappelijk kapitaal"]
[467,"Notes to the financial statements - Share capital: Specification","Toelichting op de jaarrekening - Aandelenkapitaal: Specificatie"]
[468,"Description Share capital","Omschrijving Aandelenkapitaal"]
[469,"Notes to the financial statements - Share premium","Toelichting op de jaarrekening - Agio"]
[470,"Disclosure of share premium","Informatieverschaffing over agio"]
[471,"Revaluation reserve","Herwaarderingsreserve"]
[472,"Notes to the financial statements - Revaluation reserve: Statement of changes","Toelichting op de jaarrekening - Herwaarderingsreserve: Mutatieoverzicht"]
[473,"Changes in value of assets, except for financial instruments, recognised directly through equity","Waardeveranderingen voor activa, niet zijnde financiële instrumenten, rechtstreeks in eigen vermogen"]
[474,"Changes in value of financial instruments recognised directly through equity","Waardeveranderingen voor financiële instrumenten rechtstreeks in eigen vermogen"]
[475,"Total of recognised directly through equity","Totaal van rechtstreeks in eigen vermogen"]
[476,"Hedged","Afgedekt"]
[477,"No price quotation in active market","Geen frequente marktnotering"]
[478,"Total of revaluation reserves","Totaal van herwaarderingsreserves"]
[479,"Revaluation reserve at the beginning of the period","Herwaarderingsreserve aan het begin van de periode"]
[480,"Movement of revaluation reserve as a result of change in accounting policies","Mutatie in herwaarderingsreserve als gevolg van stelselwijzigingen"]
[481,"Movement of revaluation reserve as a result of tax impact of change in accounting policies","Mutatie in herwaarderingsreserve als gevolg van belastingeffect van stelselwijzigingen"]
[482,"Adjusted revaluation reserve after recalculation due to change in accounting policies","Aangepaste herwaarderingsreserve na herrekening als gevolg van stelselwijziging"]
[483,"Realised revaluations through the income statement","Gerealiseerde herwaarderingen via winst-en-verliesrekening"]
[484,"Realised revaluations through the other reserves","Gerealiseerde herwaarderingen via overige reserves"]
[485,"Realised revaluations through hedged assets and liabilities","Gerealiseerde herwaarderingen via afgedekte activa of passiva"]
[486,"Tax impact of realised revaluations","Belastingeffecten op gerealiseerde herwaarderingen"]
[487,"Revaluations through the income statement","Gevormde herwaarderingen via winst-en-verliesrekening"]
[488,"Revaluations through the other reserves","Gevormde herwaarderingen via overige reserves"]
[489,"Revaluations through hedged assets and liabilities","Gevormde herwaarderingen via afgedekt activa of passiva"]
[490,"Tax impact of revaluations","Belastingeffecten op gevormde herwaarderingen"]
[491,"Revaluation reserve at the end of the period","Herwaarderingsreserve aan het einde van de periode"]
[492,"Notes to the financial statements - Revaluation reserve, previous period: Statement of changes","Toelichting op de jaarrekening - Herwaarderingsreserve, voorgaande periode: Mutatieoverzicht"]
[493,"Notes to the financial statements - Revaluation reserve","Toelichting op de jaarrekening - Herwaarderingsreserve"]
[494,"Disclosure of revaluation reserve","Informatieverschaffing over herwaarderingsreserve"]
[495,"Description of how, in conjunction with the revaluation, the impact of taxes on capital and income is taken into account","Beschrijving van op welke wijze in samenhang met de herwaardering rekening wordt gehouden met de invloed van belastingen op vermogen en resultaat"]
[496,"Notes to the financial statements - Other legal reserves: Breakdown","Toelichting op de jaarrekening - Andere wettelijke reserves: Uitsplitsing"]
[497,"Legal reserve for the negative translation of the share capital of a public limited liability company into euros","Negatieve bijschrijvingsreserve als gevolg van de omrekening van het aandelenkapitaal van een naamloze vennootschap naar de euro"]
[498,"Legal reserve for the translation of the share capital of a public limited liability company into euros","Niet-uitkeerbare reserve als gevolg van de omrekening van het aandelenkapitaal van een naamloze vennootschap naar de euro"]
[499,"Reserve for contribution on shares other than cash","Reserve voor inbreng op aandelen anders dan in geld"]
[500,"Non-distributable reserve for granted loan to obtain by others shares in the capital of the company or of depositary receipts thereof","Niet-uitkeerbare reserve voor verstrekte lening ter verkrijging door anderen van aandelen in het kapitaal van de vennootschap of van certificaten daarvan"]
[501,"Legal reserve that account for incorporation and share issue","Wettelijke reserve voor kosten die verband houden met de oprichting en met de uitgifte van aandelen"]
[502,"Legal reserve for capitalised development costs","Wettelijke reserve voor geactiveerde kosten van ontwikkeling"]
[503,"Legal reserve participating interests","Wettelijke reserve deelnemingen"]
[504,"Legal reserve for conversion differences for the conversion of the invested capital and the result of participating interests","Wettelijke reserve omrekeningsverschillen voor omrekening van het geïnvesteerde vermogen en het resultaat van deelnemingen"]
[505,"Foreign currency translation reserve","Reserve omrekeningsverschillen"]
[506,"Total of other legal reserves","Totaal van andere wettelijke reserves"]
[507,"Notes to the financial statements - Other legal reserves","Toelichting op de jaarrekening - Andere wettelijke reserves"]
[508,"Disclosure of other legal reserves, distinguished by their nature","Informatieverschaffing over andere wettelijke reserves, onderscheiden naar hun aard"]
[509,"Notes to the financial statements - Statutory reserves","Toelichting op de jaarrekening - Statutaire reserves"]
[510,"Disclosure of statutory reserves","Informatieverschaffing over statutaire reserves"]
[511,"Notes to the financial statements - Fiscal reinvestment reserve","Toelichting op de jaarrekening - Fiscale herinvesteringsreserve"]
[512,"Disclosure of fiscal reinvestment reserve","Informatieverschaffing over fiscale herinvesteringsreserve"]
[513,"Notes to the financial statements - Other reserves","Toelichting op de jaarrekening - Overige reserves"]
[514,"Disclosure of other reserves","Informatieverschaffing over overige reserves"]
[515,"Notes to the financial statements - Result for the year","Toelichting op de jaarrekening - Resultaat van het boekjaar"]
[516,"Disclosure of result after tax for the year","Informatieverschaffing over resultaat na belastingen van het boekjaar"]
[517,"Notes to the financial statements - Undistributed profit","Toelichting op de jaarrekening - Niet verdeelde winsten"]
[518,"Disclosure of undistributed profit","Informatieverschaffing over niet verdeelde winsten"]
[519,"Appropriation of the results","Resultaatbestemming"]
[520,"Differences between the company and consolidated financial statements","Verschillen tussen de enkelvoudige en geconsolideerde jaarrekening"]
[521,"Notes to the financial statements - Provisions","Toelichting op de jaarrekening - Voorzieningen"]
[522,"Disclosure of provisions","Informatieverschaffing over voorzieningen"]
[523,"Disclosure of provision for repair costs","Informatieverschaffing over voorziening voor herstelkosten"]
[524,"Disclosure of provision for tax liabilities","Informatieverschaffing over voorziening voor belastingverplichtingen"]
[525,"Disclosure of provision for pension obligations","Informatieverschaffing over voorzieningen voor pensioenverplichtingen"]
[526,"Disclosure of provision for employee benefits","Informatieverschaffing over voorziening uit hoofde van personeelsbeloningen"]
[527,"Disclosure of environmental provision","Informatieverschaffing over voorziening voor opruiming van aanwezige milieuvervuiling"]
[528,"Disclosure of provision for legal proceedings","Informatieverschaffing over voorziening uit hoofde van claims, geschillen en rechtsgedingen"]
[529,"Disclosure of provision for major maintenance","Informatieverschaffing over voorziening voor groot onderhoud"]
[530,"Disclosure of provision for disposal obligations","Informatieverschaffing over voorziening voor verwijderingsverplichtingen"]
[531,"Disclosure of provision for onerous contracts","Informatieverschaffing over voorziening voor verlieslatende contracten"]
[532,"Description of the actuarial assumptions used for the provision for pension obligations","Beschrijving van de actuariële grondslagen gehanteerd voor de voorziening voor pensioenverplichtingen"]
[533,"Description of obligations per balance sheet date that have pension provisions","Beschrijving van de per balansdatum bestaande verplichtingen waarvoor een pensioenvoorziening is opgenomen"]
[534,"Disclosure of restructuring provision","Informatieverschaffing over voorziening in verband met reorganisaties"]
[535,"Disclosure of provision relating to participating interest","Informatieverschaffing over voorziening in verband met deelnemingen"]
[536,"Description of the valuation methods of the provision for pension obligations","Beschrijving van de methode van waardering van de opgenomen pensioenvoorziening"]
[537,"Disclosure of deferred tax liabilities","Informatieverschaffing over latente belastingverplichtingen"]
[538,"Disclosure of warranty provision","Informatieverschaffing over garantievoorziening"]
[539,"Notes to the financial statements - Provisions: Other amounts: Breakdown","Toelichting op de jaarrekening - Voorzieningen: Overige bedragen: Uitsplitsing"]
[540,"Long-term part of provisions","Langlopend deel van de voorzieningen"]
[541,"Notes to the financial statements - Non-current liabilities: Breakdown","Toelichting op de jaarrekening - Langlopende schulden: Uitsplitsing"]
[542,"Old age obligation","Oudedagsverplichting"]
[543,"Other payables","Overige schulden"]
[544,"Total of non-current liabilities","Totaal van langlopende schulden"]
[545,"Notes to the financial statements - Non-current liabilities","Toelichting op de jaarrekening - Langlopende schulden"]
[546,"Disclosure of non-current liabilities","Informatieverschaffing over langlopende schulden"]
[547,"Disclosure of subordinated liabilities","Informatieverschaffing over achtergestelde schulden"]
[548,"Disclosure of finance lease liabilities","Informatieverschaffing over financiële lease verplichtingen"]
[549,"Disclosure of old age obligation","Informatieverschaffing over oudedagsverplichting"]
[550,"Disclosure of negative goodwill","Informatieverschaffing over negatieve goodwill"]
[551,"Description of the period where negative goodwill is recognised in income statement","Beschrijving van de periode waarin de negatieve goodwill ten gunste van de winst-en-verliesrekening wordt gebracht"]
[552,"Disclosure of accruals and deferred income","Informatieverschaffing over overlopende passiva"]
[553,"Specification of secured liabilities and form of separation","Opgave van de schulden waarvoor zakelijke zekerheid is gesteld en in welke vorm dat is geschied"]
[554,"Disclosure of the maturity of non-current liabilities","Informatieverschaffing over de looptijd van langlopende schulden"]
[555,"Disclosure of the liabilities to which the legal person has committed itself, whether or not conditionally, to encumber or not to encumber assets","Informatieverschaffing over de schulden waarvoor de rechtspersoon zich, al dan niet voorwaardelijk, heeft verbonden tot het bezwaren of niet bezwaren van goederen"]
[556,"Notes to the financial statements - Non-current liabilities: Other amounts: Breakdown","Toelichting op de jaarrekening - Langlopende schulden: Overige bedragen: Uitsplitsing"]
[557,"Non-current liabilities with a maturity exceeding five years","Langlopende schulden met een looptijd langer dan vijf jaar"]
[558,"Amount of secured non-current liabilities","Bedrag aan langlopende schulden waarvoor zakelijke zekerheid is gesteld"]
[559,"Notes to the financial statements - Current liabilities","Toelichting op de jaarrekening - Kortlopende schulden"]
[560,"Disclosure of current liabilities","Informatieverschaffing over kortlopende schulden"]
[561,"Notes to the financial statements - Current liabilities: Other amounts: Breakdown","Toelichting op de jaarrekening - Kortlopende schulden: Overige bedragen: Uitsplitsing"]
[562,"Amount of secured current liabilities","Bedrag aan kortlopende schulden waarvoor zakelijke zekerheid is gesteld"]
[563,"Notes to the financial statements - Assets and liabilities not recognised in balance sheet","Toelichting op de jaarrekening - Niet in de balans opgenomen activa en verplichtingen"]
[564,"Disclosure of off-balance sheet commitments","Informatieverschaffing over niet in de balans opgenomen verplichtingen"]
[565,"Description of the nature of off-balance sheet liabilities","Beschrijving van de aard van niet uit de balans blijkende verplichtingen"]
[566,"Description of the financial consequences of the contingent arrangements","Beschrijving van de financiële gevolgen van de niet in de balans opgenomen regelingen"]
[567,"Description of the business objectives of the contingent arrangements","Beschrijving van het zakelijk doel van de niet in de balans opgenomen regelingen"]
[568,"Description of the nature of the contingent arrangements","Beschrijving van de aard van de niet in de balans opgenomen regelingen"]
[569,"Description of the indication of uncertainties regarding the amount or moment of outflow relating to off-balance sheet liabilities","Beschrijving van de indicatie van de onzekerheden met betrekking tot het bedrag of het moment van uitstroom in het kader van niet uit de balans blijkende verplichtingen"]
[570,"Description of the possibility of any reimbursement relating to off-balance sheet liabilities","Beschrijving van de mogelijkheid van enigerlei vergoeding in het kader van niet uit de balans blijkende verplichtingen"]
[571,"Disclosure of contingent liabilities on behalf of group companies","Informatieverschaffing over niet uit de balans blijkende verplichtingen ten behoeve van groepsmaatschappijen"]
[572,"Description of off-balance sheet commitments relating to liability claims","Beschrijving van niet in de balans opgenomen verplichtingen inzake aansprakelijkheidsstellingen"]
[573,"Description of the off-balance sheet liabilities relating to the fiscal unity","Beschrijving van de niet in de balans opgenomen verplichtingen inzake de fiscale eenheid"]
[574,"Description of off-balance sheet liabilities relating to purchase commitments","Beschrijving van niet in de balans opgenomen verplichtingen inzake investeringsverplichtingen"]
[575,"Description of off-balance sheet commitments relating to guarantees","Beschrijving van niet in de balans opgenomen verplichtingen inzake garanties"]
[576,"Description of guarantees for the joint supervisory directors of the legal person, as provided by the legal entity, are subsidiaries and the companies of which he consolidates the data","Beschrijving van garanties ten behoeve van de gezamenlijke commissarissen van de rechtspersoon, zoals verstrekt door de rechtspersoon, zijn dochtermaatschappijen en de maatschappijen waarvan hij de gegevens consolideert"]
[577,"Disclosure of contingent assets","Informatieverschaffing over niet in de balans opgenomen activa"]
[578,"Description of the estimate of financial impact of off-balance sheet liabilities","Beschrijving van de schatting van het financiële effect van niet uit de balans blijkende verplichtingen"]
[579,"Disclosure of operating leases","Informatieverschaffing over operationele leases"]
[580,"Description of the average maturity of the operational lease commitments","Beschrijving van de gemiddelde looptijd van de operationele lease verplichtingen"]
[581,"Description of the size and duration of obligations to purchase or sell stocks of special significance","Beschrijving van omvang en looptijd van verplichtingen tot aan- of verkoop van voorraden van bijzondere betekenis"]
[582,"Notes to the financial statements - Assets and liabilities not recognised in balance sheet: Other amounts: Breakdown","Toelichting op de jaarrekening - Niet in de balans opgenomen activa en verplichtingen: Overige bedragen: Uitsplitsing"]
[583,"Contingent assets to which the legal entity committed","Voorwaardelijke activa waartoe de rechtspersoon zich heeft verbonden"]
[584,"Contingent liabilities to which the legal entity committed","Voorwaardelijke verplichtingen waartoe de rechtspersoon zich heeft verbonden"]
[585,"Liabilities to which the legal entity committed","Verplichtingen waartoe de rechtspersoon zich heeft verbonden"]
[586,"Not recorded liabilities to which the legal entity committed","Niet verwerkte verplichtingen waartoe de rechtspersoon zich heeft verbonden"]
[587,"Contingent liabilities on behalf of group companies","Verplichtingen voortkomend uit aansprakelijkheid voor schulden van groepsmaatschappijen"]
[588,"Contingent liabilities from discounted exchanges or chèques on behalf of group companies","Verplichtingen voortkomend uit verdisconteerde wissels of chèques van groepsmaatschappijen"]
[589,"Contingent assets to which the legal entity committed on behalf of group companies","Voorwaardelijke activa waartoe de rechtspersoon zich ten behoeve van groepsmaatschappijen heeft verbonden"]
[590,"Contingent liabilities to which the legal entity committed on behalf of group companies","Voorwaardelijke verplichtingen waartoe de rechtspersoon zich ten behoeve van groepsmaatschappijen heeft verbonden"]
[591,"Liabilities to which the legal entity committed on behalf of group companies","Verplichtingen waartoe de rechtspersoon zich ten behoeve van groepsmaatschappijen heeft verbonden"]
[592,"Not recorded liabilities to which the legal entity committed on behalf of group companies","Niet verwerkte verplichtingen waartoe de rechtspersoon zich ten behoeve van groepsmaatschappijen heeft verbonden"]
[593,"Notes to the financial statements - Assets and liabilities not recognised in balance sheets: Payments to obtain usage rights: Breakdown maturity","Toelichting op de jaarrekening - Niet in de balans opgenomen activa en verplichtingen: Betalingen ter verkrijging van rechten: Uitsplitsing looptijd"]
[594,"Off-balance sheet liabilities relating to payments to obtain usage rights","Niet in de balans opgenomen verplichtingen inzake betalingen ter verkrijging van (gebruiks)rechten"]
[595,"Off-balance sheet commitments relating to payments to obtain usage rights with a maturity exceeding one year","Niet in de balans opgenomen verplichtingen inzake betalingen ter verkrijging van (gebruiks)rechten met een looptijd langer dan een jaar"]
[596,"Off-balance sheet commitments relating to payments to obtain usage rights with a maturity exceeding five years","Niet in de balans opgenomen verplichtingen inzake betalingen ter verkrijging van (gebruiks)rechten met een looptijd langer dan vijf jaar"]
[597,"Notes to the financial statements - Amortisation of intangible assets and depreciation of property, plant and equipment","Toelichting op de jaarrekening - Afschrijvingen op immateriële en materiële vaste activa"]
[598,"Disclosure of amortisation and depreciation of the amount of arbitrary depreciation and amortisation that exceeds the amount of regular depreciation and amortisation","Informatieverschaffing over afschrijvingen van het bedrag aan willekeurige afschrijving dat uitgaat boven het bedrag van de reguliere afschrijving wanneer niet willekeurig zou zijn afgeschreven"]
[599,"Changes in the value of investment properties","Waardeveranderingen in vastgoedbeleggingen"]
[600,"Notes to the financial statements - Impairment loss of individual asset of material importance: Specification","Toelichting op de jaarrekening - Bijzonder waardeverminderingsverlies van individueel actief welke van materieel belang is: Specificatie"]
[601,"Individual asset","Individueel actief"]
[602,"Description Individual asset","Omschrijving Individueel actief"]
[603,"Description of the nature of the individual asset for which an impairment loss, or reversal thereof, is recognized which is material","Beschrijving van de aard van het individueel actief waarvoor een bijzondere waardeverminderingsverlies, of terugneming hiervan, is verantwoord welke van materieel belang is"]
[604,"Description of the segment to be reported to which it is individually active, for which an impairment loss, or reversal thereof, is justified which is material","Beschrijving van het te rapporteren segment waartoe het individueel actief behoort waarvoor een bijzondere waardeverminderingsverlies, of terugneming hiervan, is verantwoord welke van materieel belang is"]
[605,"Description of whether the current value or the value in use is applicable","Beschrijving van of de opbrengstwaarde of de bedrijfswaarde van toepassing is"]
[606,"Notes to the financial statements - Income tax expense","Toelichting op de jaarrekening - Belastingen"]
[607,"Disclosure of income tax expense","Informatieverschaffing over belastingen over de winst of het verlies"]
[608,"Disclosure of income tax expense from ordinary activities","Informatieverschaffing over belastingen over resultaat uit gewone bedrijfsuitoefening"]
[609,"Disclosure of the reconciliation of the income tax expense to the corporate tax return","Informatieverschaffing over de aansluiting van belastingen met de aangifte vennootschapsbelasting"]
[610,"Disclosure of income tax recognised directly in equity","Informatieverschaffing over belastingen rechtstreeks in het eigen vermogen verwerkt"]
[611,"Notes to the financial statements - Income tax expense: Other amounts: Breakdown","Toelichting op de jaarrekening - Belastingen: Overige bedragen: Uitsplitsing"]
[612,"Limited deductible expenses","Beperkte aftrekbare kosten"]
[613,"Non deductible expenses","Niet aftrekbare kosten"]
[614,"Income and expenses in proportion to group companies","Baten en lasten uit verhouding met groepsmaatschappijen"]
[615,"Income and expenses in relation to other affiliated companies","Baten en lasten uit verhouding met overige verbonden maatschappijen"]
[616,"Notes to the financial statements - Licensing agreements","Toelichting op de jaarrekening - Concessies"]
[617,"Policy of public-private concession agreements","Grondslag van publiek-private concessieovereenkomsten"]
[618,"Disclosure of licensing agreements","Informatieverschaffing over concessies"]
[619,"Description of the main licensing agreements","Beschrijving van de afspraken omtrent concessies in hoofdlijnen"]
[620,"Description of the most important conditions in the agreements concerning concessions that influence the size, the moment and the certainty of the future cash flows","Beschrijving van de belangrijkste voorwaarden in de afspraken omtrent concessies die van invloed zijn op de grootte, het moment en de zekerheid van de toekomstige kasstromen"]
[621,"Description of the nature and extent of the rights to the use of specific assets","Beschrijving van de aard en omvang van de rechten op het gebruik van specifieke activa"]
[622,"Description of the nature and extent of service obligations or the rights to expected services","Beschrijving van de aard en omvang van de verplichtingen tot dienstverlening of de rechten op verwachte dienstverlening"]
[623,"Description of the nature and extent of the obligations for the purchase or construction of property, plant and equipment","Beschrijving van de aard en omvang van de verplichtingen tot koop of bouw van materiële vaste activa"]
[624,"Description of the nature and extent of the obligations to transfer specific assets at the end of the concession period or the rights to receive these assets","Beschrijving van de aard en omvang van de verplichtingen tot overdracht van specifieke activa aan het einde van de concessieperiode of de rechten op ontvangst van deze activa"]
[625,"Description of the nature and extent of the options for extension or termination","Beschrijving van de aard en omvang van de opties tot verlenging of beëindiging"]
[626,"Description of the nature and extent of other rights and obligations","Beschrijving van de aard en omvang van andere rechten en verplichtingen"]
[627,"Description of the changes of the agreements during the period if applicable; and the manner in which the concession agreement is classified","Beschrijving van de veranderingen van de afspraken gedurende de periode indien van toepassing; en de wijze waarop de concessieovereenkomst is geclassificeerd"]
[628,"Notes to the financial statements - Average number of employees: Breakdown","Toelichting op de jaarrekening - Gemiddeld aantal werknemers: Uitsplitsing"]
[629,"Average number of employees over the period working in the Netherlands","Gemiddeld aantal werknemers over de periode werkzaam binnen Nederland"]
[630,"Average number of employees over the period working outside the Netherlands","Gemiddeld aantal werknemers over de periode werkzaam buiten Nederland"]
[631,"Total of average number of employees over the period","Totaal van gemiddeld aantal werknemers over de periode"]
[632,"Notes to the financial statements - Average number of employees","Toelichting op de jaarrekening - Gemiddeld aantal werknemers"]
[633,"Disclosure of average number of employees during the period","Informatieverschaffing over gemiddeld aantal werknemers over de periode"]
[634,"Notes to the financial statements - Financial instruments","Toelichting op de jaarrekening - Financiële instrumenten"]
[635,"Disclosure of financial instruments","Informatieverschaffing over financiële instrumenten"]
[636,"Disclosure of financial assets of book value higher than current value","Informatieverschaffing over financiële vaste activa met de boekwaarde die hoger is dan de actuele waarde"]
[637,"Information relating to the nature and extent of derivative financial instruments not valued against actual values","Informatie over de omvang en de aard van afgeleide financiële instrumenten welke niet tegen de actuele waarde zijn gewaardeerd"]
[638,"Terms and conditions that may affect the amount, timing and certainty of future cash flows of derivative financial instruments","Voorwaarden die op het bedrag, het tijdstip en de zekerheid van toekomstige kasstromen van afgeleide financiële instrumenten van invloed kunnen zijn"]
[639,"Notes to the financial statements - Payments due to termination of the employment to senior officials with or without employment: Specification","Toelichting op de jaarrekening - Uitkeringen wegens beëindiging van het dienstverband aan topfunctionarissen met of zonder dienstbetrekking: Specificatie"]
[640,"The name (consisting of the initials and last name) of the senior official","De naam (bestaande uit de voorletters en achternaam) van de topfunctionaris"]
[641,"Description The name (consisting of the initials and last name) of the senior official","Omschrijving De naam (bestaande uit de voorletters en achternaam) van de topfunctionaris"]
[642,"Position(s)","Functie(s)"]
[643,"Extent of employment as a part-time factor in FTE","Omvang van het dienstverband uitgedrukt als deeltijdfactor in FTE"]
[644,"Year of termination of the employment","Jaar waarin het dienstverband is beëindigd"]
[645,"Agreed payments due to termination","Overeengekomen uitkeringen wegens beëindiging dienstverband"]
[646,"Individual maximum remuneration","Individueel toepasselijk maximum"]
[647,"Total of payments due to termination of the employment","Totaal van uitkeringen wegens beëindiging van het dienstverband"]
[648,"Payments made in the financial year due to termination of the employment","In het boekjaar gedane uitkeringen wegens beëindiging van het dienstverband"]
[649,"Undue payments and amounts not yet received","Onverschuldigd betaald en nog niet terugontvangen bedrag"]
[650,"Amount exceeding maximum remuneration","Het bedrag van de overschrijding"]
[651,"Reasons for exceeding the maximum amount of remuneration","Reden waarom de overschrijding al dan niet is toegestaan"]
[652,"Description of the claim for undue payment","Toelichting op de vordering wegens onverschuldigde betaling"]
[653,"Error recovery in WNT accountability","Foutenherstel in verantwoording WNT"]
[654,"Explanation of the difference and cause of error recovery","Toelichting op verschil en oorzaak foutenherstel"]
[655,"Notes to the financial statements - Remuneration of executive senior officials with employment and without employment from the 13th month: Specification","Toelichting op de jaarrekening - Bezoldiging van leidinggevende topfunctionarissen met dienstbetrekking en zonder dienstbetrekking vanaf de 13e maand: Specificatie"]
[656,"Description The name (consisting of the initials and last name) of the senior official","Omschrijving De naam (bestaande uit de voorletters en achternaam) van de topfunctionaris"]
[657,"Start of employment","Aanvang functievervulling"]
[658,"End of employment","Einde functievervulling"]
[659,"Employment relationship?","Dienstbetrekking?"]
[660,"Consideration plus taxable expense allowances","Beloning plus belastbare onkostenvergoedingen"]
[661,"Post-employment benefits","Beloningen betaalbaar op termijn"]
[662,"Subtotal","Subtotaal"]
[663,"Individual applicable remuneration maximum","Individueel toepasselijke bezoldigingsmaximum"]
[664,"Remuneration","Bezoldiging"]
[665,"Notes to the financial statements - Remuneration of executive senior officials with employment and without employment from the 13th month, previous period: Specification","Toelichting op de jaarrekening - Bezoldiging van leidinggevende topfunctionarissen met dienstbetrekking en zonder dienstbetrekking vanaf de 13e maand, voorgaande periode: Specificatie"]
[666,"Description The name (consisting of the initials and last name) of the senior official","Omschrijving De naam (bestaande uit de voorletters en achternaam) van de topfunctionaris"]
[667,"Notes to the financial statements - Remuneration of executive senior officials without employment in the period up to and including the 12th month: Specification","Toelichting op de jaarrekening - Bezoldiging van leidinggevende topfunctionarissen zonder dienstbetrekking in periode tot en met de 12e maand: Specificatie"]
[668,"Description The name (consisting of the initials and last name) of the senior official","Omschrijving De naam (bestaande uit de voorletters en achternaam) van de topfunctionaris"]
[669,"Calendar year","Kalenderjaar"]
[670,"Start of the duration of the employment during the calender year","Aanvang functievervulling in het kalenderjaar"]
[671,"End of the employment during the calender year","Einde functievervulling in het kalenderjaar"]
[672,"Number of months of employment during the calendar year","Aantal maanden van functievervulling in het kalenderjaar"]
[673,"Extent of employment in hours per calendar year","Omvang van het dienstverband in uren per kalenderjaar"]
[674,"Maximum remuneration per hour during the calender year","Maximum uurtarief in het kalenderjaar"]
[675,"Maxima on the basis of the standard amounts per month","Maxima op basis van de normbedragen per maand"]
[676,"Individual applicable maximum entire period calendar month 1 to 12","Individueel toepasselijke maximum gehele periode kalendermaand 1 t/m 12"]
[677,"Actual hourly rate lower than the maximum hourly rate?","Werkelijk uurtarief lager dan het maximum uurtarief?"]
[678,"Hourly rate","Uurtarief"]
[679,"Remuneration in the relevant period","Bezoldiging in de betreffende periode"]
[680,"Total remuneration for entire period calendar month 1 to 12","Totale bezoldiging gehele periode kalendermaand 1 t/m 12"]
[681,"Notes to the financial statements - Remuneration of executive senior officials without employment in the period up to and including the 12th month, previous period: Specification","Toelichting op de jaarrekening - Bezoldiging van leidinggevende topfunctionarissen zonder dienstbetrekking in periode tot en met de 12e maand, voorgaande periode: Specificatie"]
[682,"Description The name (consisting of the initials and last name) of the senior official","Omschrijving De naam (bestaande uit de voorletters en achternaam) van de topfunctionaris"]
[683,"Notes to the financial statements - Remuneration of non-senior officials: Specification","Toelichting op de jaarrekening - Bezoldiging van niet-topfunctionarissen: Specificatie"]
[684,"Description of the position of the non-senior official","Beschrijving van de functie van de niet-topfunctionaris"]
[685,"Description Description of the position of the non-senior official","Omschrijving Beschrijving van de functie van de niet-topfunctionaris"]
[686,"Total of remuneration","Totaal van bezoldiging"]
[687,"Individual applicable threshold remuneration","Individueel toepasselijk drempelbedrag bezoldiging"]
[688,"Justification of exceeding the maximum remuneration","Motivering van de overschrijding van de maximale bezoldiging"]
[689,"Notes to the financial statements - Remuneration of non-senior officials, previous period: Specification","Toelichting op de jaarrekening - Bezoldiging van niet-topfunctionarissen, voorgaande periode: Specificatie"]
[690,"Description Description of the position of the non-senior official","Omschrijving Beschrijving van de functie van de niet-topfunctionaris"]
[691,"Notes to the financial statements - Remuneration of supervisory senior officials: Specification","Toelichting op de jaarrekening - Bezoldiging van toezichthoudende topfunctionarissen: Specificatie"]
[692,"The name (consisting of the initials and last name) of the supervisory senior official","De naam (bestaande uit de voorletters en achternaam) van de toezichthoudende topfunctionaris"]
[693,"Description The name (consisting of the initials and last name) of the supervisory senior official","Omschrijving De naam (bestaande uit de voorletters en achternaam) van de toezichthoudende topfunctionaris"]
[694,"Remuneration excluding undue payments","Bezoldiging exclusief onverschuldigde betalingen"]
[695,"Notes to the financial statements - Remuneration of supervisory senior officials, previous period: Specification","Toelichting op de jaarrekening - Bezoldiging van toezichthoudende topfunctionarissen, voorgaande periode: Specificatie"]
[696,"Description The name (consisting of the initials and last name) of the supervisory senior official","Omschrijving De naam (bestaande uit de voorletters en achternaam) van de toezichthoudende topfunctionaris"]
[697,"Notes to the financial statements - Executive senior officials and those who are regarded as executive senior official for another 4 years with a remuneration of € 1.700 or less: Specification","Toelichting op de jaarrekening - Bezoldiging van topfunctionarissen en degenen die nog 4 jaar als topfunctionaris worden aangemerkt met een bezoldiging van € 1.700 of minder: Specificatie"]
[698,"Description The name (consisting of the initials and last name) of the senior official","Omschrijving De naam (bestaande uit de voorletters en achternaam) van de topfunctionaris"]
[699,"Notes to the financial statements - Total remuneration of a senior official as well as the person who is regarded as a senior official for another 4 years based on his / her former position: Specification","Toelichting op de jaarrekening - Totale bezoldiging van een topfunctionaris alsmede degene die op grond van zijn/haar voormalige functie nog 4 jaar als topfunctionaris wordt aangemerkt: Specificatie"]
[700,"Description The name (consisting of the initials and last name) of the senior official","Omschrijving De naam (bestaande uit de voorletters en achternaam) van de topfunctionaris"]
[701,"Remuneration in respect to activities as senior officer","Bezoldiging voor de werkzaamheden als topfunctionaris"]
[702,"Remuneration in respect to other activities as senior officer","Bezoldiging voor andere werkzaamheden dan die als topfunctionaris"]
[703,"Remuneration in respect to activities of affiliated companies","Bezoldiging voor de werkzaamheden bij gelieerde rechtspersonen"]
[704,"Double counting caused by charges","Dubbeltellingen door doorbelastingen"]
[705,"Subtotal remuneration","Subtotaal bezoldiging"]
[706,"Name WNT institution in respect to activities as senior officer","Naam WNT instelling met betrekking tot de werkzaamheden als topfunctionaris"]
[707,"Name WNT institution in respect to other activities as senior officer","Naam WNT instelling met betrekking tot andere werkzaamheden dan die als topfunctionaris"]
[708,"Name WNT institution in respect to activities of affiliated companies","Naam WNT instelling met betrekking tot de werkzaamheden bij gelieerde rechtspersonen"]
[709,"Remuneration maximum of the institution or allowed higher individual remuneration senior officer","Het voor de WNT-instelling geldende bezoldigingsmaximum dan wel een voor de individuele topfunctionaris toegestane hogere bezoldiging"]
[710,"Notes to the financial statements - Remuneration of non-supervising senior officials who already have employment with another WNT institution: Specification","Toelichting op de jaarrekening - Bezoldiging van niet toezichthoudende topfunctionarissen die reeds dienstbetrekking hebben bij andere WNT-instelling: Specificatie"]
[711,"The name (consisting of the initials and last name) of the non supervisory senior official","De naam (bestaande uit de voorletters en achternaam) van de niet toezichthoudende topfunctionaris"]
[712,"Description The name (consisting of the initials and last name) of the non supervisory senior official","Omschrijving De naam (bestaande uit de voorletters en achternaam) van de niet toezichthoudende topfunctionaris"]
[713,"Start date employment","Datum aanvang dienstbetrekking"]
[714,"Total remuneration per institution amounts x € 1","Totale bezoldiging per WNT-instelling bedragen x € 1"]
[715,"Notes to the financial statements - Remuneration of a senior official with a total remuneration of € 1,700 or more concerning anti cumulation - Cumulated: Specification","Toelichting op de jaarrekening - Bezoldiging van topfunctionaris met een totale bezoldiging van meer dan € 1.700 waarop de anticumulatie bepaling van toepassing is - Gecumuleerd: Specificatie"]
[716,"Description The name (consisting of the initials and last name) of the non supervisory senior official","Omschrijving De naam (bestaande uit de voorletters en achternaam) van de niet toezichthoudende topfunctionaris"]
[717,"Cumulated total remuneration at all institutions concerning anti cumalation approach","Gecumuleerde totale bezoldigingen bij alle WNT-instellingen gezamenlijk i.v.m. anticumulatie bepaling"]
[718,"The remuneration maximum or higher individual remuneration than the remuneration maximum","Het algemeen bezoldigingsmaximum dan wel een voor één van de dienstbetrekkingen van toepassing zijnde hoger bezoldigingsmaximum"]
[719,"Notes to the financial statements - Senior officer with a total salary of € 1,700 or less to which the anti-cumulation provision applies: Specification","Toelichting op de jaarrekening - Topfunctionaris met een totale bezoldiging van € 1.700 of minder waarop de anticumulatiebepaling van toepassing is: Specificatie"]
[720,"Description The name (consisting of the initials and last name) of the senior official","Omschrijving De naam (bestaande uit de voorletters en achternaam) van de topfunctionaris"]
[721,"All other WNT Institutions where the employed managing senior officials is also a managing senior official","Alle andere WNT-instellingen waarbij de leidinggevende topfunctionaris eveneens in dienstbetrekking is als leidinggevende topfunctionaris"]
[722,"Notes to the financial statements - Share based payments","Toelichting op de jaarrekening - Op aandelen gebaseerde betalingen"]
[723,"Disclosure of share based payments","Informatieverschaffing over op aandelen gebaseerde betalingen"]
[724,"Description of the policy for hedging of granted share options of share based payments","Beschrijving van het beleid ter afdekking van verleende aandelenopties in het kader van op aandelen gebaseerde betalingen"]
[725,"Description of the position of granted not yet exercised options relating to share based payments","Beschrijving van de positie van verleende en nog niet afgedekte aandelenopties in het kader van op aandelen gebaseerde betalingen"]
[726,"Average price of purchased treasury shares relating to share based payments","Gemiddelde prijs van ter afdekking ingekochte eigen aandelen in het kader van op aandelen gebaseerde betalingen"]
[727,"Description of purchase commitments of shares(certificates) relating to share based payments","Beschrijving van verplichtingen tot aankoop uitstaande (certificaten van) aandelen in het kader van op aandelen gebaseerde betalingen"]
[728,"Notes to the financial statements - Rights granted not yet exercised","Toelichting op de jaarrekening - Nog niet uitgeoefende verleende rechten"]
[729,"Disclosure of rights granted, not yet exercised","Informatieverschaffing over nog niet uitgeoefende verleende rechten"]
[730,"Description of reasons for granting rights to supervisory directors to take or obtain (certificates of) shares in the capital of the company or subsidiary","Beschrijving van de redenen voor de toekenning van rechten aan commissarissen om (certificaten van) aandelen in het kapitaal van de vennootschap of dochtermaatschappij te nemen of te verkrijgen"]
[731,"Description of the criteria for granting or exercising rights (certificates of) to acquire or receive shares in capital of company or daughter company","Beschrijving van de gehanteerde criteria die gelden voor de toekenning of uitoefening van de rechten om (certificaten van) aandelen in het kapitaal van de vennootschap of dochtermaatschappij te nemen of te verkrijgen"]
[732,"Conditions applying to number of granted rights (certificates of) to acquire or receive shares in capital of company or daughter company in the financial year","Voorwaarden van in het boekjaar verleende rechten om (certificaten van) aandelen in het kapitaal van de vennootschap of dochtermaatschappij te nemen of te verkrijgen"]
[733,"Description of the main conditions that apply to the exercise of the rights not yet exercised at the end of the financial year","Beschrijving van de belangrijkste voorwaarden die voor uitoefening van de aan het einde van het boekjaar nog niet uitgeoefende verleende rechten gelden"]
[734,"Description of the financing arrangements that apply to the granting of the rights not yet exercised at the end of the financial year","Beschrijving van de financieringsregelingen die bij de toekenning van de aan het einde van het boekjaar nog niet uitgeoefende verleende rechten gelden"]
[735,"Disclosure of the purchase of treasury shares or issuance of new shares on behalf of exercising the rights granted","Informatieverschaffing over de inkoop van eigen aandelen of plaatsing van nieuwe aandelen ten behoeve van uitoefening van de verleende rechten"]
[736,"Description of other data that are important for the assessment of the value of the granted rights not yet exercised at the end of the financial year","Beschrijving van andere gegevens die voor de beoordeling van de waarde van de aan het einde van het boekjaar nog niet uitgeoefende verleende rechten van belang zijn"]
[737,"Disclosure of hedging of rights granted","Informatieverschaffing over de afdekking van verleende rechten"]
[738,"Description of the policy for hedging of rights granted","Beschrijving van het beleid ter afdekking van verleende rechten"]
[739,"Description of purchase commitments of shares or certificates of shares on behalf of rights granted","Beschrijving van verplichtingen tot aankoop uitstaande (certificaten van) aandelen in het kader van de verleende rechten"]
[740,"Type of shares or certificates that the rights granted not yet exercised by the end of the financial year claim rights provides","Soort aandelen of certificaten ervan waarop de aan het einde van het boekjaar nog niet uitgeoefende verleende rechten aanspraak geven"]
[741,"Notes to the financial statements - Loans, advances and guarantees: On behalf of managing and supervisory directors","Toelichting op de jaarrekening - Leningen, voorschotten en garanties: Ten behoeve van bestuurders en commissarissen"]
[742,"Disclosure of loans, advances and guarantees on behalf of managing and supervisory directors","Informatieverschaffing over leningen, voorschotten en garanties ten behoeve van bestuurders en commissarissen"]
[743,"Description of other significant conditions of loans, advances and guarantees on behalf of managing and supervisory directors","Belangrijkste overige bepalingen van leningen, voorschotten en garanties ten behoeve van bestuurders en commissarissen"]
[744,"Notes to the financial statements - Other notes","Toelichting op de jaarrekening - Overige toelichtingen"]
[745,"Disclosure of deviations from regulations based on true and fair view requirements","Informatieverschaffing over afwijkingen van de voorschriften op basis van het inzichtvereiste"]
[746,"Notification of differences and reasons that resulted in changes in the grouping of balance sheet items or income statement items","Opgave van de verschillen en redenen die tot aanpassing van de indeling van de balans en winst-en-verliesrekening hebben geleid"]
[747,"Signing of the financial statements","Ondertekening van de jaarrekening"]
[748,"Name of managing, supervisory directors and representative","Naam bestuurder, commissaris en vertegenwoordiger"]
[749,"Description Name of managing, supervisory directors and representative","Omschrijving Naam bestuurder, commissaris en vertegenwoordiger"]
[750,"Type of director","Soort bestuurder of commissaris"]
[751,"Name of the legal entity which functions as managing or supervisory director","Naam van de rechtspersoon die optreedt als bestuurder of commissaris"]
[752,"Location of signing by managing and supervisory directors","Locatie van de ondertekening door bestuurders en commissarissen"]
[753,"Date of signing by managing and supervisory directors","Datum van de ondertekening door bestuurders en commissarissen"]
[754,"Signed by director (Y/N)","Ondertekend door bestuurder of commissaris (J/N)"]
[755,"Reason why the director did not sign","Reden waarom de bestuurder of commissaris niet heeft ondertekend"]

{"sheet":"Pre-validation","index":3,"n_rows":279,"n_cols":6,"rows_kept":279,"cut":false,"hidden":true,"merged":[]}
[{"$f":"IF(NOT(Stamdata!$H$1178=\"\"),0,1)+AssertionId(\"existenceAssertion_SigningFinancialStatements_PrtExistence1\")","v":1}]
["KvK: Jaarverantwoording 2020 NLGAAP - kleine rechtspersonen - publicatiestukken","valueAssertion_BalanceSheet_PrtFST1SumOfChildrenDParentCredit1","`Equity` SHOULD be equal to the summation of the underlying values. ","non-blocking","IF(OR(not(AND(Stamdata!$D$93=\"\",Stamdata!$D$94=\"\",Stamdata!$D$95=\"\",Stamdata!$D$96=\"\",Stamdata!$D$97=\"\",Stamdata!$D$98=\"\",Stamdata!$D$99=\"\",Stamdata!$D$100=\"\",Stamdata!$D$101=\"\",Stamdata!$D$102=\"\")),not(0=0)),IF( Stamdata!$D$103 = sum(Stamdata!$D$93,Stamdata!$D$94,Stamdata!$D$95,Stamdata!$D$96,Stamdata!$D$97,Stamdata!$D$98,Stamdata!$D$99,Stamdata!$D$100,Stamdata!$D$101,Stamdata!$D$102)- 0,0,1),0)+AssertionId(\"valueAssertion_BalanceSheet_PrtFST1SumOfChildrenDParentCredit1\")","Stamdata!$D$103"]
["KvK: Jaarverantwoording 2020 NLGAAP - kleine rechtspersonen - publicatiestukken","valueAssertion_BalanceSheet_PrtFST1SumOfChildrenDParentCredit1","`Equity` SHOULD be equal to the summation of the underlying values. ","non-blocking","IF(OR(not(AND(Stamdata!$F$93=\"\",Stamdata!$F$94=\"\",Stamdata!$F$95=\"\",Stamdata!$F$96=\"\",Stamdata!$F$97=\"\",Stamdata!$F$98=\"\",Stamdata!$F$99=\"\",Stamdata!$F$100=\"\",Stamdata!$F$101=\"\",Stamdata!$F$102=\"\")),not(0=0)),IF( Stamdata!$F$103 = sum(Stamdata!$F$93,Stamdata!$F$94,Stamdata!$F$95,Stamdata!$F$96,Stamdata!$F$97,Stamdata!$F$98,Stamdata!$F$99,Stamdata!$F$100,Stamdata!$F$101,Stamdata!$F$102)- 0,0,1),0)+AssertionId(\"valueAssertion_BalanceSheet_PrtFST1SumOfChildrenDParentCredit1\")","Stamdata!$F$103"]
["KvK: Jaarverantwoording 2020 NLGAAP - kleine rechtspersonen - publicatiestukken","valueAssertion_BalanceSheet_PrtFST1SumOfChildrenDParentCredit2","`EquityAndLiabilities` SHOULD be equal to the summation of the underlying values. ","non-blocking","IF(OR(not(AND(Stamdata!$D$103=\"\",Stamdata!$D$105=\"\",Stamdata!$D$106=\"\",Stamdata!$D$107=\"\")),not(0=0)),IF( Stamdata!$D$108 = sum(Stamdata!$D$103,Stamdata!$D$105,Stamdata!$D$106,Stamdata!$D$107)- 0,0,1),0)+AssertionId(\"valueAssertion_BalanceSheet_PrtFST1SumOfChildrenDParentCredit2\")","Stamdata!$D$108"]
["KvK: Jaarverantwoording 2020 NLGAAP - kleine rechtspersonen - publicatiestukken","valueAssertion_BalanceSheet_PrtFST1SumOfChildrenDParentCredit2","`EquityAndLiabilities` SHOULD be equal to the summation of the underlying values. ","non-blocking","IF(OR(not(AND(Stamdata!$F$103=\"\",Stamdata!$F$105=\"\",Stamdata!$F$106=\"\",Stamdata!$F$107=\"\")),not(0=0)),IF( Stamdata!$F$108 = sum(Stamdata!$F$103,Stamdata!$F$105,Stamdata!$F$106,Stamdata!$F$107)- 0,0,1),0)+AssertionId(\"valueAssertion_BalanceSheet_PrtFST1SumOfChildrenDParentCredit2\")","Stamdata!$F$108"]
["KvK: Jaarverantwoording 2020 NLGAAP - kleine rechtspersonen - publicatiestukken","valueAssertion_BalanceSheet_PrtFST1SumOfChildrenDParentDebit1","`AssetsNoncurrent` SHOULD be equal to the summation of the underlying values. ","non-blocking","IF(OR(not(0=0),not(AND(Stamdata!$D$78=\"\",Stamdata!$D$79=\"\",Stamdata!$D$80=\"\",Stamdata!$D$81=\"\"))),IF( Stamdata!$D$82 = - 0+ sum(Stamdata!$D$78,Stamdata!$D$79,Stamdata!$D$80,Stamdata!$D$81),0,1),0)+AssertionId(\"valueAssertion_BalanceSheet_PrtFST1SumOfChildrenDParentDebit1\")","Stamdata!$D$82"]
["KvK: Jaarverantwoording 2020 NLGAAP - kleine rechtspersonen - publicatiestukken","valueAssertion_BalanceSheet_PrtFST1SumOfChildrenDParentDebit1","`AssetsNoncurrent` SHOULD be equal to the summation of the underlying values. ","non-blocking","IF(OR(not(0=0),not(AND(Stamdata!$F$78=\"\",Stamdata!$F$79=\"\",Stamdata!$F$80=\"\",Stamdata!$F$81=\"\"))),IF( Stamdata!$F$82 = - 0+ sum(Stamdata!$F$78,Stamdata!$F$79,Stamdata!$F$80,Stamdata!$F$81),0,1),0)+AssertionId(\"valueAssertion_BalanceSheet_PrtFST1SumOfChildrenDParentDebit1\")","Stamdata!$F$82"]
["KvK: Jaarverantwoording 2020 NLGAAP - kleine rechtspersonen - publicatiestukken","valueAssertion_BalanceSheet_PrtFST1SumOfChildrenDParentDebit2","`AssetsCurrent` SHOULD be equal to the summation of the underlying values. ","non-blocking","IF(OR(not(0=0),not(AND(Stamdata!$D$84=\"\",Stamdata!$D$85=\"\",Stamdata!$D$86=\"\",Stamdata!$D$87=\"\",Stamdata!$D$88=\"\"))),IF( Stamdata!$D$89 = - 0+ sum(Stamdata!$D$84,Stamdata!$D$85,Stamdata!$D$86,Stamdata!$D$87,Stamdata!$D$88),0,1),0)+AssertionId(\"valueAssertion_BalanceSheet_PrtFST1SumOfChildrenDParentDebit2\")","Stamdata!$D$89"]
["KvK: Jaarverantwoording 2020 NLGAAP - kleine rechtspersonen - publicatiestukken","valueAssertion_BalanceSheet_PrtFST1SumOfChildrenDParentDebit2","`AssetsCurrent` SHOULD be equal to the summation of the underlying values. ","non-blocking","IF(OR(not(0=0),not(AND(Stamdata!$F$84=\"\",Stamdata!$F$85=\"\",Stamdata!$F$86=\"\",Stamdata!$F$87=\"\",Stamdata!$F$88=\"\"))),IF( Stamdata!$F$89 = - 0+ sum(Stamdata!$F$84,Stamdata!$F$85,Stamdata!$F$86,Stamdata!$F$87,Stamdata!$F$88),0,1),0)+AssertionId(\"valueAssertion_BalanceSheet_PrtFST1SumOfChildrenDParentDebit2\")","Stamdata!$F$89"]
["KvK: Jaarverantwoording 2020 NLGAAP - kleine rechtspersonen - publicatiestukken","valueAssertion_BalanceSheet_PrtFST1SumOfChildrenDParentDebit3","`Assets` SHOULD be equal to the summation of the underlying values. ","non-blocking","IF(OR(not(0=0),not(AND(Stamdata!$D$82=\"\",Stamdata!$D$89=\"\"))),IF( Stamdata!$D$91 = - 0+ sum(Stamdata!$D$82,Stamdata!$D$89),0,1),0)+AssertionId(\"valueAssertion_BalanceSheet_PrtFST1SumOfChildrenDParentDebit3\")","Stamdata!$D$91"]
["KvK: Jaarverantwoording 2020 NLGAAP - kleine rechtspersonen - publicatiestukken","valueAssertion_BalanceSheet_PrtFST1SumOfChildrenDParentDebit3","`Assets` SHOULD be equal to the summation of the underlying values. ","non-blocking","IF(OR(not(0=0),not(AND(Stamdata!$F$82=\"\",Stamdata!$F$89=\"\"))),IF( Stamdata!$F$91 = - 0+ sum(Stamdata!$F$82,Stamdata!$F$89),0,1),0)+AssertionId(\"valueAssertion_BalanceSheet_PrtFST1SumOfChildrenDParentDebit3\")","Stamdata!$F$91"]
["KvK: Jaarverantwoording 2020 NLGAAP - kleine rechtspersonen - publicatiestukken","valueAssertion_BalanceSheet_PrtFST101Variable1","`EquityAndLiabilities` SHOULD be equal to + `Assets`. ","non-blocking","IF(+ sum(Stamdata!$D$91) = Stamdata!$D$108 ,0,1)+AssertionId(\"valueAssertion_BalanceSheet_PrtFST101Variable1\")","Stamdata!$D$91"]
["KvK: Jaarverantwoording 2020 NLGAAP - kleine rechtspersonen - publicatiestukken","valueAssertion_BalanceSheet_PrtFST101Variable1","`EquityAndLiabilities` SHOULD be equal to + `Assets`. ","non-blocking","IF(+ sum(Stamdata!$F$91) = Stamdata!$F$108 ,0,1)+AssertionId(\"valueAssertion_BalanceSheet_PrtFST101Variable1\")","Stamdata!$F$91"]
["KvK: Jaarverantwoording 2020 NLGAAP - kleine rechtspersonen - publicatiestukken","valueAssertion_BalanceSheet_PrtValueThnNoExistenceCovA1","`ResultForTheYear` SHOULD NOT be reported, because the reported value of `BalanceSheetBeforeAfterAppropriationResults` is equal to `Na`. ","non-blocking","IF(Stamdata!$D$76 = \"Na\",IF(Stamdata!$D$101=\"\",0,1),0)+AssertionId(\"valueAssertion_BalanceSheet_PrtValueThnNoExistenceCovA1\")","Stamdata!$D$101"]
["KvK: Jaarverantwoording 2020 NLGAAP - kleine rechtspersonen - publicatiestukken","valueAssertion_BalanceSheet_PrtValueThnNoExistenceCovA1","`ResultForTheYear` SHOULD NOT be reported, because the reported value of `BalanceSheetBeforeAfterAppropriationResults` is equal to `Na`. ","non-blocking","IF(Stamdata!$F$76 = \"Na\",IF(Stamdata!$F$101=\"\",0,1),0)+AssertionId(\"valueAssertion_BalanceSheet_PrtValueThnNoExistenceCovA1\")","Stamdata!$F$101"]
["KvK: Jaarverantwoording 2020 NLGAAP - kleine rechtspersonen - publicatiestukken","existenceAssertion_BalanceSheet_PrtOnlyReportFactPeriodEQParam1","`BalanceSheetBeforeAfterAppropriationResults` SHOULD not exist for any period other than the current period.","non-blocking","IF(NOT(Stamdata!$D$76=\"\"),0,1)+AssertionId(\"existenceAssertion_BalanceSheet_PrtOnlyReportFactPeriodEQParam1\")","Stamdata!$D$76"]
["KvK: Jaarverantwoording 2020 NLGAAP - kleine rechtspersonen - publicatiestukken","existenceAssertion_BalanceSheet_PrtOnlyReportFactPeriodEQParam1","`BalanceSheetBeforeAfterAppropriationResults` SHOULD not exist for any period other than the current period.","non-blocking","IF(NOT(Stamdata!$F$76=\"\"),0,1)+AssertionId(\"existenceAssertion_BalanceSheet_PrtOnlyReportFactPeriodEQParam1\")","Stamdata!$F$76"]
["KvK: Jaarverantwoording 2020 NLGAAP - kleine rechtspersonen - publicatiestukken","valueAssertion_DocumentInformation_PrtDateEarlier24HDateLater1","The date reported for `FinancialReportingPeriodPreviousEndDate` MUST be one day earlier than the date reported for `FinancialReportingPeriodCurrentStartDate`. ","blocking","IF((Stamdata!$D$54)+ 1 = (Stamdata!$D$51),0,1)+AssertionId(\"valueAssertion_DocumentInformation_PrtDateEarlier24HDateLater1\")","Stamdata!$D$51"]
["KvK: Jaarverantwoording 2020 NLGAAP - kleine rechtspersonen - publicatiestukken","valueAssertion_DocumentInformation_PrtDateEarlierDateLater1","The date reported for `FinancialReportingPeriodCurrentEndDate` MUST be earlier than the date reported for `DocumentAdoptionDate`. ","blocking","IF(Stamdata!$D$52 < Stamdata!$D$63,0,1)+AssertionId(\"valueAssertion_DocumentInformation_PrtDateEarlierDateLater1\")","Stamdata!$D$63"]
["KvK: Jaarverantwoording 2020 NLGAAP - kleine rechtspersonen - publicatiestukken","valueAssertion_DocumentInformation_PrtDateEarlierDateLater2","The date reported for `FinancialReportingPeriodPreviousStartDate` MUST be earlier than the date reported for `FinancialReportingPeriodPreviousEndDate`. ","blocking","IF(Stamdata!$D$53 < Stamdata!$D$54,0,1)+AssertionId(\"valueAssertion_DocumentInformation_PrtDateEarlierDateLater2\")","Stamdata!$D$54"]
["KvK: Jaarverantwoording 2020 NLGAAP - kleine rechtspersonen - publicatiestukken","valueAssertion_DocumentInformation_PrtDateEarlierDateLater3","The date reported for `FinancialReportingPeriodCurrentStartDate` MUST be earlier than the date reported for `FinancialReportingPeriodCurrentEndDate`. ","blocking","IF(Stamdata!$D$51 < Stamdata!$D$52,0,1)+AssertionId(\"valueAssertion_DocumentInformation_PrtDateEarlierDateLater3\")","Stamdata!$D$52"]
["KvK: Jaarverantwoording 2020 NLGAAP - kleine rechtspersonen - publicatiestukken","valueAssertion_DocumentInformation_PrtDateEarlierEQDateLater1","The date reported for `FinancialStatementsDateOfPreparation` SHOULD be earlier than, or equal to, the date reported for `DocumentAdoptionDate`. ","blocking","IF(Stamdata!$D$61 <= Stamdata!$D$63,0,1)+AssertionId(\"valueAssertion_DocumentInformation_PrtDateEarlierEQDateLater1\")","Stamdata!$D$63"]
["KvK: Jaarverantwoording 2020 NLGAAP - kleine rechtspersonen - publicatiestukken","valueAssertion_DocumentInformation_PrtDateEarlierEQYearDateLaterThnValue1","The reported value of `FinancialReportingPeriodDifferentThanAnnualStatus` SHOULD be equal to `Nee`, because the period from `FinancialReportingPeriodCurrentStartDate` to `FinancialReportingPeriodCurrentEndDate` is equal to the standard reporting period of one year. ","blocking","IF(((Stamdata!$D$51) + 365 - xs:dayTimeDuration(\"PT24H) = (Stamdata!$D$52),IF(Stamdata!$D$55 = \"Nee\",0,1),0)+AssertionId(\"valueAssertion_DocumentInformation_PrtDateEarlierEQYearDateLaterThnValue1\")","Stamdata!$D$55"]
["KvK: Jaarverantwoording 2020 NLGAAP - kleine rechtspersonen - publicatiestukken","valueAssertion_DocumentInformation_PrtDateEarlierNEYearDateLaterThnValue1","The reported value of `FinancialReportingPeriodDifferentThanAnnualStatus` SHOULD be equal to `Ja`, because the period from `FinancialReportingPeriodCurrentStartDate` to `FinancialReportingPeriodCurrentEndDate` differs from than the standard reporting period of one year. ","blocking","IF(((Stamdata!$D$51) + 365 - xs:dayTimeDuration(\"PT24H) <> (Stamdata!$D$52),IF(Stamdata!$D$55 = \"Ja\",0,1),0)+AssertionId(\"valueAssertion_DocumentInformation_PrtDateEarlierNEYearDateLaterThnValue1\")","Stamdata!$D$55"]
["KvK: Jaarverantwoording 2020 NLGAAP - kleine rechtspersonen - publicatiestukken","valueAssertion_DocumentInformation_PrtDateEarlierThanCurrent1","The date reported for `FinancialReportingPeriodCurrentEndDate` SHOULD be earlier than the current date. ","blocking","IF(Stamdata!$D$52 < NOW,0,1)+AssertionId(\"valueAssertion_DocumentInformation_PrtDateEarlierThanCurrent1\")","Stamdata!$D$52"]
["KvK: Jaarverantwoording 2020 NLGAAP - kleine rechtspersonen - publicatiestukken","valueAssertion_DocumentInformation_PrtDateEarlierThanEQDateCurrent1","The date reported for `DocumentAdoptionDate` SHOULD be earlier than, or equal to, the current date. ","blocking","IF(Stamdata!$D$63 <= NOW,0,1)+AssertionId(\"valueAssertion_DocumentInformation_PrtDateEarlierThanEQDateCurrent1\")","Stamdata!$D$63"]
["KvK: Jaarverantwoording 2020 NLGAAP - kleine rechtspersonen - publicatiestukken","valueAssertion_DocumentInformation_PrtExistenceThnExistence1","`FinancialReportingPeriodPreviousStartDate` SHOULD exist at least once within the same context, because `FinancialReportingPeriodPreviousEndDate` is reported. ","blocking","IF(not(Stamdata!$D$53=\"\"),0,1)+AssertionId(\"valueAssertion_DocumentInformation_PrtExistenceThnExistence1\")","Stamdata!$D$53"]
["KvK: Jaarverantwoording 2020 NLGAAP - kleine rechtspersonen - publicatiestukken","valueAssertion_DocumentInformation_PrtExistenceThnExistence2","`FinancialReportingPeriodPreviousEndDate` SHOULD exist at least once within the same context, because `FinancialReportingPeriodPreviousStartDate` is reported. ","blocking","IF(not(Stamdata!$D$54=\"\"),0,1)+AssertionId(\"valueAssertion_DocumentInformation_PrtExistenceThnExistence2\")","Stamdata!$D$54"]
["KvK: Jaarverantwoording 2020 NLGAAP - kleine rechtspersonen - publicatiestukken","valueAssertion_DocumentInformation_PrtValueThnExistence1","`FinancialReportingPeriodDifferentThanAnnualReason` SHOULD exist at least once, because the reported value of `FinancialReportingPeriodDifferentThanAnnualStatus` is equal to `Ja`. ","blocking","IF(Stamdata!$D$55 = \"Ja\",IF(not(Stamdata!$D$56=\"\"),0,1),0)+AssertionId(\"valueAssertion_DocumentInformation_PrtValueThnExistence1\")","Stamdata!$D$56"]
["KvK: Jaarverantwoording 2020 NLGAAP - kleine rechtspersonen - publicatiestukken","valueAssertion_DocumentInformation_PrtValueThnExistence2","`FinancialReportingPeriodDifferentThanAnnualImpactComparatives` SHOULD exist at least once, because the reported value of `FinancialReportingPeriodDifferentThanAnnualStatus` is equal to `Ja`. ","blocking","IF(Stamdata!$D$55 = \"Ja\",IF(not(Stamdata!$D$57=\"\"),0,1),0)+AssertionId(\"valueAssertion_DocumentInformation_PrtValueThnExistence2\")","Stamdata!$D$57"]
["KvK: Jaarverantwoording 2020 NLGAAP - kleine rechtspersonen - publicatiestukken","valueAssertion_DocumentInformation_PrtValueThnExistence3","`DocumentAdoptionDate` MUST exist at least once, because the reported value of `DocumentAdoptionStatus` is equal to `Ja`. ","blocking","IF(Stamdata!$D$62 = \"Ja\",IF(not(Stamdata!$D$63=\"\"),0,1),0)+AssertionId(\"valueAssertion_DocumentInformation_PrtValueThnExistence3\")","Stamdata!$D$63"]
["KvK: Jaarverantwoording 2020 NLGAAP - kleine rechtspersonen - publicatiestukken","valueAssertion_DocumentInformation_PrtValueThnExistence4","`DocumentResubmissionDueToTechnicalAndOrProcesRelatedInaccuraciesExplanation` MUST exist at least once, because the reported value of `DocumentResubmissionDueToTechnicalAndOrProcesRelatedInaccuracies` is equal to `Ja`. ","blocking","IF(Stamdata!$D$66 = \"Ja\",IF(not(Stamdata!$D$67=\"\"),0,1),0)+AssertionId(\"valueAssertion_DocumentInformation_PrtValueThnExistence4\")","Stamdata!$D$67"]
["KvK: Jaarverantwoording 2020 NLGAAP - kleine rechtspersonen - publicatiestukken","valueAssertion_DocumentInformation_PrtValueThnExistence5","`DocumentResubmissionDueToUnsurmountableInaccuraciesExplanation` MUST exist at least once, because the reported value of `DocumentResubmissionDueToUnsurmountableInaccuracies` is equal to `Ja`. ","blocking","IF(Stamdata!$D$64 = \"Ja\",IF(not(Stamdata!$D$65=\"\"),0,1),0)+AssertionId(\"valueAssertion_DocumentInformation_PrtValueThnExistence5\")","Stamdata!$D$65"]
["KvK: Jaarverantwoording 2020 NLGAAP - kleine rechtspersonen - publicatiestukken","valueAssertion_DocumentInformation_PrtValueThnNoExistence1","`FinancialReportingPeriodDifferentThanAnnualImpactComparatives` SHOULD NOT be reported, because the reported value of `FinancialReportingPeriodDifferentThanAnnualStatus` is equal to `Nee`. ","blocking","IF(Stamdata!$D$55 = \"Nee\",IF(Stamdata!$D$57=\"\",0,1),0)+AssertionId(\"valueAssertion_DocumentInformation_PrtValueThnNoExistence1\")","Stamdata!$D$57"]
["KvK: Jaarverantwoording 2020 NLGAAP - kleine rechtspersonen - publicatiestukken","valueAssertion_DocumentInformation_PrtValueThnNoExistence2","`DocumentAdoptionDate` MUST NOT be reported, because the reported value of `DocumentAdoptionStatus` is equal to `Nee`. ","blocking","IF(Stamdata!$D$62 = \"Nee\",IF(Stamdata!$D$63=\"\",0,1),0)+AssertionId(\"valueAssertion_DocumentInformation_PrtValueThnNoExistence2\")","Stamdata!$D$63"]
["KvK: Jaarverantwoording 2020 NLGAAP - kleine rechtspersonen - publicatiestukken","valueAssertion_DocumentInformation_PrtValueThnNoExistence3","`FinancialReportingPeriodDifferentThanAnnualReason` SHOULD NOT be reported, because the reported value of `FinancialReportingPeriodDifferentThanAnnualStatus` is equal to `Nee`. ","blocking","IF(Stamdata!$D$55 = \"Nee\",IF(Stamdata!$D$56=\"\",0,1),0)+AssertionId(\"valueAssertion_DocumentInformation_PrtValueThnNoExistence3\")","Stamdata!$D$56"]
["KvK: Jaarverantwoording 2020 NLGAAP - kleine rechtspersonen - publicatiestukken","existenceAssertion_DocumentInformation_PrtExistOnce1","`EmailAddressFull` MUST exist once.","blocking","IF(NOT(Stamdata!$D$68=\"\"),0,1)+AssertionId(\"existenceAssertion_DocumentInformation_PrtExistOnce1\")","Stamdata!$D$68"]
["KvK: Jaarverantwoording 2020 NLGAAP - kleine rechtspersonen - publicatiestukken","existenceAssertion_DocumentInformation_PrtExistOnce3","`FinancialReportingPeriodCurrentEndDate` MUST exist once.","blocking","IF(NOT(Stamdata!$D$52=\"\"),0,1)+AssertionId(\"existenceAssertion_DocumentInformation_PrtExistOnce3\")","Stamdata!$D$52"]
["KvK: Jaarverantwoording 2020 NLGAAP - kleine rechtspersonen - publicatiestukken","existenceAssertion_DocumentInformation_PrtExistOnce4","`DocumentPresentationCurrency` MUST exist once.","blocking","IF(NOT(Stamdata!$D$59=\"\"),0,1)+AssertionId(\"existenceAssertion_DocumentInformation_PrtExistOnce4\")","Stamdata!$D$59"]
["KvK: Jaarverantwoording 2020 NLGAAP - kleine rechtspersonen - publicatiestukken","existenceAssertion_DocumentInformation_PrtExistOnce5","`FinancialReportingPeriodDifferentThanAnnualStatus` MUST exist once.","blocking","IF(NOT(Stamdata!$D$55=\"\"),0,1)+AssertionId(\"existenceAssertion_DocumentInformation_PrtExistOnce5\")","Stamdata!$D$55"]
["KvK: Jaarverantwoording 2020 NLGAAP - kleine rechtspersonen - publicatiestukken","existenceAssertion_DocumentInformation_PrtExistOnce6","`DocumentAdoptionStatus` MUST exist once.","blocking","IF(NOT(Stamdata!$D$62=\"\"),0,1)+AssertionId(\"existenceAssertion_DocumentInformation_PrtExistOnce6\")","Stamdata!$D$62"]
["KvK: Jaarverantwoording 2020 NLGAAP - kleine rechtspersonen - publicatiestukken","existenceAssertion_DocumentInformation_PrtExistOnce8","`FinancialReportingPeriodCurrentStartDate` MUST exist once.","blocking","IF(NOT(Stamdata!$D$51=\"\"),0,1)+AssertionId(\"existenceAssertion_DocumentInformation_PrtExistOnce8\")","Stamdata!$D$51"]
["KvK: Jaarverantwoording 2020 NLGAAP - kleine rechtspersonen - publicatiestukken","existenceAssertion_DocumentInformation_PrtExistOnce10","`FinancialStatementsDateOfPreparation` MUST exist once.","blocking","IF(NOT(Stamdata!$D$61=\"\"),0,1)+AssertionId(\"existenceAssertion_DocumentInformation_PrtExistOnce10\")","Stamdata!$D$61"]
["KvK: Jaarverantwoording 2020 NLGAAP - kleine rechtspersonen - publicatiestukken","existenceAssertion_DocumentInformation_PrtExistOnceMax1","`FinancialReportingPeriodPreviousEndDate` MUST not exist or at most once.","blocking","IF(NOT(Stamdata!$D$54=\"\"),0,1)+AssertionId(\"existenceAssertion_DocumentInformation_PrtExistOnceMax1\")","Stamdata!$D$54"]
["KvK: Jaarverantwoording 2020 NLGAAP - kleine rechtspersonen - publicatiestukken","existenceAssertion_DocumentInformation_PrtExistOnceMax2","`FinancialReportingPeriodPreviousStartDate` MUST not exist or at most once.","blocking","IF(NOT(Stamdata!$D$53=\"\"),0,1)+AssertionId(\"existenceAssertion_DocumentInformation_PrtExistOnceMax2\")","Stamdata!$D$53"]
["KvK: Jaarverantwoording 2020 NLGAAP - kleine rechtspersonen - publicatiestukken","existenceAssertion_DocumentInformation_PrtExistOnce2","`BasisOfPreparation` MUST exist once.","blocking","IF(NOT(Stamdata!$D$58=\"\"),0,1)+AssertionId(\"existenceAssertion_DocumentInformation_PrtExistOnce2\")","Stamdata!$D$58"]
["KvK: Jaarverantwoording 2020 NLGAAP - kleine rechtspersonen - publicatiestukken","valueAssertion_EntityAddress_PrtExistenceThnNoExistenceCovA1","`DescriptionLocationNL` MUST NOT be reported, because `PlaceOfResidenceAbroad` is reported. ","blocking","IF(Stamdata!$D$33=\"\",0,1)+AssertionId(\"valueAssertion_EntityAddress_PrtExistenceThnNoExistenceCovA1\")","Stamdata!$D$33"]
["KvK: Jaarverantwoording 2020 NLGAAP - kleine rechtspersonen - publicatiestukken","valueAssertion_EntityAddress_PrtExistenceThnNoExistenceCovA2","`StreetNameNL` MUST NOT be reported, because `PlaceOfResidenceAbroad` is reported. ","blocking","IF(Stamdata!$D$34=\"\",0,1)+AssertionId(\"valueAssertion_EntityAddress_PrtExistenceThnNoExistenceCovA2\")","Stamdata!$D$34"]
["KvK: Jaarverantwoording 2020 NLGAAP - kleine rechtspersonen - publicatiestukken","valueAssertion_EntityAddress_PrtExistenceThnNoExistenceCovA3","`HouseNumberNL` MUST NOT be reported, because `PlaceOfResidenceAbroad` is reported. ","blocking","IF(Stamdata!$D$35=\"\",0,1)+AssertionId(\"valueAssertion_EntityAddress_PrtExistenceThnNoExistenceCovA3\")","Stamdata!$D$35"]
["KvK: Jaarverantwoording 2020 NLGAAP - kleine rechtspersonen - publicatiestukken","valueAssertion_EntityAddress_PrtExistenceThnNoExistenceCovA4","`HouseNumberAddition` MUST NOT be reported, because `PlaceOfResidenceAbroad` is reported. ","blocking","IF(Stamdata!$D$36=\"\",0,1)+AssertionId(\"valueAssertion_EntityAddress_PrtExistenceThnNoExistenceCovA4\")","Stamdata!$D$36"]
["KvK: Jaarverantwoording 2020 NLGAAP - kleine rechtspersonen - publicatiestukken","valueAssertion_EntityAddress_PrtExistenceThnNoExistenceCovA5","`POBoxNumber` MUST NOT be reported, because `PlaceOfResidenceAbroad` is reported. ","blocking","IF(Stamdata!$D$37=\"\",0,1)+AssertionId(\"valueAssertion_EntityAddress_PrtExistenceThnNoExistenceCovA5\")","Stamdata!$D$37"]
["KvK: Jaarverantwoording 2020 NLGAAP - kleine rechtspersonen - publicatiestukken","valueAssertion_EntityAddress_PrtExistenceThnNoExistenceCovA6","`DescriptionLocationAbroad` MUST NOT be reported, because `PlaceOfResidenceNL` is reported. ","blocking","IF(Stamdata!$D$40=\"\",0,1)+AssertionId(\"valueAssertion_EntityAddress_PrtExistenceThnNoExistenceCovA6\")","Stamdata!$D$40"]
["KvK: Jaarverantwoording 2020 NLGAAP - kleine rechtspersonen - publicatiestukken","valueAssertion_EntityAddress_PrtExistenceThnNoExistenceCovA7","`StreetNameAbroad` MUST NOT be reported, because `PlaceOfResidenceNL` is reported. ","blocking","IF(Stamdata!$D$41=\"\",0,1)+AssertionId(\"valueAssertion_EntityAddress_PrtExistenceThnNoExistenceCovA7\")","Stamdata!$D$41"]
["KvK: Jaarverantwoording 2020 NLGAAP - kleine rechtspersonen - publicatiestukken","valueAssertion_EntityAddress_PrtExistenceThnNoExistenceCovA8","`HouseNumberAbroad` MUST NOT be reported, because `PlaceOfResidenceNL` is reported. ","blocking","IF(Stamdata!$D$42=\"\",0,1)+AssertionId(\"valueAssertion_EntityAddress_PrtExistenceThnNoExistenceCovA8\")","Stamdata!$D$42"]
["KvK: Jaarverantwoording 2020 NLGAAP - kleine rechtspersonen - publicatiestukken","valueAssertion_EntityAddress_PrtExistenceThnNoExistenceCovA9","`PostalCodeAbroad` MUST NOT be reported, because `PlaceOfResidenceNL` is reported. ","blocking","IF(Stamdata!$D$43=\"\",0,1)+AssertionId(\"valueAssertion_EntityAddress_PrtExistenceThnNoExistenceCovA9\")","Stamdata!$D$43"]
["KvK: Jaarverantwoording 2020 NLGAAP - kleine rechtspersonen - publicatiestukken","existenceAssertion_EntityAddress_PrtExist02XOR1","`PlaceOfResidenceNL` or `PlaceOfResidenceAbroad` MUST exist once.","blocking","IF(OR(NOT(Stamdata!$D$39=\"\"),NOT(Stamdata!$D$44=\"\")),0,1)+AssertionId(\"existenceAssertion_EntityAddress_PrtExist02XOR1\")","Stamdata!$D$39,Stamdata!$D$44"]
["KvK: Jaarverantwoording 2020 NLGAAP - kleine rechtspersonen - publicatiestukken","existenceAssertion_EntityAddress_PrtExist02XOR2","`PostalCodeNL` or `PlaceOfResidenceAbroad` MUST exist once.","blocking","IF(OR(NOT(Stamdata!$D$38=\"\"),NOT(Stamdata!$D$44=\"\")),0,1)+AssertionId(\"existenceAssertion_EntityAddress_PrtExist02XOR2\")","Stamdata!$D$38,Stamdata!$D$44"]
["KvK: Jaarverantwoording 2020 NLGAAP - kleine rechtspersonen - publicatiestukken","existenceAssertion_EntityInformation_PrtExistOnce2","`LegalEntityRegisteredOffice` MUST exist once.","blocking","IF(NOT(Stamdata!$D$25=\"\"),0,1)+AssertionId(\"existenceAssertion_EntityInformation_PrtExistOnce2\")","Stamdata!$D$25"]
["KvK: Jaarverantwoording 2020 NLGAAP - kleine rechtspersonen - publicatiestukken","existenceAssertion_EntityInformation_PrtExistOnce3","`LegalEntityName` MUST exist once.","blocking","IF(NOT(Stamdata!$D$23=\"\"),0,1)+AssertionId(\"existenceAssertion_EntityInformation_PrtExistOnce3\")","Stamdata!$D$23"]
["KvK: Jaarverantwoording 2020 NLGAAP - kleine rechtspersonen - publicatiestukken","existenceAssertion_EntityInformation_PrtExistOnce4","`ChamberOfCommerceRegistrationNumber` MUST exist once.","blocking","IF(NOT(Stamdata!$D$26=\"\"),0,1)+AssertionId(\"existenceAssertion_EntityInformation_PrtExistOnce4\")","Stamdata!$D$26"]
["KvK: Jaarverantwoording 2020 NLGAAP - kleine rechtspersonen - publicatiestukken","existenceAssertion_EntityInformation_PrtExistOnce5","`LegalEntityLegalForm` MUST exist once.","blocking","IF(NOT(Stamdata!$D$24=\"\"),0,1)+AssertionId(\"existenceAssertion_EntityInformation_PrtExistOnce5\")","Stamdata!$D$24"]
["KvK: Jaarverantwoording 2020 NLGAAP - kleine rechtspersonen - publicatiestukken","existenceAssertion_EntityInformation_PrtExistOnce1","`LegalSizeCriteriaClassification` MUST exist once.","blocking","IF(NOT(Stamdata!$D$28=\"\"),0,1)+AssertionId(\"existenceAssertion_EntityInformation_PrtExistOnce1\")","Stamdata!$D$28"]
["KvK: Jaarverantwoording 2020 NLGAAP - kleine rechtspersonen - publicatiestukken","valueAssertion_EntityInformation_PrtValueNE2","The reported value of `LegalSizeCriteriaClassification` MUST NOT be `Middelgroot`. ","blocking","IF(Stamdata!$D$28 <> \"Middelgroot\",0,1)+AssertionId(\"valueAssertion_EntityInformation_PrtValueNE2\")","Stamdata!$D$28"]
["KvK: Jaarverantwoording 2020 NLGAAP - kleine rechtspersonen - publicatiestukken","valueAssertion_EntityInformation_PrtValueNE1","The reported value of `LegalSizeCriteriaClassification` MUST NOT be `Groot`. ","blocking","IF(Stamdata!$D$28 <> \"Groot\",0,1)+AssertionId(\"valueAssertion_EntityInformation_PrtValueNE1\")","Stamdata!$D$28"]
["KvK: Jaarverantwoording 2020 NLGAAP - kleine rechtspersonen - publicatiestukken","valueAssertion_NotesAverageNumberOfEmployeesBreakdown_PrtFST102Variables1","`AverageNumberEmployees` SHOULD be equal to + `AverageNumberEmployeesNetherlands` + `AverageNumberEmployeesAbroad`. ","non-blocking","IF(OR(not(Stamdata!$D$868Netherlands=\"\"),not(Stamdata!$D$868Abroad=\"\")),IF(+ sum(Stamdata!$D$868Netherlands) + sum(Stamdata!$D$868Abroad) = Stamdata!$D$868 ,0,1),0)+AssertionId(\"valueAssertion_NotesAverageNumberOfEmployeesBreakdown_PrtFST102Variables1\")","Stamdata!$D$868"]
["KvK: Jaarverantwoording 2020 NLGAAP - kleine rechtspersonen - publicatiestukken","valueAssertion_NotesAverageNumberOfEmployeesBreakdown_PrtFST102Variables1","`AverageNumberEmployees` SHOULD be equal to + `AverageNumberEmployeesNetherlands` + `AverageNumberEmployeesAbroad`. ","non-blocking","IF(OR(not(Stamdata!$F$868Netherlands=\"\"),not(Stamdata!$F$868Abroad=\"\")),IF(+ sum(Stamdata!$F$868Netherlands) + sum(Stamdata!$F$868Abroad) = Stamdata!$F$868 ,0,1),0)+AssertionId(\"valueAssertion_NotesAverageNumberOfEmployeesBreakdown_PrtFST102Variables1\")","Stamdata!$F$868"]
["KvK: Jaarverantwoording 2020 NLGAAP - kleine rechtspersonen - publicatiestukken","existenceAssertion_NotesAverageNumberOfEmployeesBreakdown_PrtExistence1","`AverageNumberEmployees` SHOULD exist at least once.","non-blocking","IF(NOT(Stamdata!$D$868=\"\"),0,1)+AssertionId(\"existenceAssertion_NotesAverageNumberOfEmployeesBreakdown_PrtExistence1\")","Stamdata!$D$868"]
["KvK: Jaarverantwoording 2020 NLGAAP - kleine rechtspersonen - publicatiestukken","existenceAssertion_NotesAverageNumberOfEmployeesBreakdown_PrtExistence1","`AverageNumberEmployees` SHOULD exist at least once.","non-blocking","IF(NOT(Stamdata!$F$868=\"\"),0,1)+AssertionId(\"existenceAssertion_NotesAverageNumberOfEmployeesBreakdown_PrtExistence1\")","Stamdata!$F$868"]
["KvK: Jaarverantwoording 2020 NLGAAP - kleine rechtspersonen - publicatiestukken","valueAssertion_NotesIntangibleAssetsBreakdown_PrtFST1SumOfChildrenParentDebit1","`IntangibleAssets` SHOULD be equal to the summation of the underlying values. ","non-blocking","IF(OR(not(0=0),not(AND(Stamdata!$D$402=\"\",Stamdata!$D$403=\"\"))),IF( Stamdata!$D$405 = - 0+ sum(Stamdata!$D$402,Stamdata!$D$403),0,1),0)+AssertionId(\"valueAssertion_NotesIntangibleAssetsBreakdown_PrtFST1SumOfChildrenParentDebit1\")","Stamdata!$D$405"]
["KvK: Jaarverantwoording 2020 NLGAAP - kleine rechtspersonen - publicatiestukken","valueAssertion_NotesIntangibleAssetsBreakdown_PrtFST1SumOfChildrenParentDebit1","`IntangibleAssets` SHOULD be equal to the summation of the underlying values. ","non-blocking","IF(OR(not(0=0),not(AND(Stamdata!$F$402=\"\",Stamdata!$F$403=\"\"))),IF( Stamdata!$F$405 = - 0+ sum(Stamdata!$F$402,Stamdata!$F$403),0,1),0)+AssertionId(\"valueAssertion_NotesIntangibleAssetsBreakdown_PrtFST1SumOfChildrenParentDebit1\")","Stamdata!$F$405"]
["KvK: Jaarverantwoording 2020 NLGAAP - kleine rechtspersonen - publicatiestukken","valueAssertion_NotesLegalReservesBreakdown_PrtFST1SumOfChildrenParentCredit1","`LegalReserves` SHOULD be equal to the summation of the underlying values. ","non-blocking","IF(OR(not(AND(Stamdata!$D$668=\"\",Stamdata!$D$669=\"\",Stamdata!$D$670=\"\",Stamdata!$D$671=\"\",Stamdata!$D$672=\"\",Stamdata!$D$673=\"\",Stamdata!$D$674=\"\",Stamdata!$D$675=\"\",Stamdata!$D$676=\"\")),not(0=0)),IF( Stamdata!$D$678 = sum(Stamdata!$D$668,Stamdata!$D$669,Stamdata!$D$670,Stamdata!$D$671,Stamdata!$D$672,Stamdata!$D$673,Stamdata!$D$674,Stamdata!$D$675,Stamdata!$D$676)- 0,0,1),0)+AssertionId(\"valueAssertion_NotesLegalReservesBreakdown_PrtFST1SumOfChildrenParentCredit1\")","Stamdata!$D$678"]
["KvK: Jaarverantwoording 2020 NLGAAP - kleine rechtspersonen - publicatiestukken","valueAssertion_NotesLegalReservesBreakdown_PrtFST1SumOfChildrenParentCredit1","`LegalReserves` SHOULD be equal to the summation of the underlying values. ","non-blocking","IF(OR(not(AND(Stamdata!$F$668=\"\",Stamdata!$F$669=\"\",Stamdata!$F$670=\"\",Stamdata!$F$671=\"\",Stamdata!$F$672=\"\",Stamdata!$F$673=\"\",Stamdata!$F$674=\"\",Stamdata!$F$675=\"\",Stamdata!$F$676=\"\")),not(0=0)),IF( Stamdata!$F$678 = sum(Stamdata!$F$668,Stamdata!$F$669,Stamdata!$F$670,Stamdata!$F$671,Stamdata!$F$672,Stamdata!$F$673,Stamdata!$F$674,Stamdata!$F$675,Stamdata!$F$676)- 0,0,1),0)+AssertionId(\"valueAssertion_NotesLegalReservesBreakdown_PrtFST1SumOfChildrenParentCredit1\")","Stamdata!$F$678"]
["KvK: Jaarverantwoording 2020 NLGAAP - kleine rechtspersonen - publicatiestukken","valueAssertion_NotesNoncurrentLiabilitiesBreakdown_PrtFST1SumOfChildrenParentCredit1","`LiabilitiesNoncurrent` SHOULD be equal to the summation of the underlying values. ","non-blocking","IF(OR(not(AND(Stamdata!$D$734=\"\",Stamdata!$D$735=\"\")),not(0=0)),IF( Stamdata!$D$737 = sum(Stamdata!$D$734,Stamdata!$D$735)- 0,0,1),0)+AssertionId(\"valueAssertion_NotesNoncurrentLiabilitiesBreakdown_PrtFST1SumOfChildrenParentCredit1\")","Stamdata!$D$737"]
["KvK: Jaarverantwoording 2020 NLGAAP - kleine rechtspersonen - publicatiestukken","valueAssertion_NotesNoncurrentLiabilitiesBreakdown_PrtFST1SumOfChildrenParentCredit1","`LiabilitiesNoncurrent` SHOULD be equal to the summation of the underlying values. ","non-blocking","IF(OR(not(AND(Stamdata!$F$734=\"\",Stamdata!$F$735=\"\")),not(0=0)),IF( Stamdata!$F$737 = sum(Stamdata!$F$734,Stamdata!$F$735)- 0,0,1),0)+AssertionId(\"valueAssertion_NotesNoncurrentLiabilitiesBreakdown_PrtFST1SumOfChildrenParentCredit1\")","Stamdata!$F$737"]
["KvK: Jaarverantwoording 2020 NLGAAP - kleine rechtspersonen - publicatiestukken","valueAssertion_NotesPaymentsDueToTerminationEmploymentSeniorOfficialsSpecification_PrtFST102Variables1","`AmountExceedingMaximumRemuneration` SHOULD be equal to + `PaymentsDueToTerminationOfTheEmploymentIncludingUnduePayments` - `IndividualMaximumPaymentDueToTerminationOfTheEmployment`. ","non-blocking","IF(OR(not(Stamdata!$D$892=\"\"),not(Stamdata!$D$891=\"\")),IF(+ sum(Stamdata!$D$892) - sum(Stamdata!$D$891) = Stamdata!$D$895 ,0,1),0)+AssertionId(\"valueAssertion_NotesPaymentsDueToTerminationEmploymentSeniorOfficialsSpecification_PrtFST102Variables1\")","Stamdata!$D$895"]
["KvK: Jaarverantwoording 2020 NLGAAP - kleine rechtspersonen - publicatiestukken","valueAssertion_NotesPaymentsDueToTerminationEmploymentSeniorOfficialsSpecification_PrtFST102Variables1","`AmountExceedingMaximumRemuneration` SHOULD be equal to + `PaymentsDueToTerminationOfTheEmploymentIncludingUnduePayments` - `IndividualMaximumPaymentDueToTerminationOfTheEmployment`. ","non-blocking","IF(OR(not(Stamdata!$E$892=\"\"),not(Stamdata!$E$891=\"\")),IF(+ sum(Stamdata!$E$892) - sum(Stamdata!$E$891) = Stamdata!$E$895 ,0,1),0)+AssertionId(\"valueAssertion_NotesPaymentsDueToTerminationEmploymentSeniorOfficialsSpecification_PrtFST102Variables1\")","Stamdata!$E$895"]
["KvK: Jaarverantwoording 2020 NLGAAP - kleine rechtspersonen - publicatiestukken","valueAssertion_NotesPaymentsDueToTerminationEmploymentSeniorOfficialsSpecification_PrtFST102Variables1","`AmountExceedingMaximumRemuneration` SHOULD be equal to + `PaymentsDueToTerminationOfTheEmploymentIncludingUnduePayments` - `IndividualMaximumPaymentDueToTerminationOfTheEmployment`. ","non-blocking","IF(OR(not(Stamdata!$F$892=\"\"),not(Stamdata!$F$891=\"\")),IF(+ sum(Stamdata!$F$892) - sum(Stamdata!$F$891) = Stamdata!$F$895 ,0,1),0)+AssertionId(\"valueAssertion_NotesPaymentsDueToTerminationEmploymentSeniorOfficialsSpecification_PrtFST102Variables1\")","Stamdata!$F$895"]
["KvK: Jaarverantwoording 2020 NLGAAP - kleine rechtspersonen - publicatiestukken","valueAssertion_NotesPaymentsDueToTerminationEmploymentSeniorOfficialsSpecification_PrtFST102Variables1","`AmountExceedingMaximumRemuneration` SHOULD be equal to + `PaymentsDueToTerminationOfTheEmploymentIncludingUnduePayments` - `IndividualMaximumPaymentDueToTerminationOfTheEmployment`. ","non-blocking","IF(OR(not(Stamdata!$G$892=\"\"),not(Stamdata!$G$891=\"\")),IF(+ sum(Stamdata!$G$892) - sum(Stamdata!$G$891) = Stamdata!$G$895 ,0,1),0)+AssertionId(\"valueAssertion_NotesPaymentsDueToTerminationEmploymentSeniorOfficialsSpecification_PrtFST102Variables1\")","Stamdata!$G$895"]
["KvK: Jaarverantwoording 2020 NLGAAP - kleine rechtspersonen - publicatiestukken","valueAssertion_NotesPaymentsDueToTerminationEmploymentSeniorOfficialsSpecification_PrtFST102Variables1","`AmountExceedingMaximumRemuneration` SHOULD be equal to + `PaymentsDueToTerminationOfTheEmploymentIncludingUnduePayments` - `IndividualMaximumPaymentDueToTerminationOfTheEmployment`. ","non-blocking","IF(OR(not(Stamdata!$H$892=\"\"),not(Stamdata!$H$891=\"\")),IF(+ sum(Stamdata!$H$892) - sum(Stamdata!$H$891) = Stamdata!$H$895 ,0,1),0)+AssertionId(\"valueAssertion_NotesPaymentsDueToTerminationEmploymentSeniorOfficialsSpecification_PrtFST102Variables1\")","Stamdata!$H$895"]
["KvK: Jaarverantwoording 2020 NLGAAP - kleine rechtspersonen - publicatiestukken","valueAssertion_NotesReceivablesBreakdownMaturity_PrtFST1SumOfChildrenParentDebit1","`Receivables` SHOULD be equal to the summation of the underlying values. ","non-blocking","IF(OR(not(0=0),not(AND(Stamdata!$D$518=\"\",Stamdata!$D$519=\"\"))),IF( Stamdata!$D$521 = - 0+ sum(Stamdata!$D$518,Stamdata!$D$519),0,1),0)+AssertionId(\"valueAssertion_NotesReceivablesBreakdownMaturity_PrtFST1SumOfChildrenParentDebit1\")","Stamdata!$D$521"]
["KvK: Jaarverantwoording 2020 NLGAAP - kleine rechtspersonen - publicatiestukken","valueAssertion_NotesReceivablesBreakdownMaturity_PrtFST1SumOfChildrenParentDebit2","`ReceivablesOtherCurrent` SHOULD be equal to the summation of the underlying values. ","non-blocking","IF(OR(not(0=0),not(0=0)),IF( Stamdata!$D$519 = - 0+ 0,0,1),0)+AssertionId(\"valueAssertion_NotesReceivablesBreakdownMaturity_PrtFST1SumOfChildrenParentDebit2\")","Stamdata!$D$519"]
["KvK: Jaarverantwoording 2020 NLGAAP - kleine rechtspersonen - publicatiestukken","valueAssertion_NotesReceivablesBreakdownMaturity_PrtFST1SumOfChildrenParentDebit3","`AccruedIncome` SHOULD be equal to the summation of the underlying values. ","non-blocking","De index valt buiten het bereik. Deze mag niet negatief zijn en moet kleiner zijn dan de grootte van de verzameling.\r\nParameternaam: index"]
["KvK: Jaarverantwoording 2020 NLGAAP - kleine rechtspersonen - publicatiestukken","valueAssertion_NotesReceivablesBreakdown_PrtFST1SumOfChildrenParentDebit1","`Receivables` SHOULD be equal to the summation of the underlying values. ","non-blocking","IF(OR(not(0=0),not(AND(Stamdata!$D$503=\"\",Stamdata!$D$504=\"\"))),IF( Stamdata!$D$506 = - 0+ sum(Stamdata!$D$503,Stamdata!$D$504),0,1),0)+AssertionId(\"valueAssertion_NotesReceivablesBreakdown_PrtFST1SumOfChildrenParentDebit1\")","Stamdata!$D$506"]
["KvK: Jaarverantwoording 2020 NLGAAP - kleine rechtspersonen - publicatiestukken","valueAssertion_NotesReceivablesBreakdown_PrtFST1SumOfChildrenParentDebit1","`Receivables` SHOULD be equal to the summation of the underlying values. ","non-blocking","IF(OR(not(0=0),not(AND(Stamdata!$F$503=\"\",Stamdata!$F$504=\"\"))),IF( Stamdata!$F$506 = - 0+ sum(Stamdata!$F$503,Stamdata!$F$504),0,1),0)+AssertionId(\"valueAssertion_NotesReceivablesBreakdown_PrtFST1SumOfChildrenParentDebit1\")","Stamdata!$F$506"]
["KvK: Jaarverantwoording 2020 NLGAAP - kleine rechtspersonen - publicatiestukken","valueAssertion_NotesReceivablesBreakdown_PrtFST1SumOfChildrenParentDebit2","`ReceivablesOtherCurrent` SHOULD be equal to the summation of the underlying values. ","non-blocking","IF(OR(not(0=0),not(0=0)),IF( Stamdata!$D$504 = - 0+ 0,0,1),0)+AssertionId(\"valueAssertion_NotesReceivablesBreakdown_PrtFST1SumOfChildrenParentDebit2\")","Stamdata!$D$504"]
["KvK: Jaarverantwoording 2020 NLGAAP - kleine rechtspersonen - publicatiestukken","valueAssertion_NotesReceivablesBreakdown_PrtFST1SumOfChildrenParentDebit2","`ReceivablesOtherCurrent` SHOULD be equal to the summation of the underlying values. ","non-blocking","IF(OR(not(0=0),not(0=0)),IF( Stamdata!$F$504 = - 0+ 0,0,1),0)+AssertionId(\"valueAssertion_NotesReceivablesBreakdown_PrtFST1SumOfChildrenParentDebit2\")","Stamdata!$F$504"]
["KvK: Jaarverantwoording 2020 NLGAAP - kleine rechtspersonen - publicatiestukken","valueAssertion_NotesReceivablesBreakdown_PrtFST1SumOfChildrenParentDebit3","`AccruedIncome` SHOULD be equal to the summation of the underlying values. ","non-blocking","De index valt buiten het bereik. Deze mag niet negatief zijn en moet kleiner zijn dan de grootte van de verzameling.\r\nParameternaam: index"]
["KvK: Jaarverantwoording 2020 NLGAAP - kleine rechtspersonen - publicatiestukken","valueAssertion_NotesRemunerationExecutiveSeniorOfficialsFrom13MonthSpecification_PrtFST1SumOfChildrenParentDebit1T2","`RemunerationExcludingUnduePayments` SHOULD be equal to the summation of the underlying values. ","non-blocking","IF(OR(not(0=0),not(AND(Stamdata!$D$913=\"\",Stamdata!$D$914=\"\"))),IF( Stamdata!$D$916 = - 0+ sum(Stamdata!$D$913,Stamdata!$D$914),0,1),0)+AssertionId(\"valueAssertion_NotesRemunerationExecutiveSeniorOfficialsFrom13MonthSpecification_PrtFST1SumOfChildrenParentDebit1T2\")","Stamdata!$D$916"]
["KvK: Jaarverantwoording 2020 NLGAAP - kleine rechtspersonen - publicatiestukken","valueAssertion_NotesRemunerationExecutiveSeniorOfficialsFrom13MonthSpecification_PrtFST1SumOfChildrenParentDebit1T2","`RemunerationExcludingUnduePayments` SHOULD be equal to the summation of the underlying values. ","non-blocking","IF(OR(not(0=0),not(AND(Stamdata!$E$913=\"\",Stamdata!$E$914=\"\"))),IF( Stamdata!$E$916 = - 0+ sum(Stamdata!$E$913,Stamdata!$E$914),0,1),0)+AssertionId(\"valueAssertion_NotesRemunerationExecutiveSeniorOfficialsFrom13MonthSpecification_PrtFST1SumOfChildrenParentDebit1T2\")","Stamdata!$E$916"]
["KvK: Jaarverantwoording 2020 NLGAAP - kleine rechtspersonen - publicatiestukken","valueAssertion_NotesRemunerationExecutiveSeniorOfficialsFrom13MonthSpecification_PrtFST1SumOfChildrenParentDebit1T2","`RemunerationExcludingUnduePayments` SHOULD be equal to the summation of the underlying values. ","non-blocking","IF(OR(not(0=0),not(AND(Stamdata!$F$913=\"\",Stamdata!$F$914=\"\"))),IF( Stamdata!$F$916 = - 0+ sum(Stamdata!$F$913,Stamdata!$F$914),0,1),0)+AssertionId(\"valueAssertion_NotesRemunerationExecutiveSeniorOfficialsFrom13MonthSpecification_PrtFST1SumOfChildrenParentDebit1T2\")","Stamdata!$F$916"]
["KvK: Jaarverantwoording 2020 NLGAAP - kleine rechtspersonen - publicatiestukken","valueAssertion_NotesRemunerationExecutiveSeniorOfficialsFrom13MonthSpecification_PrtFST1SumOfChildrenParentDebit1T2","`RemunerationExcludingUnduePayments` SHOULD be equal to the summation of the underlying values. ","non-blocking","IF(OR(not(0=0),not(AND(Stamdata!$G$913=\"\",Stamdata!$G$914=\"\"))),IF( Stamdata!$G$916 = - 0+ sum(Stamdata!$G$913,Stamdata!$G$914),0,1),0)+AssertionId(\"valueAssertion_NotesRemunerationExecutiveSeniorOfficialsFrom13MonthSpecification_PrtFST1SumOfChildrenParentDebit1T2\")","Stamdata!$G$916"]
["KvK: Jaarverantwoording 2020 NLGAAP - kleine rechtspersonen - publicatiestukken","valueAssertion_NotesRemunerationExecutiveSeniorOfficialsFrom13MonthSpecification_PrtFST1SumOfChildrenParentDebit1T2","`RemunerationExcludingUnduePayments` SHOULD be equal to the summation of the underlying values. ","non-blocking","IF(OR(not(0=0),not(AND(Stamdata!$H$913=\"\",Stamdata!$H$914=\"\"))),IF( Stamdata!$H$916 = - 0+ sum(Stamdata!$H$913,Stamdata!$H$914),0,1),0)+AssertionId(\"valueAssertion_NotesRemunerationExecutiveSeniorOfficialsFrom13MonthSpecification_PrtFST1SumOfChildrenParentDebit1T2\")","Stamdata!$H$916"]
["KvK: Jaarverantwoording 2020 NLGAAP - kleine rechtspersonen - publicatiestukken","valueAssertion_NotesRemunerationExecutiveSeniorOfficialsFrom13MonthSpecification_PrtFST102Variables1","`Remuneration` SHOULD be equal to - `UnduePayments` + `RemunerationExcludingUnduePayments`. ","non-blocking","IF(OR(not(Stamdata!$D$918=\"\"),not(Stamdata!$D$919ExcludingUnduePayments=\"\")),IF(- sum(Stamdata!$D$918) + sum(Stamdata!$D$919ExcludingUnduePayments) = Stamdata!$D$919 ,0,1),0)+AssertionId(\"valueAssertion_NotesRemunerationExecutiveSeniorOfficialsFrom13MonthSpecification_PrtFST102Variables1\")","Stamdata!$D$919"]
["KvK: Jaarverantwoording 2020 NLGAAP - kleine rechtspersonen - publicatiestukken","valueAssertion_NotesRemunerationExecutiveSeniorOfficialsFrom13MonthSpecification_PrtFST102Variables1","`Remuneration` SHOULD be equal to - `UnduePayments` + `RemunerationExcludingUnduePayments`. ","non-blocking","IF(OR(not(Stamdata!$E$918=\"\"),not(Stamdata!$E$919ExcludingUnduePayments=\"\")),IF(- sum(Stamdata!$E$918) + sum(Stamdata!$E$919ExcludingUnduePayments) = Stamdata!$E$919 ,0,1),0)+AssertionId(\"valueAssertion_NotesRemunerationExecutiveSeniorOfficialsFrom13MonthSpecification_PrtFST102Variables1\")","Stamdata!$E$919"]
["KvK: Jaarverantwoording 2020 NLGAAP - kleine rechtspersonen - publicatiestukken","valueAssertion_NotesRemunerationExecutiveSeniorOfficialsFrom13MonthSpecification_PrtFST102Variables1","`Remuneration` SHOULD be equal to - `UnduePayments` + `RemunerationExcludingUnduePayments`. ","non-blocking","IF(OR(not(Stamdata!$F$918=\"\"),not(Stamdata!$F$919ExcludingUnduePayments=\"\")),IF(- sum(Stamdata!$F$918) + sum(Stamdata!$F$919ExcludingUnduePayments) = Stamdata!$F$919 ,0,1),0)+AssertionId(\"valueAssertion_NotesRemunerationExecutiveSeniorOfficialsFrom13MonthSpecification_PrtFST102Variables1\")","Stamdata!$F$919"]
["KvK: Jaarverantwoording 2020 NLGAAP - kleine rechtspersonen - publicatiestukken","valueAssertion_NotesRemunerationExecutiveSeniorOfficialsFrom13MonthSpecification_PrtFST102Variables1","`Remuneration` SHOULD be equal to - `UnduePayments` + `RemunerationExcludingUnduePayments`. ","non-blocking","IF(OR(not(Stamdata!$G$918=\"\"),not(Stamdata!$G$919ExcludingUnduePayments=\"\")),IF(- sum(Stamdata!$G$918) + sum(Stamdata!$G$919ExcludingUnduePayments) = Stamdata!$G$919 ,0,1),0)+AssertionId(\"valueAssertion_NotesRemunerationExecutiveSeniorOfficialsFrom13MonthSpecification_PrtFST102Variables1\")","Stamdata!$G$919"]
["KvK: Jaarverantwoording 2020 NLGAAP - kleine rechtspersonen - publicatiestukken","valueAssertion_NotesRemunerationExecutiveSeniorOfficialsFrom13MonthSpecification_PrtFST102Variables1","`Remuneration` SHOULD be equal to - `UnduePayments` + `RemunerationExcludingUnduePayments`. ","non-blocking","IF(OR(not(Stamdata!$H$918=\"\"),not(Stamdata!$H$919ExcludingUnduePayments=\"\")),IF(- sum(Stamdata!$H$918) + sum(Stamdata!$H$919ExcludingUnduePayments) = Stamdata!$H$919 ,0,1),0)+AssertionId(\"valueAssertion_NotesRemunerationExecutiveSeniorOfficialsFrom13MonthSpecification_PrtFST102Variables1\")","Stamdata!$H$919"]
["KvK: Jaarverantwoording 2020 NLGAAP - kleine rechtspersonen - publicatiestukken","valueAssertion_NotesRemunerationExecutiveSeniorOfficialsFrom13MonthSpecification_PrtFST102Variables2","`AmountExceedingMaximumRemuneration` SHOULD be equal to + `RemunerationExcludingUnduePayments` - `IndividualMaximumRemuneration`. ","non-blocking","IF(OR(not(Stamdata!$D$916=\"\"),not(Stamdata!$D$917=\"\")),IF(+ sum(Stamdata!$D$916) - sum(Stamdata!$D$917) = Stamdata!$D$920 ,0,1),0)+AssertionId(\"valueAssertion_NotesRemunerationExecutiveSeniorOfficialsFrom13MonthSpecification_PrtFST102Variables2\")","Stamdata!$D$920"]
["KvK: Jaarverantwoording 2020 NLGAAP - kleine rechtspersonen - publicatiestukken","valueAssertion_NotesRemunerationExecutiveSeniorOfficialsFrom13MonthSpecification_PrtFST102Variables2","`AmountExceedingMaximumRemuneration` SHOULD be equal to + `RemunerationExcludingUnduePayments` - `IndividualMaximumRemuneration`. ","non-blocking","IF(OR(not(Stamdata!$E$916=\"\"),not(Stamdata!$E$917=\"\")),IF(+ sum(Stamdata!$E$916) - sum(Stamdata!$E$917) = Stamdata!$E$920 ,0,1),0)+AssertionId(\"valueAssertion_NotesRemunerationExecutiveSeniorOfficialsFrom13MonthSpecification_PrtFST102Variables2\")","Stamdata!$E$920"]
["KvK: Jaarverantwoording 2020 NLGAAP - kleine rechtspersonen - publicatiestukken","valueAssertion_NotesRemunerationExecutiveSeniorOfficialsFrom13MonthSpecification_PrtFST102Variables2","`AmountExceedingMaximumRemuneration` SHOULD be equal to + `RemunerationExcludingUnduePayments` - `IndividualMaximumRemuneration`. ","non-blocking","IF(OR(not(Stamdata!$F$916=\"\"),not(Stamdata!$F$917=\"\")),IF(+ sum(Stamdata!$F$916) - sum(Stamdata!$F$917) = Stamdata!$F$920 ,0,1),0)+AssertionId(\"valueAssertion_NotesRemunerationExecutiveSeniorOfficialsFrom13MonthSpecification_PrtFST102Variables2\")","Stamdata!$F$920"]
["KvK: Jaarverantwoording 2020 NLGAAP - kleine rechtspersonen - publicatiestukken","valueAssertion_NotesRemunerationExecutiveSeniorOfficialsFrom13MonthSpecification_PrtFST102Variables2","`AmountExceedingMaximumRemuneration` SHOULD be equal to + `RemunerationExcludingUnduePayments` - `IndividualMaximumRemuneration`. ","non-blocking","IF(OR(not(Stamdata!$G$916=\"\"),not(Stamdata!$G$917=\"\")),IF(+ sum(Stamdata!$G$916) - sum(Stamdata!$G$917) = Stamdata!$G$920 ,0,1),0)+AssertionId(\"valueAssertion_NotesRemunerationExecutiveSeniorOfficialsFrom13MonthSpecification_PrtFST102Variables2\")","Stamdata!$G$920"]
["KvK: Jaarverantwoording 2020 NLGAAP - kleine rechtspersonen - publicatiestukken","valueAssertion_NotesRemunerationExecutiveSeniorOfficialsFrom13MonthSpecification_PrtFST102Variables2","`AmountExceedingMaximumRemuneration` SHOULD be equal to + `RemunerationExcludingUnduePayments` - `IndividualMaximumRemuneration`. ","non-blocking","IF(OR(not(Stamdata!$H$916=\"\"),not(Stamdata!$H$917=\"\")),IF(+ sum(Stamdata!$H$916) - sum(Stamdata!$H$917) = Stamdata!$H$920 ,0,1),0)+AssertionId(\"valueAssertion_NotesRemunerationExecutiveSeniorOfficialsFrom13MonthSpecification_PrtFST102Variables2\")","Stamdata!$H$920"]
["KvK: Jaarverantwoording 2020 NLGAAP - kleine rechtspersonen - publicatiestukken","valueAssertion_NotesRemunerationExecutiveSeniorOfficialsWithoutEmployment12MonthsSpecification_PrtFST102Variables1","`Remuneration` SHOULD be equal to + `TotalRemunerationDuringFinancialYear` - `UnduePayments`. ","non-blocking","IF(OR(not(Stamdata!$D$962=\"\"),not(Stamdata!$D$963=\"\")),IF(+ sum(Stamdata!$D$962) - sum(Stamdata!$D$963) = Stamdata!$D$964 ,0,1),0)+AssertionId(\"valueAssertion_NotesRemunerationExecutiveSeniorOfficialsWithoutEmployment12MonthsSpecification_PrtFST102Variables1\")","Stamdata!$D$964"]
["KvK: Jaarverantwoording 2020 NLGAAP - kleine rechtspersonen - publicatiestukken","valueAssertion_NotesRemunerationExecutiveSeniorOfficialsWithoutEmployment12MonthsSpecification_PrtFST102Variables1","`Remuneration` SHOULD be equal to + `TotalRemunerationDuringFinancialYear` - `UnduePayments`. ","non-blocking","IF(OR(not(Stamdata!$E$962=\"\"),not(Stamdata!$E$963=\"\")),IF(+ sum(Stamdata!$E$962) - sum(Stamdata!$E$963) = Stamdata!$E$964 ,0,1),0)+AssertionId(\"valueAssertion_NotesRemunerationExecutiveSeniorOfficialsWithoutEmployment12MonthsSpecification_PrtFST102Variables1\")","Stamdata!$E$964"]
["KvK: Jaarverantwoording 2020 NLGAAP - kleine rechtspersonen - publicatiestukken","valueAssertion_NotesRemunerationExecutiveSeniorOfficialsWithoutEmployment12MonthsSpecification_PrtFST102Variables1","`Remuneration` SHOULD be equal to + `TotalRemunerationDuringFinancialYear` - `UnduePayments`. ","non-blocking","IF(OR(not(Stamdata!$F$962=\"\"),not(Stamdata!$F$963=\"\")),IF(+ sum(Stamdata!$F$962) - sum(Stamdata!$F$963) = Stamdata!$F$964 ,0,1),0)+AssertionId(\"valueAssertion_NotesRemunerationExecutiveSeniorOfficialsWithoutEmployment12MonthsSpecification_PrtFST102Variables1\")","Stamdata!$F$964"]
["KvK: Jaarverantwoording 2020 NLGAAP - kleine rechtspersonen - publicatiestukken","valueAssertion_NotesRemunerationExecutiveSeniorOfficialsWithoutEmployment12MonthsSpecification_PrtFST102Variables1","`Remuneration` SHOULD be equal to + `TotalRemunerationDuringFinancialYear` - `UnduePayments`. ","non-blocking","IF(OR(not(Stamdata!$G$962=\"\"),not(Stamdata!$G$963=\"\")),IF(+ sum(Stamdata!$G$962) - sum(Stamdata!$G$963) = Stamdata!$G$964 ,0,1),0)+AssertionId(\"valueAssertion_NotesRemunerationExecutiveSeniorOfficialsWithoutEmployment12MonthsSpecification_PrtFST102Variables1\")","Stamdata!$G$964"]
["KvK: Jaarverantwoording 2020 NLGAAP - kleine rechtspersonen - publicatiestukken","valueAssertion_NotesRemunerationExecutiveSeniorOfficialsWithoutEmployment12MonthsSpecification_PrtFST102Variables1","`Remuneration` SHOULD be equal to + `TotalRemunerationDuringFinancialYear` - `UnduePayments`. ","non-blocking","IF(OR(not(Stamdata!$H$962=\"\"),not(Stamdata!$H$963=\"\")),IF(+ sum(Stamdata!$H$962) - sum(Stamdata!$H$963) = Stamdata!$H$964 ,0,1),0)+AssertionId(\"valueAssertion_NotesRemunerationExecutiveSeniorOfficialsWithoutEmployment12MonthsSpecification_PrtFST102Variables1\")","Stamdata!$H$964"]
["KvK: Jaarverantwoording 2020 NLGAAP - kleine rechtspersonen - publicatiestukken","valueAssertion_NotesRemunerationExecutiveSeniorOfficialsWithoutEmployment12MonthsSpecification_PrtFST102Variables1","`Remuneration` SHOULD be equal to + `TotalRemunerationDuringFinancialYear` - `UnduePayments`. ","non-blocking","IF(OR(not(Stamdata!$D$989=\"\"),not(Stamdata!$D$990=\"\")),IF(+ sum(Stamdata!$D$989) - sum(Stamdata!$D$990) = Stamdata!$D$991 ,0,1),0)+AssertionId(\"valueAssertion_NotesRemunerationExecutiveSeniorOfficialsWithoutEmployment12MonthsSpecification_PrtFST102Variables1\")","Stamdata!$D$991"]
["KvK: Jaarverantwoording 2020 NLGAAP - kleine rechtspersonen - publicatiestukken","valueAssertion_NotesRemunerationExecutiveSeniorOfficialsWithoutEmployment12MonthsSpecification_PrtFST102Variables1","`Remuneration` SHOULD be equal to + `TotalRemunerationDuringFinancialYear` - `UnduePayments`. ","non-blocking","IF(OR(not(Stamdata!$E$989=\"\"),not(Stamdata!$E$990=\"\")),IF(+ sum(Stamdata!$E$989) - sum(Stamdata!$E$990) = Stamdata!$E$991 ,0,1),0)+AssertionId(\"valueAssertion_NotesRemunerationExecutiveSeniorOfficialsWithoutEmployment12MonthsSpecification_PrtFST102Variables1\")","Stamdata!$E$991"]
["KvK: Jaarverantwoording 2020 NLGAAP - kleine rechtspersonen - publicatiestukken","valueAssertion_NotesRemunerationExecutiveSeniorOfficialsWithoutEmployment12MonthsSpecification_PrtFST102Variables1","`Remuneration` SHOULD be equal to + `TotalRemunerationDuringFinancialYear` - `UnduePayments`. ","non-blocking","IF(OR(not(Stamdata!$F$989=\"\"),not(Stamdata!$F$990=\"\")),IF(+ sum(Stamdata!$F$989) - sum(Stamdata!$F$990) = Stamdata!$F$991 ,0,1),0)+AssertionId(\"valueAssertion_NotesRemunerationExecutiveSeniorOfficialsWithoutEmployment12MonthsSpecification_PrtFST102Variables1\")","Stamdata!$F$991"]
["KvK: Jaarverantwoording 2020 NLGAAP - kleine rechtspersonen - publicatiestukken","valueAssertion_NotesRemunerationExecutiveSeniorOfficialsWithoutEmployment12MonthsSpecification_PrtFST102Variables1","`Remuneration` SHOULD be equal to + `TotalRemunerationDuringFinancialYear` - `UnduePayments`. ","non-blocking","IF(OR(not(Stamdata!$G$989=\"\"),not(Stamdata!$G$990=\"\")),IF(+ sum(Stamdata!$G$989) - sum(Stamdata!$G$990) = Stamdata!$G$991 ,0,1),0)+AssertionId(\"valueAssertion_NotesRemunerationExecutiveSeniorOfficialsWithoutEmployment12MonthsSpecification_PrtFST102Variables1\")","Stamdata!$G$991"]
["KvK: Jaarverantwoording 2020 NLGAAP - kleine rechtspersonen - publicatiestukken","valueAssertion_NotesRemunerationExecutiveSeniorOfficialsWithoutEmployment12MonthsSpecification_PrtFST102Variables1","`Remuneration` SHOULD be equal to + `TotalRemunerationDuringFinancialYear` - `UnduePayments`. ","non-blocking","IF(OR(not(Stamdata!$H$989=\"\"),not(Stamdata!$H$990=\"\")),IF(+ sum(Stamdata!$H$989) - sum(Stamdata!$H$990) = Stamdata!$H$991 ,0,1),0)+AssertionId(\"valueAssertion_NotesRemunerationExecutiveSeniorOfficialsWithoutEmployment12MonthsSpecification_PrtFST102Variables1\")","Stamdata!$H$991"]
["KvK: Jaarverantwoording 2020 NLGAAP - kleine rechtspersonen - publicatiestukken","valueAssertion_NotesRemunerationExecutiveSeniorOfficialsWithoutEmployment12MonthsSpecification_PrtFST102Variables2","`AmountExceedingMaximumRemuneration` SHOULD be equal to + `TotalRemunerationDuringFinancialYear` - `IndividualMaximumDuringFinancialYear`. ","non-blocking","IF(OR(not(Stamdata!$D$962=\"\"),not(Stamdata!$D$958=\"\")),IF(+ sum(Stamdata!$D$962) - sum(Stamdata!$D$958) = Stamdata!$D$965 ,0,1),0)+AssertionId(\"valueAssertion_NotesRemunerationExecutiveSeniorOfficialsWithoutEmployment12MonthsSpecification_PrtFST102Variables2\")","Stamdata!$D$965"]
["KvK: Jaarverantwoording 2020 NLGAAP - kleine rechtspersonen - publicatiestukken","valueAssertion_NotesRemunerationExecutiveSeniorOfficialsWithoutEmployment12MonthsSpecification_PrtFST102Variables2","`AmountExceedingMaximumRemuneration` SHOULD be equal to + `TotalRemunerationDuringFinancialYear` - `IndividualMaximumDuringFinancialYear`. ","non-blocking","IF(OR(not(Stamdata!$E$962=\"\"),not(Stamdata!$E$958=\"\")),IF(+ sum(Stamdata!$E$962) - sum(Stamdata!$E$958) = Stamdata!$E$965 ,0,1),0)+AssertionId(\"valueAssertion_NotesRemunerationExecutiveSeniorOfficialsWithoutEmployment12MonthsSpecification_PrtFST102Variables2\")","Stamdata!$E$965"]
["KvK: Jaarverantwoording 2020 NLGAAP - kleine rechtspersonen - publicatiestukken","valueAssertion_NotesRemunerationExecutiveSeniorOfficialsWithoutEmployment12MonthsSpecification_PrtFST102Variables2","`AmountExceedingMaximumRemuneration` SHOULD be equal to + `TotalRemunerationDuringFinancialYear` - `IndividualMaximumDuringFinancialYear`. ","non-blocking","IF(OR(not(Stamdata!$F$962=\"\"),not(Stamdata!$F$958=\"\")),IF(+ sum(Stamdata!$F$962) - sum(Stamdata!$F$958) = Stamdata!$F$965 ,0,1),0)+AssertionId(\"valueAssertion_NotesRemunerationExecutiveSeniorOfficialsWithoutEmployment12MonthsSpecification_PrtFST102Variables2\")","Stamdata!$F$965"]
["KvK: Jaarverantwoording 2020 NLGAAP - kleine rechtspersonen - publicatiestukken","valueAssertion_NotesRemunerationExecutiveSeniorOfficialsWithoutEmployment12MonthsSpecification_PrtFST102Variables2","`AmountExceedingMaximumRemuneration` SHOULD be equal to + `TotalRemunerationDuringFinancialYear` - `IndividualMaximumDuringFinancialYear`. ","non-blocking","IF(OR(not(Stamdata!$G$962=\"\"),not(Stamdata!$G$958=\"\")),IF(+ sum(Stamdata!$G$962) - sum(Stamdata!$G$958) = Stamdata!$G$965 ,0,1),0)+AssertionId(\"valueAssertion_NotesRemunerationExecutiveSeniorOfficialsWithoutEmployment12MonthsSpecification_PrtFST102Variables2\")","Stamdata!$G$965"]
["KvK: Jaarverantwoording 2020 NLGAAP - kleine rechtspersonen - publicatiestukken","valueAssertion_NotesRemunerationExecutiveSeniorOfficialsWithoutEmployment12MonthsSpecification_PrtFST102Variables2","`AmountExceedingMaximumRemuneration` SHOULD be equal to + `TotalRemunerationDuringFinancialYear` - `IndividualMaximumDuringFinancialYear`. ","non-blocking","IF(OR(not(Stamdata!$H$962=\"\"),not(Stamdata!$H$958=\"\")),IF(+ sum(Stamdata!$H$962) - sum(Stamdata!$H$958) = Stamdata!$H$965 ,0,1),0)+AssertionId(\"valueAssertion_NotesRemunerationExecutiveSeniorOfficialsWithoutEmployment12MonthsSpecification_PrtFST102Variables2\")","Stamdata!$H$965"]
["KvK: Jaarverantwoording 2020 NLGAAP - kleine rechtspersonen - publicatiestukken","valueAssertion_NotesRemunerationExecutiveSeniorOfficialsWithoutEmployment12MonthsSpecification_PrtFST102Variables2","`AmountExceedingMaximumRemuneration` SHOULD be equal to + `TotalRemunerationDuringFinancialYear` - `IndividualMaximumDuringFinancialYear`. ","non-blocking","IF(OR(not(Stamdata!$D$989=\"\"),not(Stamdata!$D$985=\"\")),IF(+ sum(Stamdata!$D$989) - sum(Stamdata!$D$985) = Stamdata!$D$992 ,0,1),0)+AssertionId(\"valueAssertion_NotesRemunerationExecutiveSeniorOfficialsWithoutEmployment12MonthsSpecification_PrtFST102Variables2\")","Stamdata!$D$992"]
["KvK: Jaarverantwoording 2020 NLGAAP - kleine rechtspersonen - publicatiestukken","valueAssertion_NotesRemunerationExecutiveSeniorOfficialsWithoutEmployment12MonthsSpecification_PrtFST102Variables2","`AmountExceedingMaximumRemuneration` SHOULD be equal to + `TotalRemunerationDuringFinancialYear` - `IndividualMaximumDuringFinancialYear`. ","non-blocking","IF(OR(not(Stamdata!$E$989=\"\"),not(Stamdata!$E$985=\"\")),IF(+ sum(Stamdata!$E$989) - sum(Stamdata!$E$985) = Stamdata!$E$992 ,0,1),0)+AssertionId(\"valueAssertion_NotesRemunerationExecutiveSeniorOfficialsWithoutEmployment12MonthsSpecification_PrtFST102Variables2\")","Stamdata!$E$992"]
["KvK: Jaarverantwoording 2020 NLGAAP - kleine rechtspersonen - publicatiestukken","valueAssertion_NotesRemunerationExecutiveSeniorOfficialsWithoutEmployment12MonthsSpecification_PrtFST102Variables2","`AmountExceedingMaximumRemuneration` SHOULD be equal to + `TotalRemunerationDuringFinancialYear` - `IndividualMaximumDuringFinancialYear`. ","non-blocking","IF(OR(not(Stamdata!$F$989=\"\"),not(Stamdata!$F$985=\"\")),IF(+ sum(Stamdata!$F$989) - sum(Stamdata!$F$985) = Stamdata!$F$992 ,0,1),0)+AssertionId(\"valueAssertion_NotesRemunerationExecutiveSeniorOfficialsWithoutEmployment12MonthsSpecification_PrtFST102Variables2\")","Stamdata!$F$992"]
["KvK: Jaarverantwoording 2020 NLGAAP - kleine rechtspersonen - publicatiestukken","valueAssertion_NotesRemunerationExecutiveSeniorOfficialsWithoutEmployment12MonthsSpecification_PrtFST102Variables2","`AmountExceedingMaximumRemuneration` SHOULD be equal to + `TotalRemunerationDuringFinancialYear` - `IndividualMaximumDuringFinancialYear`. ","non-blocking","IF(OR(not(Stamdata!$G$989=\"\"),not(Stamdata!$G$985=\"\")),IF(+ sum(Stamdata!$G$989) - sum(Stamdata!$G$985) = Stamdata!$G$992 ,0,1),0)+AssertionId(\"valueAssertion_NotesRemunerationExecutiveSeniorOfficialsWithoutEmployment12MonthsSpecification_PrtFST102Variables2\")","Stamdata!$G$992"]
["KvK: Jaarverantwoording 2020 NLGAAP - kleine rechtspersonen - publicatiestukken","valueAssertion_NotesRemunerationExecutiveSeniorOfficialsWithoutEmployment12MonthsSpecification_PrtFST102Variables2","`AmountExceedingMaximumRemuneration` SHOULD be equal to + `TotalRemunerationDuringFinancialYear` - `IndividualMaximumDuringFinancialYear`. ","non-blocking","IF(OR(not(Stamdata!$H$989=\"\"),not(Stamdata!$H$985=\"\")),IF(+ sum(Stamdata!$H$989) - sum(Stamdata!$H$985) = Stamdata!$H$992 ,0,1),0)+AssertionId(\"valueAssertion_NotesRemunerationExecutiveSeniorOfficialsWithoutEmployment12MonthsSpecification_PrtFST102Variables2\")","Stamdata!$H$992"]
["KvK: Jaarverantwoording 2020 NLGAAP - kleine rechtspersonen - publicatiestukken","valueAssertion_NotesRemunerationOfExecutiveSeniorOfficialsConsideredFourYearsSpecification_PrtFST1SumOfChildrenParentDebit1","`SubtotalRemuneration` SHOULD be equal to the summation of the underlying values. ","non-blocking","IF(OR(not(Stamdata!$D$1078=\"\"),not(AND(Stamdata!$D$1075=\"\",Stamdata!$D$1076=\"\",Stamdata!$D$1077=\"\"))),IF( Stamdata!$D$1080 = - sum(Stamdata!$D$1078)+ sum(Stamdata!$D$1075,Stamdata!$D$1076,Stamdata!$D$1077),0,1),0)+AssertionId(\"valueAssertion_NotesRemunerationOfExecutiveSeniorOfficialsConsideredFourYearsSpecification_PrtFST1SumOfChildrenParentDebit1\")","Stamdata!$D$1080"]
["KvK: Jaarverantwoording 2020 NLGAAP - kleine rechtspersonen - publicatiestukken","valueAssertion_NotesRemunerationOfExecutiveSeniorOfficialsConsideredFourYearsSpecification_PrtFST1SumOfChildrenParentDebit1","`SubtotalRemuneration` SHOULD be equal to the summation of the underlying values. ","non-blocking","IF(OR(not(Stamdata!$E$1078=\"\"),not(AND(Stamdata!$E$1075=\"\",Stamdata!$E$1076=\"\",Stamdata!$E$1077=\"\"))),IF( Stamdata!$E$1080 = - sum(Stamdata!$E$1078)+ sum(Stamdata!$E$1075,Stamdata!$E$1076,Stamdata!$E$1077),0,1),0)+AssertionId(\"valueAssertion_NotesRemunerationOfExecutiveSeniorOfficialsConsideredFourYearsSpecification_PrtFST1SumOfChildrenParentDebit1\")","Stamdata!$E$1080"]
["KvK: Jaarverantwoording 2020 NLGAAP - kleine rechtspersonen - publicatiestukken","valueAssertion_NotesRemunerationOfExecutiveSeniorOfficialsConsideredFourYearsSpecification_PrtFST1SumOfChildrenParentDebit1","`SubtotalRemuneration` SHOULD be equal to the summation of the underlying values. ","non-blocking","IF(OR(not(Stamdata!$F$1078=\"\"),not(AND(Stamdata!$F$1075=\"\",Stamdata!$F$1076=\"\",Stamdata!$F$1077=\"\"))),IF( Stamdata!$F$1080 = - sum(Stamdata!$F$1078)+ sum(Stamdata!$F$1075,Stamdata!$F$1076,Stamdata!$F$1077),0,1),0)+AssertionId(\"valueAssertion_NotesRemunerationOfExecutiveSeniorOfficialsConsideredFourYearsSpecification_PrtFST1SumOfChildrenParentDebit1\")","Stamdata!$F$1080"]
["KvK: Jaarverantwoording 2020 NLGAAP - kleine rechtspersonen - publicatiestukken","valueAssertion_NotesRemunerationOfExecutiveSeniorOfficialsConsideredFourYearsSpecification_PrtFST1SumOfChildrenParentDebit1","`SubtotalRemuneration` SHOULD be equal to the summation of the underlying values. ","non-blocking","IF(OR(not(Stamdata!$G$1078=\"\"),not(AND(Stamdata!$G$1075=\"\",Stamdata!$G$1076=\"\",Stamdata!$G$1077=\"\"))),IF( Stamdata!$G$1080 = - sum(Stamdata!$G$1078)+ sum(Stamdata!$G$1075,Stamdata!$G$1076,Stamdata!$G$1077),0,1),0)+AssertionId(\"valueAssertion_NotesRemunerationOfExecutiveSeniorOfficialsConsideredFourYearsSpecification_PrtFST1SumOfChildrenParentDebit1\")","Stamdata!$G$1080"]
["KvK: Jaarverantwoording 2020 NLGAAP - kleine rechtspersonen - publicatiestukken","valueAssertion_NotesRemunerationOfExecutiveSeniorOfficialsConsideredFourYearsSpecification_PrtFST1SumOfChildrenParentDebit1","`SubtotalRemuneration` SHOULD be equal to the summation of the underlying values. ","non-blocking","IF(OR(not(Stamdata!$H$1078=\"\"),not(AND(Stamdata!$H$1075=\"\",Stamdata!$H$1076=\"\",Stamdata!$H$1077=\"\"))),IF( Stamdata!$H$1080 = - sum(Stamdata!$H$1078)+ sum(Stamdata!$H$1075,Stamdata!$H$1076,Stamdata!$H$1077),0,1),0)+AssertionId(\"valueAssertion_NotesRemunerationOfExecutiveSeniorOfficialsConsideredFourYearsSpecification_PrtFST1SumOfChildrenParentDebit1\")","Stamdata!$H$1080"]
["KvK: Jaarverantwoording 2020 NLGAAP - kleine rechtspersonen - publicatiestukken","valueAssertion_NotesRemunerationOfNonSeniorOfficialsPreviousSpecification_PrtFST1SumOfChildrenParentDebit1T1","`Remuneration` SHOULD be equal to the summation of the underlying values. ","non-blocking","IF(OR(not(0=0),not(AND(Stamdata!$D$1025=\"\",Stamdata!$D$1026=\"\"))),IF( Stamdata!$D$1028 = - 0+ sum(Stamdata!$D$1025,Stamdata!$D$1026),0,1),0)+AssertionId(\"valueAssertion_NotesRemunerationOfNonSeniorOfficialsPreviousSpecification_PrtFST1SumOfChildrenParentDebit1T1\")","Stamdata!$D$1028"]
["KvK: Jaarverantwoording 2020 NLGAAP - kleine rechtspersonen - publicatiestukken","valueAssertion_NotesRemunerationOfNonSeniorOfficialsPreviousSpecification_PrtFST1SumOfChildrenParentDebit1T1","`Remuneration` SHOULD be equal to the summation of the underlying values. ","non-blocking","IF(OR(not(0=0),not(AND(Stamdata!$E$1025=\"\",Stamdata!$E$1026=\"\"))),IF( Stamdata!$E$1028 = - 0+ sum(Stamdata!$E$1025,Stamdata!$E$1026),0,1),0)+AssertionId(\"valueAssertion_NotesRemunerationOfNonSeniorOfficialsPreviousSpecification_PrtFST1SumOfChildrenParentDebit1T1\")","Stamdata!$E$1028"]
["KvK: Jaarverantwoording 2020 NLGAAP - kleine rechtspersonen - publicatiestukken","valueAssertion_NotesRemunerationOfNonSeniorOfficialsPreviousSpecification_PrtFST1SumOfChildrenParentDebit1T1","`Remuneration` SHOULD be equal to the summation of the underlying values. ","non-blocking","IF(OR(not(0=0),not(AND(Stamdata!$F$1025=\"\",Stamdata!$F$1026=\"\"))),IF( Stamdata!$F$1028 = - 0+ sum(Stamdata!$F$1025,Stamdata!$F$1026),0,1),0)+AssertionId(\"valueAssertion_NotesRemunerationOfNonSeniorOfficialsPreviousSpecification_PrtFST1SumOfChildrenParentDebit1T1\")","Stamdata!$F$1028"]
["KvK: Jaarverantwoording 2020 NLGAAP - kleine rechtspersonen - publicatiestukken","valueAssertion_NotesRemunerationOfNonSeniorOfficialsPreviousSpecification_PrtFST1SumOfChildrenParentDebit1T1","`Remuneration` SHOULD be equal to the summation of the underlying values. ","non-blocking","IF(OR(not(0=0),not(AND(Stamdata!$G$1025=\"\",Stamdata!$G$1026=\"\"))),IF( Stamdata!$G$1028 = - 0+ sum(Stamdata!$G$1025,Stamdata!$G$1026),0,1),0)+AssertionId(\"valueAssertion_NotesRemunerationOfNonSeniorOfficialsPreviousSpecification_PrtFST1SumOfChildrenParentDebit1T1\")","Stamdata!$G$1028"]
["KvK: Jaarverantwoording 2020 NLGAAP - kleine rechtspersonen - publicatiestukken","valueAssertion_NotesRemunerationOfNonSeniorOfficialsPreviousSpecification_PrtFST1SumOfChildrenParentDebit1T1","`Remuneration` SHOULD be equal to the summation of the underlying values. ","non-blocking","IF(OR(not(0=0),not(AND(Stamdata!$H$1025=\"\",Stamdata!$H$1026=\"\"))),IF( Stamdata!$H$1028 = - 0+ sum(Stamdata!$H$1025,Stamdata!$H$1026),0,1),0)+AssertionId(\"valueAssertion_NotesRemunerationOfNonSeniorOfficialsPreviousSpecification_PrtFST1SumOfChildrenParentDebit1T1\")","Stamdata!$H$1028"]
["KvK: Jaarverantwoording 2020 NLGAAP - kleine rechtspersonen - publicatiestukken","valueAssertion_NotesRemunerationOfNonSeniorOfficialsSpecification_PrtFST1SumOfChildrenParentDebit1T1","`Remuneration` SHOULD be equal to the summation of the underlying values. ","non-blocking","IF(OR(not(0=0),not(AND(Stamdata!$D$1007=\"\",Stamdata!$D$1008=\"\"))),IF( Stamdata!$D$1010 = - 0+ sum(Stamdata!$D$1007,Stamdata!$D$1008),0,1),0)+AssertionId(\"valueAssertion_NotesRemunerationOfNonSeniorOfficialsSpecification_PrtFST1SumOfChildrenParentDebit1T1\")","Stamdata!$D$1010"]
["KvK: Jaarverantwoording 2020 NLGAAP - kleine rechtspersonen - publicatiestukken","valueAssertion_NotesRemunerationOfNonSeniorOfficialsSpecification_PrtFST1SumOfChildrenParentDebit1T1","`Remuneration` SHOULD be equal to the summation of the underlying values. ","non-blocking","IF(OR(not(0=0),not(AND(Stamdata!$E$1007=\"\",Stamdata!$E$1008=\"\"))),IF( Stamdata!$E$1010 = - 0+ sum(Stamdata!$E$1007,Stamdata!$E$1008),0,1),0)+AssertionId(\"valueAssertion_NotesRemunerationOfNonSeniorOfficialsSpecification_PrtFST1SumOfChildrenParentDebit1T1\")","Stamdata!$E$1010"]
["KvK: Jaarverantwoording 2020 NLGAAP - kleine rechtspersonen - publicatiestukken","valueAssertion_NotesRemunerationOfNonSeniorOfficialsSpecification_PrtFST1SumOfChildrenParentDebit1T1","`Remuneration` SHOULD be equal to the summation of the underlying values. ","non-blocking","IF(OR(not(0=0),not(AND(Stamdata!$F$1007=\"\",Stamdata!$F$1008=\"\"))),IF( Stamdata!$F$1010 = - 0+ sum(Stamdata!$F$1007,Stamdata!$F$1008),0,1),0)+AssertionId(\"valueAssertion_NotesRemunerationOfNonSeniorOfficialsSpecification_PrtFST1SumOfChildrenParentDebit1T1\")","Stamdata!$F$1010"]
["KvK: Jaarverantwoording 2020 NLGAAP - kleine rechtspersonen - publicatiestukken","valueAssertion_NotesRemunerationOfNonSeniorOfficialsSpecification_PrtFST1SumOfChildrenParentDebit1T1","`Remuneration` SHOULD be equal to the summation of the underlying values. ","non-blocking","IF(OR(not(0=0),not(AND(Stamdata!$G$1007=\"\",Stamdata!$G$1008=\"\"))),IF( Stamdata!$G$1010 = - 0+ sum(Stamdata!$G$1007,Stamdata!$G$1008),0,1),0)+AssertionId(\"valueAssertion_NotesRemunerationOfNonSeniorOfficialsSpecification_PrtFST1SumOfChildrenParentDebit1T1\")","Stamdata!$G$1010"]
["KvK: Jaarverantwoording 2020 NLGAAP - kleine rechtspersonen - publicatiestukken","valueAssertion_NotesRemunerationOfNonSeniorOfficialsSpecification_PrtFST1SumOfChildrenParentDebit1T1","`Remuneration` SHOULD be equal to the summation of the underlying values. ","non-blocking","IF(OR(not(0=0),not(AND(Stamdata!$H$1007=\"\",Stamdata!$H$1008=\"\"))),IF( Stamdata!$H$1010 = - 0+ sum(Stamdata!$H$1007,Stamdata!$H$1008),0,1),0)+AssertionId(\"valueAssertion_NotesRemunerationOfNonSeniorOfficialsSpecification_PrtFST1SumOfChildrenParentDebit1T1\")","Stamdata!$H$1010"]
["KvK: Jaarverantwoording 2020 NLGAAP - kleine rechtspersonen - publicatiestukken","valueAssertion_NotesRemunerationOfSupervisorySeniorOfficialsSpecification_PrtFST102Variables1","`AmountExceedingMaximumRemuneration` SHOULD be equal to + `Remuneration` - `IndividualMaximumRemuneration`. ","non-blocking","IF(OR(not(Stamdata!$D$1042=\"\"),not(Stamdata!$D$1040=\"\")),IF(+ sum(Stamdata!$D$1042) - sum(Stamdata!$D$1040) = Stamdata!$D$1043 ,0,1),0)+AssertionId(\"valueAssertion_NotesRemunerationOfSupervisorySeniorOfficialsSpecification_PrtFST102Variables1\")","Stamdata!$D$1043"]
["KvK: Jaarverantwoording 2020 NLGAAP - kleine rechtspersonen - publicatiestukken","valueAssertion_NotesRemunerationOfSupervisorySeniorOfficialsSpecification_PrtFST102Variables1","`AmountExceedingMaximumRemuneration` SHOULD be equal to + `Remuneration` - `IndividualMaximumRemuneration`. ","non-blocking","IF(OR(not(Stamdata!$E$1042=\"\"),not(Stamdata!$E$1040=\"\")),IF(+ sum(Stamdata!$E$1042) - sum(Stamdata!$E$1040) = Stamdata!$E$1043 ,0,1),0)+AssertionId(\"valueAssertion_NotesRemunerationOfSupervisorySeniorOfficialsSpecification_PrtFST102Variables1\")","Stamdata!$E$1043"]
["KvK: Jaarverantwoording 2020 NLGAAP - kleine rechtspersonen - publicatiestukken","valueAssertion_NotesRemunerationOfSupervisorySeniorOfficialsSpecification_PrtFST102Variables1","`AmountExceedingMaximumRemuneration` SHOULD be equal to + `Remuneration` - `IndividualMaximumRemuneration`. ","non-blocking","IF(OR(not(Stamdata!$F$1042=\"\"),not(Stamdata!$F$1040=\"\")),IF(+ sum(Stamdata!$F$1042) - sum(Stamdata!$F$1040) = Stamdata!$F$1043 ,0,1),0)+AssertionId(\"valueAssertion_NotesRemunerationOfSupervisorySeniorOfficialsSpecification_PrtFST102Variables1\")","Stamdata!$F$1043"]
["KvK: Jaarverantwoording 2020 NLGAAP - kleine rechtspersonen - publicatiestukken","valueAssertion_NotesRemunerationOfSupervisorySeniorOfficialsSpecification_PrtFST102Variables1","`AmountExceedingMaximumRemuneration` SHOULD be equal to + `Remuneration` - `IndividualMaximumRemuneration`. ","non-blocking","IF(OR(not(Stamdata!$G$1042=\"\"),not(Stamdata!$G$1040=\"\")),IF(+ sum(Stamdata!$G$1042) - sum(Stamdata!$G$1040) = Stamdata!$G$1043 ,0,1),0)+AssertionId(\"valueAssertion_NotesRemunerationOfSupervisorySeniorOfficialsSpecification_PrtFST102Variables1\")","Stamdata!$G$1043"]
["KvK: Jaarverantwoording 2020 NLGAAP - kleine rechtspersonen - publicatiestukken","valueAssertion_NotesRemunerationOfSupervisorySeniorOfficialsSpecification_PrtFST102Variables1","`AmountExceedingMaximumRemuneration` SHOULD be equal to + `Remuneration` - `IndividualMaximumRemuneration`. ","non-blocking","IF(OR(not(Stamdata!$H$1042=\"\"),not(Stamdata!$H$1040=\"\")),IF(+ sum(Stamdata!$H$1042) - sum(Stamdata!$H$1040) = Stamdata!$H$1043 ,0,1),0)+AssertionId(\"valueAssertion_NotesRemunerationOfSupervisorySeniorOfficialsSpecification_PrtFST102Variables1\")","Stamdata!$H$1043"]
["KvK: Jaarverantwoording 2020 NLGAAP - kleine rechtspersonen - publicatiestukken","valueAssertion_NotesRemunerationOfSupervisorySeniorOfficialsSpecification_PrtFST102Variables2","`Remuneration` SHOULD be equal to + `RemunerationExcludingUnduePayments` - `UnduePayments`. ","non-blocking","IF(OR(not(Stamdata!$D$1042ExcludingUnduePayments=\"\"),not(Stamdata!$D$1041=\"\")),IF(+ sum(Stamdata!$D$1042ExcludingUnduePayments) - sum(Stamdata!$D$1041) = Stamdata!$D$1042 ,0,1),0)+AssertionId(\"valueAssertion_NotesRemunerationOfSupervisorySeniorOfficialsSpecification_PrtFST102Variables2\")","Stamdata!$D$1042"]
["KvK: Jaarverantwoording 2020 NLGAAP - kleine rechtspersonen - publicatiestukken","valueAssertion_NotesRemunerationOfSupervisorySeniorOfficialsSpecification_PrtFST102Variables2","`Remuneration` SHOULD be equal to + `RemunerationExcludingUnduePayments` - `UnduePayments`. ","non-blocking","IF(OR(not(Stamdata!$E$1042ExcludingUnduePayments=\"\"),not(Stamdata!$E$1041=\"\")),IF(+ sum(Stamdata!$E$1042ExcludingUnduePayments) - sum(Stamdata!$E$1041) = Stamdata!$E$1042 ,0,1),0)+AssertionId(\"valueAssertion_NotesRemunerationOfSupervisorySeniorOfficialsSpecification_PrtFST102Variables2\")","Stamdata!$E$1042"]
["KvK: Jaarverantwoording 2020 NLGAAP - kleine rechtspersonen - publicatiestukken","valueAssertion_NotesRemunerationOfSupervisorySeniorOfficialsSpecification_PrtFST102Variables2","`Remuneration` SHOULD be equal to + `RemunerationExcludingUnduePayments` - `UnduePayments`. ","non-blocking","IF(OR(not(Stamdata!$F$1042ExcludingUnduePayments=\"\"),not(Stamdata!$F$1041=\"\")),IF(+ sum(Stamdata!$F$1042ExcludingUnduePayments) - sum(Stamdata!$F$1041) = Stamdata!$F$1042 ,0,1),0)+AssertionId(\"valueAssertion_NotesRemunerationOfSupervisorySeniorOfficialsSpecification_PrtFST102Variables2\")","Stamdata!$F$1042"]
["KvK: Jaarverantwoording 2020 NLGAAP - kleine rechtspersonen - publicatiestukken","valueAssertion_NotesRemunerationOfSupervisorySeniorOfficialsSpecification_PrtFST102Variables2","`Remuneration` SHOULD be equal to + `RemunerationExcludingUnduePayments` - `UnduePayments`. ","non-blocking","IF(OR(not(Stamdata!$G$1042ExcludingUnduePayments=\"\"),not(Stamdata!$G$1041=\"\")),IF(+ sum(Stamdata!$G$1042ExcludingUnduePayments) - sum(Stamdata!$G$1041) = Stamdata!$G$1042 ,0,1),0)+AssertionId(\"valueAssertion_NotesRemunerationOfSupervisorySeniorOfficialsSpecification_PrtFST102Variables2\")","Stamdata!$G$1042"]
["KvK: Jaarverantwoording 2020 NLGAAP - kleine rechtspersonen - publicatiestukken","valueAssertion_NotesRemunerationOfSupervisorySeniorOfficialsSpecification_PrtFST102Variables2","`Remuneration` SHOULD be equal to + `RemunerationExcludingUnduePayments` - `UnduePayments`. ","non-blocking","IF(OR(not(Stamdata!$H$1042ExcludingUnduePayments=\"\"),not(Stamdata!$H$1041=\"\")),IF(+ sum(Stamdata!$H$1042ExcludingUnduePayments) - sum(Stamdata!$H$1041) = Stamdata!$H$1042 ,0,1),0)+AssertionId(\"valueAssertion_NotesRemunerationOfSupervisorySeniorOfficialsSpecification_PrtFST102Variables2\")","Stamdata!$H$1042"]
["KvK: Jaarverantwoording 2020 NLGAAP - kleine rechtspersonen - publicatiestukken","valueAssertion_NotesRevaluationReserveStatementOfChanges_PrtExistenceThnExistence1E1","`AdjustedRevaluationReserveAfterRecalculationChangeAccountingPolicies` SHOULD exist at least once within the same context, because `RevaluationReserveChangeAccountingPolicies` is reported. ","non-blocking","IF(not(Stamdata!$D$622=\"\"),0,1)+AssertionId(\"valueAssertion_NotesRevaluationReserveStatementOfChanges_PrtExistenceThnExistence1E1\")","Stamdata!$D$622"]
["KvK: Jaarverantwoording 2020 NLGAAP - kleine rechtspersonen - publicatiestukken","valueAssertion_NotesRevaluationReserveStatementOfChanges_PrtExistenceThnExistence1E1","`AdjustedRevaluationReserveAfterRecalculationChangeAccountingPolicies` SHOULD exist at least once within the same context, because `RevaluationReserveChangeAccountingPolicies` is reported. ","non-blocking","IF(not(Stamdata!$E$622=\"\"),0,1)+AssertionId(\"valueAssertion_NotesRevaluationReserveStatementOfChanges_PrtExistenceThnExistence1E1\")","Stamdata!$E$622"]
["KvK: Jaarverantwoording 2020 NLGAAP - kleine rechtspersonen - publicatiestukken","valueAssertion_NotesRevaluationReserveStatementOfChanges_PrtExistenceThnExistence1E1","`AdjustedRevaluationReserveAfterRecalculationChangeAccountingPolicies` SHOULD exist at least once within the same context, because `RevaluationReserveChangeAccountingPolicies` is reported. ","non-blocking","IF(not(Stamdata!$F$622=\"\"),0,1)+AssertionId(\"valueAssertion_NotesRevaluationReserveStatementOfChanges_PrtExistenceThnExistence1E1\")","Stamdata!$F$622"]
["KvK: Jaarverantwoording 2020 NLGAAP - kleine rechtspersonen - publicatiestukken","valueAssertion_NotesRevaluationReserveStatementOfChanges_PrtExistenceThnExistence1E1","`AdjustedRevaluationReserveAfterRecalculationChangeAccountingPolicies` SHOULD exist at least once within the same context, because `RevaluationReserveChangeAccountingPolicies` is reported. ","non-blocking","IF(not(Stamdata!$G$622=\"\"),0,1)+AssertionId(\"valueAssertion_NotesRevaluationReserveStatementOfChanges_PrtExistenceThnExistence1E1\")","Stamdata!$G$622"]
["KvK: Jaarverantwoording 2020 NLGAAP - kleine rechtspersonen - publicatiestukken","valueAssertion_NotesRevaluationReserveStatementOfChanges_PrtExistenceThnExistence1E1","`AdjustedRevaluationReserveAfterRecalculationChangeAccountingPolicies` SHOULD exist at least once within the same context, because `RevaluationReserveChangeAccountingPolicies` is reported. ","non-blocking","IF(not(Stamdata!$H$622=\"\"),0,1)+AssertionId(\"valueAssertion_NotesRevaluationReserveStatementOfChanges_PrtExistenceThnExistence1E1\")","Stamdata!$H$622"]
["KvK: Jaarverantwoording 2020 NLGAAP - kleine rechtspersonen - publicatiestukken","valueAssertion_NotesRevaluationReserveStatementOfChanges_PrtExistenceThnExistence1E1","`AdjustedRevaluationReserveAfterRecalculationChangeAccountingPolicies` SHOULD exist at least once within the same context, because `RevaluationReserveChangeAccountingPolicies` is reported. ","non-blocking","IF(not(Stamdata!$I$622=\"\"),0,1)+AssertionId(\"valueAssertion_NotesRevaluationReserveStatementOfChanges_PrtExistenceThnExistence1E1\")","Stamdata!$I$622"]
["KvK: Jaarverantwoording 2020 NLGAAP - kleine rechtspersonen - publicatiestukken","valueAssertion_NotesRevaluationReserveStatementOfChanges_PrtExistenceThnExistence1E1","`AdjustedRevaluationReserveAfterRecalculationChangeAccountingPolicies` SHOULD exist at least once within the same context, because `RevaluationReserveChangeAccountingPolicies` is reported. ","non-blocking","IF(not(Stamdata!$D$644=\"\"),0,1)+AssertionId(\"valueAssertion_NotesRevaluationReserveStatementOfChanges_PrtExistenceThnExistence1E1\")","Stamdata!$D$644"]
["KvK: Jaarverantwoording 2020 NLGAAP - kleine rechtspersonen - publicatiestukken","valueAssertion_NotesRevaluationReserveStatementOfChanges_PrtExistenceThnExistence1E1","`AdjustedRevaluationReserveAfterRecalculationChangeAccountingPolicies` SHOULD exist at least once within the same context, because `RevaluationReserveChangeAccountingPolicies` is reported. ","non-blocking","IF(not(Stamdata!$E$644=\"\"),0,1)+AssertionId(\"valueAssertion_NotesRevaluationReserveStatementOfChanges_PrtExistenceThnExistence1E1\")","Stamdata!$E$644"]
["KvK: Jaarverantwoording 2020 NLGAAP - kleine rechtspersonen - publicatiestukken","valueAssertion_NotesRevaluationReserveStatementOfChanges_PrtExistenceThnExistence1E1","`AdjustedRevaluationReserveAfterRecalculationChangeAccountingPolicies` SHOULD exist at least once within the same context, because `RevaluationReserveChangeAccountingPolicies` is reported. ","non-blocking","IF(not(Stamdata!$F$644=\"\"),0,1)+AssertionId(\"valueAssertion_NotesRevaluationReserveStatementOfChanges_PrtExistenceThnExistence1E1\")","Stamdata!$F$644"]
["KvK: Jaarverantwoording 2020 NLGAAP - kleine rechtspersonen - publicatiestukken","valueAssertion_NotesRevaluationReserveStatementOfChanges_PrtExistenceThnExistence1E1","`AdjustedRevaluationReserveAfterRecalculationChangeAccountingPolicies` SHOULD exist at least once within the same context, because `RevaluationReserveChangeAccountingPolicies` is reported. ","non-blocking","IF(not(Stamdata!$G$644=\"\"),0,1)+AssertionId(\"valueAssertion_NotesRevaluationReserveStatementOfChanges_PrtExistenceThnExistence1E1\")","Stamdata!$G$644"]
["KvK: Jaarverantwoording 2020 NLGAAP - kleine rechtspersonen - publicatiestukken","valueAssertion_NotesRevaluationReserveStatementOfChanges_PrtExistenceThnExistence1E1","`AdjustedRevaluationReserveAfterRecalculationChangeAccountingPolicies` SHOULD exist at least once within the same context, because `RevaluationReserveChangeAccountingPolicies` is reported. ","non-blocking","IF(not(Stamdata!$H$644=\"\"),0,1)+AssertionId(\"valueAssertion_NotesRevaluationReserveStatementOfChanges_PrtExistenceThnExistence1E1\")","Stamdata!$H$644"]
["KvK: Jaarverantwoording 2020 NLGAAP - kleine rechtspersonen - publicatiestukken","valueAssertion_NotesRevaluationReserveStatementOfChanges_PrtExistenceThnExistence1E1","`AdjustedRevaluationReserveAfterRecalculationChangeAccountingPolicies` SHOULD exist at least once within the same context, because `RevaluationReserveChangeAccountingPolicies` is reported. ","non-blocking","IF(not(Stamdata!$I$644=\"\"),0,1)+AssertionId(\"valueAssertion_NotesRevaluationReserveStatementOfChanges_PrtExistenceThnExistence1E1\")","Stamdata!$I$644"]
["KvK: Jaarverantwoording 2020 NLGAAP - kleine rechtspersonen - publicatiestukken","valueAssertion_NotesRevaluationReserveStatementOfChanges_PrtFST1ExistenceThn03Variables1","`AdjustedRevaluationReserveAfterRecalculationChangeAccountingPolicies` SHOULD be equal to + `RevaluationReserve` + `RevaluationReserveChangeAccountingPolicies` - `RevaluationReserveChangeAccountingPoliciesTaxImpact`, because `RevaluationReserveChangeAccountingPolicies` is reported. ","non-blocking","IF(OR(not(Stamdata!$D$619=\"\"),not(Stamdata!$D$619ChangeAccountingPolicies=\"\"),not(Stamdata!$D$619ChangeAccountingPoliciesTaxImpact=\"\")),IF(OR(+ sum(Stamdata!$D$619) + sum(Stamdata!$D$619ChangeAccountingPolicies) - sum(Stamdata!$D$619ChangeAccountingPoliciesTaxImpact) = Stamdata!$D$622 ,+ sum(Stamdata!$D$635) + sum(Stamdata!$D$635ChangeAccountingPolicies) - sum(Stamdata!$D$635ChangeAccountingPoliciesTaxImpact) = Stamdata!$D$622 ),0,1),0)+AssertionId(\"valueAssertion_NotesRevaluationReserveStatementOfChanges_PrtFST1ExistenceThn03Variables1\")","Stamdata!$D$619,Stamdata!$D$635"]
["KvK: Jaarverantwoording 2020 NLGAAP - kleine rechtspersonen - publicatiestukken","valueAssertion_NotesRevaluationReserveStatementOfChanges_PrtFST1ExistenceThn03Variables1","`AdjustedRevaluationReserveAfterRecalculationChangeAccountingPolicies` SHOULD be equal to + `RevaluationReserve` + `RevaluationReserveChangeAccountingPolicies` - `RevaluationReserveChangeAccountingPoliciesTaxImpact`, because `RevaluationReserveChangeAccountingPolicies` is reported. ","non-blocking","IF(OR(not(Stamdata!$E$619=\"\"),not(Stamdata!$E$619ChangeAccountingPolicies=\"\"),not(Stamdata!$E$619ChangeAccountingPoliciesTaxImpact=\"\")),IF(OR(+ sum(Stamdata!$E$619) + sum(Stamdata!$E$619ChangeAccountingPolicies) - sum(Stamdata!$E$619ChangeAccountingPoliciesTaxImpact) = Stamdata!$E$622 ,+ sum(Stamdata!$E$635) + sum(Stamdata!$E$635ChangeAccountingPolicies) - sum(Stamdata!$E$635ChangeAccountingPoliciesTaxImpact) = Stamdata!$E$622 ),0,1),0)+AssertionId(\"valueAssertion_NotesRevaluationReserveStatementOfChanges_PrtFST1ExistenceThn03Variables1\")","Stamdata!$E$619,Stamdata!$E$635"]
["KvK: Jaarverantwoording 2020 NLGAAP - kleine rechtspersonen - publicatiestukken","valueAssertion_NotesRevaluationReserveStatementOfChanges_PrtFST1ExistenceThn03Variables1","`AdjustedRevaluationReserveAfterRecalculationChangeAccountingPolicies` SHOULD be equal to + `RevaluationReserve` + `RevaluationReserveChangeAccountingPolicies` - `RevaluationReserveChangeAccountingPoliciesTaxImpact`, because `RevaluationReserveChangeAccountingPolicies` is reported. ","non-blocking","IF(OR(not(Stamdata!$F$619=\"\"),not(Stamdata!$F$619ChangeAccountingPolicies=\"\"),not(Stamdata!$F$619ChangeAccountingPoliciesTaxImpact=\"\")),IF(OR(+ sum(Stamdata!$F$619) + sum(Stamdata!$F$619ChangeAccountingPolicies) - sum(Stamdata!$F$619ChangeAccountingPoliciesTaxImpact) = Stamdata!$F$622 ,+ sum(Stamdata!$F$635) + sum(Stamdata!$F$635ChangeAccountingPolicies) - sum(Stamdata!$F$635ChangeAccountingPoliciesTaxImpact) = Stamdata!$F$622 ),0,1),0)+AssertionId(\"valueAssertion_NotesRevaluationReserveStatementOfChanges_PrtFST1ExistenceThn03Variables1\")","Stamdata!$F$619,Stamdata!$F$635"]
["KvK: Jaarverantwoording 2020 NLGAAP - kleine rechtspersonen - publicatiestukken","valueAssertion_NotesRevaluationReserveStatementOfChanges_PrtFST1ExistenceThn03Variables1","`AdjustedRevaluationReserveAfterRecalculationChangeAccountingPolicies` SHOULD be equal to + `RevaluationReserve` + `RevaluationReserveChangeAccountingPolicies` - `RevaluationReserveChangeAccountingPoliciesTaxImpact`, because `RevaluationReserveChangeAccountingPolicies` is reported. ","non-blocking","IF(OR(not(Stamdata!$G$619=\"\"),not(Stamdata!$G$619ChangeAccountingPolicies=\"\"),not(Stamdata!$G$619ChangeAccountingPoliciesTaxImpact=\"\")),IF(OR(+ sum(Stamdata!$G$619) + sum(Stamdata!$G$619ChangeAccountingPolicies) - sum(Stamdata!$G$619ChangeAccountingPoliciesTaxImpact) = Stamdata!$G$622 ,+ sum(Stamdata!$G$635) + sum(Stamdata!$G$635ChangeAccountingPolicies) - sum(Stamdata!$G$635ChangeAccountingPoliciesTaxImpact) = Stamdata!$G$622 ),0,1),0)+AssertionId(\"valueAssertion_NotesRevaluationReserveStatementOfChanges_PrtFST1ExistenceThn03Variables1\")","Stamdata!$G$619,Stamdata!$G$635"]
["KvK: Jaarverantwoording 2020 NLGAAP - kleine rechtspersonen - publicatiestukken","valueAssertion_NotesRevaluationReserveStatementOfChanges_PrtFST1ExistenceThn03Variables1","`AdjustedRevaluationReserveAfterRecalculationChangeAccountingPolicies` SHOULD be equal to + `RevaluationReserve` + `RevaluationReserveChangeAccountingPolicies` - `RevaluationReserveChangeAccountingPoliciesTaxImpact`, because `RevaluationReserveChangeAccountingPolicies` is reported. ","non-blocking","IF(OR(not(Stamdata!$H$619=\"\"),not(Stamdata!$H$619ChangeAccountingPolicies=\"\"),not(Stamdata!$H$619ChangeAccountingPoliciesTaxImpact=\"\")),IF(OR(+ sum(Stamdata!$H$619) + sum(Stamdata!$H$619ChangeAccountingPolicies) - sum(Stamdata!$H$619ChangeAccountingPoliciesTaxImpact) = Stamdata!$H$622 ,+ sum(Stamdata!$H$635) + sum(Stamdata!$H$635ChangeAccountingPolicies) - sum(Stamdata!$H$635ChangeAccountingPoliciesTaxImpact) = Stamdata!$H$622 ),0,1),0)+AssertionId(\"valueAssertion_NotesRevaluationReserveStatementOfChanges_PrtFST1ExistenceThn03Variables1\")","Stamdata!$H$619,Stamdata!$H$635"]
["KvK: Jaarverantwoording 2020 NLGAAP - kleine rechtspersonen - publicatiestukken","valueAssertion_NotesRevaluationReserveStatementOfChanges_PrtFST1ExistenceThn03Variables1","`AdjustedRevaluationReserveAfterRecalculationChangeAccountingPolicies` SHOULD be equal to + `RevaluationReserve` + `RevaluationReserveChangeAccountingPolicies` - `RevaluationReserveChangeAccountingPoliciesTaxImpact`, because `RevaluationReserveChangeAccountingPolicies` is reported. ","non-blocking","IF(OR(not(Stamdata!$I$619=\"\"),not(Stamdata!$I$619ChangeAccountingPolicies=\"\"),not(Stamdata!$I$619ChangeAccountingPoliciesTaxImpact=\"\")),IF(OR(+ sum(Stamdata!$I$619) + sum(Stamdata!$I$619ChangeAccountingPolicies) - sum(Stamdata!$I$619ChangeAccountingPoliciesTaxImpact) = Stamdata!$I$622 ,+ sum(Stamdata!$I$635) + sum(Stamdata!$I$635ChangeAccountingPolicies) - sum(Stamdata!$I$635ChangeAccountingPoliciesTaxImpact) = Stamdata!$I$622 ),0,1),0)+AssertionId(\"valueAssertion_NotesRevaluationReserveStatementOfChanges_PrtFST1ExistenceThn03Variables1\")","Stamdata!$I$619,Stamdata!$I$635"]
["KvK: Jaarverantwoording 2020 NLGAAP - kleine rechtspersonen - publicatiestukken","valueAssertion_NotesRevaluationReserveStatementOfChanges_PrtFST1ExistenceThn03Variables1","`AdjustedRevaluationReserveAfterRecalculationChangeAccountingPolicies` SHOULD be equal to + `RevaluationReserve` + `RevaluationReserveChangeAccountingPolicies` - `RevaluationReserveChangeAccountingPoliciesTaxImpact`, because `RevaluationReserveChangeAccountingPolicies` is reported. ","non-blocking","IF(OR(not(Stamdata!$D$641=\"\"),not(Stamdata!$D$641ChangeAccountingPolicies=\"\"),not(Stamdata!$D$641ChangeAccountingPoliciesTaxImpact=\"\")),IF(OR(+ sum(Stamdata!$D$641) + sum(Stamdata!$D$641ChangeAccountingPolicies) - sum(Stamdata!$D$641ChangeAccountingPoliciesTaxImpact) = Stamdata!$D$644 ,+ sum(Stamdata!$D$657) + sum(Stamdata!$D$657ChangeAccountingPolicies) - sum(Stamdata!$D$657ChangeAccountingPoliciesTaxImpact) = Stamdata!$D$644 ),0,1),0)+AssertionId(\"valueAssertion_NotesRevaluationReserveStatementOfChanges_PrtFST1ExistenceThn03Variables1\")","Stamdata!$D$641,Stamdata!$D$657"]
["KvK: Jaarverantwoording 2020 NLGAAP - kleine rechtspersonen - publicatiestukken","valueAssertion_NotesRevaluationReserveStatementOfChanges_PrtFST1ExistenceThn03Variables1","`AdjustedRevaluationReserveAfterRecalculationChangeAccountingPolicies` SHOULD be equal to + `RevaluationReserve` + `RevaluationReserveChangeAccountingPolicies` - `RevaluationReserveChangeAccountingPoliciesTaxImpact`, because `RevaluationReserveChangeAccountingPolicies` is reported. ","non-blocking","IF(OR(not(Stamdata!$E$641=\"\"),not(Stamdata!$E$641ChangeAccountingPolicies=\"\"),not(Stamdata!$E$641ChangeAccountingPoliciesTaxImpact=\"\")),IF(OR(+ sum(Stamdata!$E$641) + sum(Stamdata!$E$641ChangeAccountingPolicies) - sum(Stamdata!$E$641ChangeAccountingPoliciesTaxImpact) = Stamdata!$E$644 ,+ sum(Stamdata!$E$657) + sum(Stamdata!$E$657ChangeAccountingPolicies) - sum(Stamdata!$E$657ChangeAccountingPoliciesTaxImpact) = Stamdata!$E$644 ),0,1),0)+AssertionId(\"valueAssertion_NotesRevaluationReserveStatementOfChanges_PrtFST1ExistenceThn03Variables1\")","Stamdata!$E$641,Stamdata!$E$657"]
["KvK: Jaarverantwoording 2020 NLGAAP - kleine rechtspersonen - publicatiestukken","valueAssertion_NotesRevaluationReserveStatementOfChanges_PrtFST1ExistenceThn03Variables1","`AdjustedRevaluationReserveAfterRecalculationChangeAccountingPolicies` SHOULD be equal to + `RevaluationReserve` + `RevaluationReserveChangeAccountingPolicies` - `RevaluationReserveChangeAccountingPoliciesTaxImpact`, because `RevaluationReserveChangeAccountingPolicies` is reported. ","non-blocking","IF(OR(not(Stamdata!$F$641=\"\"),not(Stamdata!$F$641ChangeAccountingPolicies=\"\"),not(Stamdata!$F$641ChangeAccountingPoliciesTaxImpact=\"\")),IF(OR(+ sum(Stamdata!$F$641) + sum(Stamdata!$F$641ChangeAccountingPolicies) - sum(Stamdata!$F$641ChangeAccountingPoliciesTaxImpact) = Stamdata!$F$644 ,+ sum(Stamdata!$F$657) + sum(Stamdata!$F$657ChangeAccountingPolicies) - sum(Stamdata!$F$657ChangeAccountingPoliciesTaxImpact) = Stamdata!$F$644 ),0,1),0)+AssertionId(\"valueAssertion_NotesRevaluationReserveStatementOfChanges_PrtFST1ExistenceThn03Variables1\")","Stamdata!$F$641,Stamdata!$F$657"]
["KvK: Jaarverantwoording 2020 NLGAAP - kleine rechtspersonen - publicatiestukken","valueAssertion_NotesRevaluationReserveStatementOfChanges_PrtFST1ExistenceThn03Variables1","`AdjustedRevaluationReserveAfterRecalculationChangeAccountingPolicies` SHOULD be equal to + `RevaluationReserve` + `RevaluationReserveChangeAccountingPolicies` - `RevaluationReserveChangeAccountingPoliciesTaxImpact`, because `RevaluationReserveChangeAccountingPolicies` is reported. ","non-blocking","IF(OR(not(Stamdata!$G$641=\"\"),not(Stamdata!$G$641ChangeAccountingPolicies=\"\"),not(Stamdata!$G$641ChangeAccountingPoliciesTaxImpact=\"\")),IF(OR(+ sum(Stamdata!$G$641) + sum(Stamdata!$G$641ChangeAccountingPolicies) - sum(Stamdata!$G$641ChangeAccountingPoliciesTaxImpact) = Stamdata!$G$644 ,+ sum(Stamdata!$G$657) + sum(Stamdata!$G$657ChangeAccountingPolicies) - sum(Stamdata!$G$657ChangeAccountingPoliciesTaxImpact) = Stamdata!$G$644 ),0,1),0)+AssertionId(\"valueAssertion_NotesRevaluationReserveStatementOfChanges_PrtFST1ExistenceThn03Variables1\")","Stamdata!$G$641,Stamdata!$G$657"]
["KvK: Jaarverantwoording 2020 NLGAAP - kleine rechtspersonen - publicatiestukken","valueAssertion_NotesRevaluationReserveStatementOfChanges_PrtFST1ExistenceThn03Variables1","`AdjustedRevaluationReserveAfterRecalculationChangeAccountingPolicies` SHOULD be equal to + `RevaluationReserve` + `RevaluationReserveChangeAccountingPolicies` - `RevaluationReserveChangeAccountingPoliciesTaxImpact`, because `RevaluationReserveChangeAccountingPolicies` is reported. ","non-blocking","IF(OR(not(Stamdata!$H$641=\"\"),not(Stamdata!$H$641ChangeAccountingPolicies=\"\"),not(Stamdata!$H$641ChangeAccountingPoliciesTaxImpact=\"\")),IF(OR(+ sum(Stamdata!$H$641) + sum(Stamdata!$H$641ChangeAccountingPolicies) - sum(Stamdata!$H$641ChangeAccountingPoliciesTaxImpact) = Stamdata!$H$644 ,+ sum(Stamdata!$H$657) + sum(Stamdata!$H$657ChangeAccountingPolicies) - sum(Stamdata!$H$657ChangeAccountingPoliciesTaxImpact) = Stamdata!$H$644 ),0,1),0)+AssertionId(\"valueAssertion_NotesRevaluationReserveStatementOfChanges_PrtFST1ExistenceThn03Variables1\")","Stamdata!$H$641,Stamdata!$H$657"]
["KvK: Jaarverantwoording 2020 NLGAAP - kleine rechtspersonen - publicatiestukken","valueAssertion_NotesRevaluationReserveStatementOfChanges_PrtFST1ExistenceThn03Variables1","`AdjustedRevaluationReserveAfterRecalculationChangeAccountingPolicies` SHOULD be equal to + `RevaluationReserve` + `RevaluationReserveChangeAccountingPolicies` - `RevaluationReserveChangeAccountingPoliciesTaxImpact`, because `RevaluationReserveChangeAccountingPolicies` is reported. ","non-blocking","IF(OR(not(Stamdata!$I$641=\"\"),not(Stamdata!$I$641ChangeAccountingPolicies=\"\"),not(Stamdata!$I$641ChangeAccountingPoliciesTaxImpact=\"\")),IF(OR(+ sum(Stamdata!$I$641) + sum(Stamdata!$I$641ChangeAccountingPolicies) - sum(Stamdata!$I$641ChangeAccountingPoliciesTaxImpact) = Stamdata!$I$644 ,+ sum(Stamdata!$I$657) + sum(Stamdata!$I$657ChangeAccountingPolicies) - sum(Stamdata!$I$657ChangeAccountingPoliciesTaxImpact) = Stamdata!$I$644 ),0,1),0)+AssertionId(\"valueAssertion_NotesRevaluationReserveStatementOfChanges_PrtFST1ExistenceThn03Variables1\")","Stamdata!$I$641,Stamdata!$I$657"]
["KvK: Jaarverantwoording 2020 NLGAAP - kleine rechtspersonen - publicatiestukken","valueAssertion_NotesRevaluationReserveStatementOfChanges_PrtFST1ExistenceThnPeriodStartMutationPeriodEnd1","The reported value of `RevaluationReserve` at end of period SHOULD be equal to sum of reported value of `AdjustedRevaluationReserveAfterRecalculationChangeAccountingPolicies` at beginning of period and changes in that value during period, `RevaluationReserveMovement`, because `RevaluationReserveChangeAccountingPolicies` is reported. ","non-blocking","IF(OR(Stamdata!$D$622 + Stamdata!$D$633 = Stamdata!$D$619,Stamdata!$D$622 + Stamdata!$D$633 = Stamdata!$D$635),0,1)+AssertionId(\"valueAssertion_NotesRevaluationReserveStatementOfChanges_PrtFST1ExistenceThnPeriodStartMutationPeriodEnd1\")","Stamdata!$D$619,Stamdata!$D$635"]
["KvK: Jaarverantwoording 2020 NLGAAP - kleine rechtspersonen - publicatiestukken","valueAssertion_NotesRevaluationReserveStatementOfChanges_PrtFST1ExistenceThnPeriodStartMutationPeriodEnd1","The reported value of `RevaluationReserve` at end of period SHOULD be equal to sum of reported value of `AdjustedRevaluationReserveAfterRecalculationChangeAccountingPolicies` at beginning of period and changes in that value during period, `RevaluationReserveMovement`, because `RevaluationReserveChangeAccountingPolicies` is reported. ","non-blocking","IF(OR(Stamdata!$E$622 + Stamdata!$E$633 = Stamdata!$E$619,Stamdata!$E$622 + Stamdata!$E$633 = Stamdata!$E$635),0,1)+AssertionId(\"valueAssertion_NotesRevaluationReserveStatementOfChanges_PrtFST1ExistenceThnPeriodStartMutationPeriodEnd1\")","Stamdata!$E$619,Stamdata!$E$635"]
["KvK: Jaarverantwoording 2020 NLGAAP - kleine rechtspersonen - publicatiestukken","valueAssertion_NotesRevaluationReserveStatementOfChanges_PrtFST1ExistenceThnPeriodStartMutationPeriodEnd1","The reported value of `RevaluationReserve` at end of period SHOULD be equal to sum of reported value of `AdjustedRevaluationReserveAfterRecalculationChangeAccountingPolicies` at beginning of period and changes in that value during period, `RevaluationReserveMovement`, because `RevaluationReserveChangeAccountingPolicies` is reported. ","non-blocking","IF(OR(Stamdata!$F$622 + Stamdata!$F$633 = Stamdata!$F$619,Stamdata!$F$622 + Stamdata!$F$633 = Stamdata!$F$635),0,1)+AssertionId(\"valueAssertion_NotesRevaluationReserveStatementOfChanges_PrtFST1ExistenceThnPeriodStartMutationPeriodEnd1\")","Stamdata!$F$619,Stamdata!$F$635"]
["KvK: Jaarverantwoording 2020 NLGAAP - kleine rechtspersonen - publicatiestukken","valueAssertion_NotesRevaluationReserveStatementOfChanges_PrtFST1ExistenceThnPeriodStartMutationPeriodEnd1","The reported value of `RevaluationReserve` at end of period SHOULD be equal to sum of reported value of `AdjustedRevaluationReserveAfterRecalculationChangeAccountingPolicies` at beginning of period and changes in that value during period, `RevaluationReserveMovement`, because `RevaluationReserveChangeAccountingPolicies` is reported. ","non-blocking","IF(OR(Stamdata!$G$622 + Stamdata!$G$633 = Stamdata!$G$619,Stamdata!$G$622 + Stamdata!$G$633 = Stamdata!$G$635),0,1)+AssertionId(\"valueAssertion_NotesRevaluationReserveStatementOfChanges_PrtFST1ExistenceThnPeriodStartMutationPeriodEnd1\")","Stamdata!$G$619,Stamdata!$G$635"]
["KvK: Jaarverantwoording 2020 NLGAAP - kleine rechtspersonen - publicatiestukken","valueAssertion_NotesRevaluationReserveStatementOfChanges_PrtFST1ExistenceThnPeriodStartMutationPeriodEnd1","The reported value of `RevaluationReserve` at end of period SHOULD be equal to sum of reported value of `AdjustedRevaluationReserveAfterRecalculationChangeAccountingPolicies` at beginning of period and changes in that value during period, `RevaluationReserveMovement`, because `RevaluationReserveChangeAccountingPolicies` is reported. ","non-blocking","IF(OR(Stamdata!$H$622 + Stamdata!$H$633 = Stamdata!$H$619,Stamdata!$H$622 + Stamdata!$H$633 = Stamdata!$H$635),0,1)+AssertionId(\"valueAssertion_NotesRevaluationReserveStatementOfChanges_PrtFST1ExistenceThnPeriodStartMutationPeriodEnd1\")","Stamdata!$H$619,Stamdata!$H$635"]
["KvK: Jaarverantwoording 2020 NLGAAP - kleine rechtspersonen - publicatiestukken","valueAssertion_NotesRevaluationReserveStatementOfChanges_PrtFST1ExistenceThnPeriodStartMutationPeriodEnd1","The reported value of `RevaluationReserve` at end of period SHOULD be equal to sum of reported value of `AdjustedRevaluationReserveAfterRecalculationChangeAccountingPolicies` at beginning of period and changes in that value during period, `RevaluationReserveMovement`, because `RevaluationReserveChangeAccountingPolicies` is reported. ","non-blocking","IF(OR(Stamdata!$I$622 + Stamdata!$I$633 = Stamdata!$I$619,Stamdata!$I$622 + Stamdata!$I$633 = Stamdata!$I$635),0,1)+AssertionId(\"valueAssertion_NotesRevaluationReserveStatementOfChanges_PrtFST1ExistenceThnPeriodStartMutationPeriodEnd1\")","Stamdata!$I$619,Stamdata!$I$635"]
["KvK: Jaarverantwoording 2020 NLGAAP - kleine rechtspersonen - publicatiestukken","valueAssertion_NotesRevaluationReserveStatementOfChanges_PrtFST1ExistenceThnPeriodStartMutationPeriodEnd1","The reported value of `RevaluationReserve` at end of period SHOULD be equal to sum of reported value of `AdjustedRevaluationReserveAfterRecalculationChangeAccountingPolicies` at beginning of period and changes in that value during period, `RevaluationReserveMovement`, because `RevaluationReserveChangeAccountingPolicies` is reported. ","non-blocking","IF(OR(Stamdata!$D$644 + Stamdata!$D$655 = Stamdata!$D$641,Stamdata!$D$644 + Stamdata!$D$655 = Stamdata!$D$657),0,1)+AssertionId(\"valueAssertion_NotesRevaluationReserveStatementOfChanges_PrtFST1ExistenceThnPeriodStartMutationPeriodEnd1\")","Stamdata!$D$641,Stamdata!$D$657"]
["KvK: Jaarverantwoording 2020 NLGAAP - kleine rechtspersonen - publicatiestukken","valueAssertion_NotesRevaluationReserveStatementOfChanges_PrtFST1ExistenceThnPeriodStartMutationPeriodEnd1","The reported value of `RevaluationReserve` at end of period SHOULD be equal to sum of reported value of `AdjustedRevaluationReserveAfterRecalculationChangeAccountingPolicies` at beginning of period and changes in that value during period, `RevaluationReserveMovement`, because `RevaluationReserveChangeAccountingPolicies` is reported. ","non-blocking","IF(OR(Stamdata!$E$644 + Stamdata!$E$655 = Stamdata!$E$641,Stamdata!$E$644 + Stamdata!$E$655 = Stamdata!$E$657),0,1)+AssertionId(\"valueAssertion_NotesRevaluationReserveStatementOfChanges_PrtFST1ExistenceThnPeriodStartMutationPeriodEnd1\")","Stamdata!$E$641,Stamdata!$E$657"]
["KvK: Jaarverantwoording 2020 NLGAAP - kleine rechtspersonen - publicatiestukken","valueAssertion_NotesRevaluationReserveStatementOfChanges_PrtFST1ExistenceThnPeriodStartMutationPeriodEnd1","The reported value of `RevaluationReserve` at end of period SHOULD be equal to sum of reported value of `AdjustedRevaluationReserveAfterRecalculationChangeAccountingPolicies` at beginning of period and changes in that value during period, `RevaluationReserveMovement`, because `RevaluationReserveChangeAccountingPolicies` is reported. ","non-blocking","IF(OR(Stamdata!$F$644 + Stamdata!$F$655 = Stamdata!$F$641,Stamdata!$F$644 + Stamdata!$F$655 = Stamdata!$F$657),0,1)+AssertionId(\"valueAssertion_NotesRevaluationReserveStatementOfChanges_PrtFST1ExistenceThnPeriodStartMutationPeriodEnd1\")","Stamdata!$F$641,Stamdata!$F$657"]
["KvK: Jaarverantwoording 2020 NLGAAP - kleine rechtspersonen - publicatiestukken","valueAssertion_NotesRevaluationReserveStatementOfChanges_PrtFST1ExistenceThnPeriodStartMutationPeriodEnd1","The reported value of `RevaluationReserve` at end of period SHOULD be equal to sum of reported value of `AdjustedRevaluationReserveAfterRecalculationChangeAccountingPolicies` at beginning of period and changes in that value during period, `RevaluationReserveMovement`, because `RevaluationReserveChangeAccountingPolicies` is reported. ","non-blocking","IF(OR(Stamdata!$G$644 + Stamdata!$G$655 = Stamdata!$G$641,Stamdata!$G$644 + Stamdata!$G$655 = Stamdata!$G$657),0,1)+AssertionId(\"valueAssertion_NotesRevaluationReserveStatementOfChanges_PrtFST1ExistenceThnPeriodStartMutationPeriodEnd1\")","Stamdata!$G$641,Stamdata!$G$657"]
["KvK: Jaarverantwoording 2020 NLGAAP - kleine rechtspersonen - publicatiestukken","valueAssertion_NotesRevaluationReserveStatementOfChanges_PrtFST1ExistenceThnPeriodStartMutationPeriodEnd1","The reported value of `RevaluationReserve` at end of period SHOULD be equal to sum of reported value of `AdjustedRevaluationReserveAfterRecalculationChangeAccountingPolicies` at beginning of period and changes in that value during period, `RevaluationReserveMovement`, because `RevaluationReserveChangeAccountingPolicies` is reported. ","non-blocking","IF(OR(Stamdata!$H$644 + Stamdata!$H$655 = Stamdata!$H$641,Stamdata!$H$644 + Stamdata!$H$655 = Stamdata!$H$657),0,1)+AssertionId(\"valueAssertion_NotesRevaluationReserveStatementOfChanges_PrtFST1ExistenceThnPeriodStartMutationPeriodEnd1\")","Stamdata!$H$641,Stamdata!$H$657"]
["KvK: Jaarverantwoording 2020 NLGAAP - kleine rechtspersonen - publicatiestukken","valueAssertion_NotesRevaluationReserveStatementOfChanges_PrtFST1ExistenceThnPeriodStartMutationPeriodEnd1","The reported value of `RevaluationReserve` at end of period SHOULD be equal to sum of reported value of `AdjustedRevaluationReserveAfterRecalculationChangeAccountingPolicies` at beginning of period and changes in that value during period, `RevaluationReserveMovement`, because `RevaluationReserveChangeAccountingPolicies` is reported. ","non-blocking","IF(OR(Stamdata!$I$644 + Stamdata!$I$655 = Stamdata!$I$641,Stamdata!$I$644 + Stamdata!$I$655 = Stamdata!$I$657),0,1)+AssertionId(\"valueAssertion_NotesRevaluationReserveStatementOfChanges_PrtFST1ExistenceThnPeriodStartMutationPeriodEnd1\")","Stamdata!$I$641,Stamdata!$I$657"]
["KvK: Jaarverantwoording 2020 NLGAAP - kleine rechtspersonen - publicatiestukken","valueAssertion_NotesRevaluationReserveStatementOfChanges_PrtFST1FactExplicitEQFactNonExplicit1","`RevaluationReserve` reported with `ClassesOfRevaluationReserveAxis` and `RevaluationReserveMember` SHOULD be equal to `RevaluationReserve` without `ClassesOfRevaluationReserveAxis` and RevaluationReserveMember| ","non-blocking","IF(OR(Stamdata!$D$619 = Stamdata!$D$619,Stamdata!$D$635 = Stamdata!$D$619),0,1)+AssertionId(\"valueAssertion_NotesRevaluationReserveStatementOfChanges_PrtFST1FactExplicitEQFactNonExplicit1\")","Stamdata!$D$619,Stamdata!$D$635"]
["KvK: Jaarverantwoording 2020 NLGAAP - kleine rechtspersonen - publicatiestukken","valueAssertion_NotesRevaluationReserveStatementOfChanges_PrtFST1FactExplicitEQFactNonExplicit1","`RevaluationReserve` reported with `ClassesOfRevaluationReserveAxis` and `RevaluationReserveMember` SHOULD be equal to `RevaluationReserve` without `ClassesOfRevaluationReserveAxis` and RevaluationReserveMember| ","non-blocking","IF(OR(Stamdata!$E$619 = Stamdata!$E$619,Stamdata!$E$635 = Stamdata!$E$619),0,1)+AssertionId(\"valueAssertion_NotesRevaluationReserveStatementOfChanges_PrtFST1FactExplicitEQFactNonExplicit1\")","Stamdata!$E$619,Stamdata!$E$635"]
["KvK: Jaarverantwoording 2020 NLGAAP - kleine rechtspersonen - publicatiestukken","valueAssertion_NotesRevaluationReserveStatementOfChanges_PrtFST1FactExplicitEQFactNonExplicit1","`RevaluationReserve` reported with `ClassesOfRevaluationReserveAxis` and `RevaluationReserveMember` SHOULD be equal to `RevaluationReserve` without `ClassesOfRevaluationReserveAxis` and RevaluationReserveMember| ","non-blocking","IF(OR(Stamdata!$F$619 = Stamdata!$F$619,Stamdata!$F$635 = Stamdata!$F$619),0,1)+AssertionId(\"valueAssertion_NotesRevaluationReserveStatementOfChanges_PrtFST1FactExplicitEQFactNonExplicit1\")","Stamdata!$F$619,Stamdata!$F$635"]
["KvK: Jaarverantwoording 2020 NLGAAP - kleine rechtspersonen - publicatiestukken","valueAssertion_NotesRevaluationReserveStatementOfChanges_PrtFST1FactExplicitEQFactNonExplicit1","`RevaluationReserve` reported with `ClassesOfRevaluationReserveAxis` and `RevaluationReserveMember` SHOULD be equal to `RevaluationReserve` without `ClassesOfRevaluationReserveAxis` and RevaluationReserveMember| ","non-blocking","IF(OR(Stamdata!$G$619 = Stamdata!$G$619,Stamdata!$G$635 = Stamdata!$G$619),0,1)+AssertionId(\"valueAssertion_NotesRevaluationReserveStatementOfChanges_PrtFST1FactExplicitEQFactNonExplicit1\")","Stamdata!$G$619,Stamdata!$G$635"]
["KvK: Jaarverantwoording 2020 NLGAAP - kleine rechtspersonen - publicatiestukken","valueAssertion_NotesRevaluationReserveStatementOfChanges_PrtFST1FactExplicitEQFactNonExplicit1","`RevaluationReserve` reported with `ClassesOfRevaluationReserveAxis` and `RevaluationReserveMember` SHOULD be equal to `RevaluationReserve` without `ClassesOfRevaluationReserveAxis` and RevaluationReserveMember| ","non-blocking","IF(OR(Stamdata!$H$619 = Stamdata!$H$619,Stamdata!$H$635 = Stamdata!$H$619),0,1)+AssertionId(\"valueAssertion_NotesRevaluationReserveStatementOfChanges_PrtFST1FactExplicitEQFactNonExplicit1\")","Stamdata!$H$619,Stamdata!$H$635"]
["KvK: Jaarverantwoording 2020 NLGAAP - kleine rechtspersonen - publicatiestukken","valueAssertion_NotesRevaluationReserveStatementOfChanges_PrtFST1FactExplicitEQFactNonExplicit1","`RevaluationReserve` reported with `ClassesOfRevaluationReserveAxis` and `RevaluationReserveMember` SHOULD be equal to `RevaluationReserve` without `ClassesOfRevaluationReserveAxis` and RevaluationReserveMember| ","non-blocking","IF(OR(Stamdata!$I$619 = Stamdata!$I$619,Stamdata!$I$635 = Stamdata!$I$619),0,1)+AssertionId(\"valueAssertion_NotesRevaluationReserveStatementOfChanges_PrtFST1FactExplicitEQFactNonExplicit1\")","Stamdata!$I$619,Stamdata!$I$635"]
["KvK: Jaarverantwoording 2020 NLGAAP - kleine rechtspersonen - publicatiestukken","valueAssertion_NotesRevaluationReserveStatementOfChanges_PrtFST1FactExplicitEQFactNonExplicit1","`RevaluationReserve` reported with `ClassesOfRevaluationReserveAxis` and `RevaluationReserveMember` SHOULD be equal to `RevaluationReserve` without `ClassesOfRevaluationReserveAxis` and RevaluationReserveMember| ","non-blocking","IF(OR(Stamdata!$D$641 = Stamdata!$D$641,Stamdata!$D$657 = Stamdata!$D$641),0,1)+AssertionId(\"valueAssertion_NotesRevaluationReserveStatementOfChanges_PrtFST1FactExplicitEQFactNonExplicit1\")","Stamdata!$D$641,Stamdata!$D$657"]
["KvK: Jaarverantwoording 2020 NLGAAP - kleine rechtspersonen - publicatiestukken","valueAssertion_NotesRevaluationReserveStatementOfChanges_PrtFST1FactExplicitEQFactNonExplicit1","`RevaluationReserve` reported with `ClassesOfRevaluationReserveAxis` and `RevaluationReserveMember` SHOULD be equal to `RevaluationReserve` without `ClassesOfRevaluationReserveAxis` and RevaluationReserveMember| ","non-blocking","IF(OR(Stamdata!$E$641 = Stamdata!$E$641,Stamdata!$E$657 = Stamdata!$E$641),0,1)+AssertionId(\"valueAssertion_NotesRevaluationReserveStatementOfChanges_PrtFST1FactExplicitEQFactNonExplicit1\")","Stamdata!$E$641,Stamdata!$E$657"]
["KvK: Jaarverantwoording 2020 NLGAAP - kleine rechtspersonen - publicatiestukken","valueAssertion_NotesRevaluationReserveStatementOfChanges_PrtFST1FactExplicitEQFactNonExplicit1","`RevaluationReserve` reported with `ClassesOfRevaluationReserveAxis` and `RevaluationReserveMember` SHOULD be equal to `RevaluationReserve` without `ClassesOfRevaluationReserveAxis` and RevaluationReserveMember| ","non-blocking","IF(OR(Stamdata!$F$641 = Stamdata!$F$641,Stamdata!$F$657 = Stamdata!$F$641),0,1)+AssertionId(\"valueAssertion_NotesRevaluationReserveStatementOfChanges_PrtFST1FactExplicitEQFactNonExplicit1\")","Stamdata!$F$641,Stamdata!$F$657"]
["KvK: Jaarverantwoording 2020 NLGAAP - kleine rechtspersonen - publicatiestukken","valueAssertion_NotesRevaluationReserveStatementOfChanges_PrtFST1FactExplicitEQFactNonExplicit1","`RevaluationReserve` reported with `ClassesOfRevaluationReserveAxis` and `RevaluationReserveMember` SHOULD be equal to `RevaluationReserve` without `ClassesOfRevaluationReserveAxis` and RevaluationReserveMember| ","non-blocking","IF(OR(Stamdata!$G$641 = Stamdata!$G$641,Stamdata!$G$657 = Stamdata!$G$641),0,1)+AssertionId(\"valueAssertion_NotesRevaluationReserveStatementOfChanges_PrtFST1FactExplicitEQFactNonExplicit1\")","Stamdata!$G$641,Stamdata!$G$657"]
["KvK: Jaarverantwoording 2020 NLGAAP - kleine rechtspersonen - publicatiestukken","valueAssertion_NotesRevaluationReserveStatementOfChanges_PrtFST1FactExplicitEQFactNonExplicit1","`RevaluationReserve` reported with `ClassesOfRevaluationReserveAxis` and `RevaluationReserveMember` SHOULD be equal to `RevaluationReserve` without `ClassesOfRevaluationReserveAxis` and RevaluationReserveMember| ","non-blocking","IF(OR(Stamdata!$H$641 = Stamdata!$H$641,Stamdata!$H$657 = Stamdata!$H$641),0,1)+AssertionId(\"valueAssertion_NotesRevaluationReserveStatementOfChanges_PrtFST1FactExplicitEQFactNonExplicit1\")","Stamdata!$H$641,Stamdata!$H$657"]
["KvK: Jaarverantwoording 2020 NLGAAP - kleine rechtspersonen - publicatiestukken","valueAssertion_NotesRevaluationReserveStatementOfChanges_PrtFST1FactExplicitEQFactNonExplicit1","`RevaluationReserve` reported with `ClassesOfRevaluationReserveAxis` and `RevaluationReserveMember` SHOULD be equal to `RevaluationReserve` without `ClassesOfRevaluationReserveAxis` and RevaluationReserveMember| ","non-blocking","IF(OR(Stamdata!$I$641 = Stamdata!$I$641,Stamdata!$I$657 = Stamdata!$I$641),0,1)+AssertionId(\"valueAssertion_NotesRevaluationReserveStatementOfChanges_PrtFST1FactExplicitEQFactNonExplicit1\")","Stamdata!$I$641,Stamdata!$I$657"]
["KvK: Jaarverantwoording 2020 NLGAAP - kleine rechtspersonen - publicatiestukken","valueAssertion_NotesRevaluationReserveStatementOfChanges_PrtFST1NoExistenceThnPeriodStartMutationPeriodEnd1","The reported value of `RevaluationReserve` at end of period SHOULD be equal to sum of reported value of `RevaluationReserve` at beginning of period and changes in that value during period, `RevaluationReserveMovement`, because `RevaluationReserveChangeAccountingPolicies` is not reported. ","non-blocking","IF(Stamdata!$D$620=\"\",IF(OR(Stamdata!$D$619 + Stamdata!$D$633 = Stamdata!$D$619,Stamdata!$D$619 + Stamdata!$D$633 = Stamdata!$D$635),0,1),0)+AssertionId(\"valueAssertion_NotesRevaluationReserveStatementOfChanges_PrtFST1NoExistenceThnPeriodStartMutationPeriodEnd1\")","Stamdata!$D$619,Stamdata!$D$635"]
["KvK: Jaarverantwoording 2020 NLGAAP - kleine rechtspersonen - publicatiestukken","valueAssertion_NotesRevaluationReserveStatementOfChanges_PrtFST1NoExistenceThnPeriodStartMutationPeriodEnd1","The reported value of `RevaluationReserve` at end of period SHOULD be equal to sum of reported value of `RevaluationReserve` at beginning of period and changes in that value during period, `RevaluationReserveMovement`, because `RevaluationReserveChangeAccountingPolicies` is not reported. ","non-blocking","IF(Stamdata!$E$620=\"\",IF(OR(Stamdata!$E$619 + Stamdata!$E$633 = Stamdata!$E$619,Stamdata!$E$619 + Stamdata!$E$633 = Stamdata!$E$635),0,1),0)+AssertionId(\"valueAssertion_NotesRevaluationReserveStatementOfChanges_PrtFST1NoExistenceThnPeriodStartMutationPeriodEnd1\")","Stamdata!$E$619,Stamdata!$E$635"]
["KvK: Jaarverantwoording 2020 NLGAAP - kleine rechtspersonen - publicatiestukken","valueAssertion_NotesRevaluationReserveStatementOfChanges_PrtFST1NoExistenceThnPeriodStartMutationPeriodEnd1","The reported value of `RevaluationReserve` at end of period SHOULD be equal to sum of reported value of `RevaluationReserve` at beginning of period and changes in that value during period, `RevaluationReserveMovement`, because `RevaluationReserveChangeAccountingPolicies` is not reported. ","non-blocking","IF(Stamdata!$F$620=\"\",IF(OR(Stamdata!$F$619 + Stamdata!$F$633 = Stamdata!$F$619,Stamdata!$F$619 + Stamdata!$F$633 = Stamdata!$F$635),0,1),0)+AssertionId(\"valueAssertion_NotesRevaluationReserveStatementOfChanges_PrtFST1NoExistenceThnPeriodStartMutationPeriodEnd1\")","Stamdata!$F$619,Stamdata!$F$635"]
["KvK: Jaarverantwoording 2020 NLGAAP - kleine rechtspersonen - publicatiestukken","valueAssertion_NotesRevaluationReserveStatementOfChanges_PrtFST1NoExistenceThnPeriodStartMutationPeriodEnd1","The reported value of `RevaluationReserve` at end of period SHOULD be equal to sum of reported value of `RevaluationReserve` at beginning of period and changes in that value during period, `RevaluationReserveMovement`, because `RevaluationReserveChangeAccountingPolicies` is not reported. ","non-blocking","IF(Stamdata!$G$620=\"\",IF(OR(Stamdata!$G$619 + Stamdata!$G$633 = Stamdata!$G$619,Stamdata!$G$619 + Stamdata!$G$633 = Stamdata!$G$635),0,1),0)+AssertionId(\"valueAssertion_NotesRevaluationReserveStatementOfChanges_PrtFST1NoExistenceThnPeriodStartMutationPeriodEnd1\")","Stamdata!$G$619,Stamdata!$G$635"]
["KvK: Jaarverantwoording 2020 NLGAAP - kleine rechtspersonen - publicatiestukken","valueAssertion_NotesRevaluationReserveStatementOfChanges_PrtFST1NoExistenceThnPeriodStartMutationPeriodEnd1","The reported value of `RevaluationReserve` at end of period SHOULD be equal to sum of reported value of `RevaluationReserve` at beginning of period and changes in that value during period, `RevaluationReserveMovement`, because `RevaluationReserveChangeAccountingPolicies` is not reported. ","non-blocking","IF(Stamdata!$H$620=\"\",IF(OR(Stamdata!$H$619 + Stamdata!$H$633 = Stamdata!$H$619,Stamdata!$H$619 + Stamdata!$H$633 = Stamdata!$H$635),0,1),0)+AssertionId(\"valueAssertion_NotesRevaluationReserveStatementOfChanges_PrtFST1NoExistenceThnPeriodStartMutationPeriodEnd1\")","Stamdata!$H$619,Stamdata!$H$635"]
["KvK: Jaarverantwoording 2020 NLGAAP - kleine rechtspersonen - publicatiestukken","valueAssertion_NotesRevaluationReserveStatementOfChanges_PrtFST1NoExistenceThnPeriodStartMutationPeriodEnd1","The reported value of `RevaluationReserve` at end of period SHOULD be equal to sum of reported value of `RevaluationReserve` at beginning of period and changes in that value during period, `RevaluationReserveMovement`, because `RevaluationReserveChangeAccountingPolicies` is not reported. ","non-blocking","IF(Stamdata!$I$620=\"\",IF(OR(Stamdata!$I$619 + Stamdata!$I$633 = Stamdata!$I$619,Stamdata!$I$619 + Stamdata!$I$633 = Stamdata!$I$635),0,1),0)+AssertionId(\"valueAssertion_NotesRevaluationReserveStatementOfChanges_PrtFST1NoExistenceThnPeriodStartMutationPeriodEnd1\")","Stamdata!$I$619,Stamdata!$I$635"]
["KvK: Jaarverantwoording 2020 NLGAAP - kleine rechtspersonen - publicatiestukken","valueAssertion_NotesRevaluationReserveStatementOfChanges_PrtFST1NoExistenceThnPeriodStartMutationPeriodEnd1","The reported value of `RevaluationReserve` at end of period SHOULD be equal to sum of reported value of `RevaluationReserve` at beginning of period and changes in that value during period, `RevaluationReserveMovement`, because `RevaluationReserveChangeAccountingPolicies` is not reported. ","non-blocking","IF(Stamdata!$D$642=\"\",IF(OR(Stamdata!$D$641 + Stamdata!$D$655 = Stamdata!$D$641,Stamdata!$D$641 + Stamdata!$D$655 = Stamdata!$D$657),0,1),0)+AssertionId(\"valueAssertion_NotesRevaluationReserveStatementOfChanges_PrtFST1NoExistenceThnPeriodStartMutationPeriodEnd1\")","Stamdata!$D$641,Stamdata!$D$657"]
["KvK: Jaarverantwoording 2020 NLGAAP - kleine rechtspersonen - publicatiestukken","valueAssertion_NotesRevaluationReserveStatementOfChanges_PrtFST1NoExistenceThnPeriodStartMutationPeriodEnd1","The reported value of `RevaluationReserve` at end of period SHOULD be equal to sum of reported value of `RevaluationReserve` at beginning of period and changes in that value during period, `RevaluationReserveMovement`, because `RevaluationReserveChangeAccountingPolicies` is not reported. ","non-blocking","IF(Stamdata!$E$642=\"\",IF(OR(Stamdata!$E$641 + Stamdata!$E$655 = Stamdata!$E$641,Stamdata!$E$641 + Stamdata!$E$655 = Stamdata!$E$657),0,1),0)+AssertionId(\"valueAssertion_NotesRevaluationReserveStatementOfChanges_PrtFST1NoExistenceThnPeriodStartMutationPeriodEnd1\")","Stamdata!$E$641,Stamdata!$E$657"]
["KvK: Jaarverantwoording 2020 NLGAAP - kleine rechtspersonen - publicatiestukken","valueAssertion_NotesRevaluationReserveStatementOfChanges_PrtFST1NoExistenceThnPeriodStartMutationPeriodEnd1","The reported value of `RevaluationReserve` at end of period SHOULD be equal to sum of reported value of `RevaluationReserve` at beginning of period and changes in that value during period, `RevaluationReserveMovement`, because `RevaluationReserveChangeAccountingPolicies` is not reported. ","non-blocking","IF(Stamdata!$F$642=\"\",IF(OR(Stamdata!$F$641 + Stamdata!$F$655 = Stamdata!$F$641,Stamdata!$F$641 + Stamdata!$F$655 = Stamdata!$F$657),0,1),0)+AssertionId(\"valueAssertion_NotesRevaluationReserveStatementOfChanges_PrtFST1NoExistenceThnPeriodStartMutationPeriodEnd1\")","Stamdata!$F$641,Stamdata!$F$657"]
["KvK: Jaarverantwoording 2020 NLGAAP - kleine rechtspersonen - publicatiestukken","valueAssertion_NotesRevaluationReserveStatementOfChanges_PrtFST1NoExistenceThnPeriodStartMutationPeriodEnd1","The reported value of `RevaluationReserve` at end of period SHOULD be equal to sum of reported value of `RevaluationReserve` at beginning of period and changes in that value during period, `RevaluationReserveMovement`, because `RevaluationReserveChangeAccountingPolicies` is not reported. ","non-blocking","IF(Stamdata!$G$642=\"\",IF(OR(Stamdata!$G$641 + Stamdata!$G$655 = Stamdata!$G$641,Stamdata!$G$641 + Stamdata!$G$655 = Stamdata!$G$657),0,1),0)+AssertionId(\"valueAssertion_NotesRevaluationReserveStatementOfChanges_PrtFST1NoExistenceThnPeriodStartMutationPeriodEnd1\")","Stamdata!$G$641,Stamdata!$G$657"]
["KvK: Jaarverantwoording 2020 NLGAAP - kleine rechtspersonen - publicatiestukken","valueAssertion_NotesRevaluationReserveStatementOfChanges_PrtFST1NoExistenceThnPeriodStartMutationPeriodEnd1","The reported value of `RevaluationReserve` at end of period SHOULD be equal to sum of reported value of `RevaluationReserve` at beginning of period and changes in that value during period, `RevaluationReserveMovement`, because `RevaluationReserveChangeAccountingPolicies` is not reported. ","non-blocking","IF(Stamdata!$H$642=\"\",IF(OR(Stamdata!$H$641 + Stamdata!$H$655 = Stamdata!$H$641,Stamdata!$H$641 + Stamdata!$H$655 = Stamdata!$H$657),0,1),0)+AssertionId(\"valueAssertion_NotesRevaluationReserveStatementOfChanges_PrtFST1NoExistenceThnPeriodStartMutationPeriodEnd1\")","Stamdata!$H$641,Stamdata!$H$657"]
["KvK: Jaarverantwoording 2020 NLGAAP - kleine rechtspersonen - publicatiestukken","valueAssertion_NotesRevaluationReserveStatementOfChanges_PrtFST1NoExistenceThnPeriodStartMutationPeriodEnd1","The reported value of `RevaluationReserve` at end of period SHOULD be equal to sum of reported value of `RevaluationReserve` at beginning of period and changes in that value during period, `RevaluationReserveMovement`, because `RevaluationReserveChangeAccountingPolicies` is not reported. ","non-blocking","IF(Stamdata!$I$642=\"\",IF(OR(Stamdata!$I$641 + Stamdata!$I$655 = Stamdata!$I$641,Stamdata!$I$641 + Stamdata!$I$655 = Stamdata!$I$657),0,1),0)+AssertionId(\"valueAssertion_NotesRevaluationReserveStatementOfChanges_PrtFST1NoExistenceThnPeriodStartMutationPeriodEnd1\")","Stamdata!$I$641,Stamdata!$I$657"]
["KvK: Jaarverantwoording 2020 NLGAAP - kleine rechtspersonen - publicatiestukken","valueAssertion_NotesRevaluationReserveStatementOfChanges_PrtFST1SumOfChildrenParentCredit1E1","`RevaluationReserveMovement` SHOULD be equal to the summation of the underlying values. ","non-blocking","IF(OR(not(AND(Stamdata!$D$627=\"\",Stamdata!$D$628=\"\",Stamdata!$D$629=\"\",Stamdata!$D$630=\"\")),not(AND(Stamdata!$D$624=\"\",Stamdata!$D$625=\"\",Stamdata!$D$626=\"\",Stamdata!$D$631=\"\"))),IF( Stamdata!$D$633 = sum(Stamdata!$D$627,Stamdata!$D$628,Stamdata!$D$629,Stamdata!$D$630)- sum(Stamdata!$D$624,Stamdata!$D$625,Stamdata!$D$626,Stamdata!$D$631),0,1),0)+AssertionId(\"valueAssertion_NotesRevaluationReserveStatementOfChanges_PrtFST1SumOfChildrenParentCredit1E1\")","Stamdata!$D$633"]
["KvK: Jaarverantwoording 2020 NLGAAP - kleine rechtspersonen - publicatiestukken","valueAssertion_NotesRevaluationReserveStatementOfChanges_PrtFST1SumOfChildrenParentCredit1E1","`RevaluationReserveMovement` SHOULD be equal to the summation of the underlying values. ","non-blocking","IF(OR(not(AND(Stamdata!$E$627=\"\",Stamdata!$E$628=\"\",Stamdata!$E$629=\"\",Stamdata!$E$630=\"\")),not(AND(Stamdata!$E$624=\"\",Stamdata!$E$625=\"\",Stamdata!$E$626=\"\",Stamdata!$E$631=\"\"))),IF( Stamdata!$E$633 = sum(Stamdata!$E$627,Stamdata!$E$628,Stamdata!$E$629,Stamdata!$E$630)- sum(Stamdata!$E$624,Stamdata!$E$625,Stamdata!$E$626,Stamdata!$E$631),0,1),0)+AssertionId(\"valueAssertion_NotesRevaluationReserveStatementOfChanges_PrtFST1SumOfChildrenParentCredit1E1\")","Stamdata!$E$633"]
["KvK: Jaarverantwoording 2020 NLGAAP - kleine rechtspersonen - publicatiestukken","valueAssertion_NotesRevaluationReserveStatementOfChanges_PrtFST1SumOfChildrenParentCredit1E1","`RevaluationReserveMovement` SHOULD be equal to the summation of the underlying values. ","non-blocking","IF(OR(not(AND(Stamdata!$F$627=\"\",Stamdata!$F$628=\"\",Stamdata!$F$629=\"\",Stamdata!$F$630=\"\")),not(AND(Stamdata!$F$624=\"\",Stamdata!$F$625=\"\",Stamdata!$F$626=\"\",Stamdata!$F$631=\"\"))),IF( Stamdata!$F$633 = sum(Stamdata!$F$627,Stamdata!$F$628,Stamdata!$F$629,Stamdata!$F$630)- sum(Stamdata!$F$624,Stamdata!$F$625,Stamdata!$F$626,Stamdata!$F$631),0,1),0)+AssertionId(\"valueAssertion_NotesRevaluationReserveStatementOfChanges_PrtFST1SumOfChildrenParentCredit1E1\")","Stamdata!$F$633"]
["KvK: Jaarverantwoording 2020 NLGAAP - kleine rechtspersonen - publicatiestukken","valueAssertion_NotesRevaluationReserveStatementOfChanges_PrtFST1SumOfChildrenParentCredit1E1","`RevaluationReserveMovement` SHOULD be equal to the summation of the underlying values. ","non-blocking","IF(OR(not(AND(Stamdata!$G$627=\"\",Stamdata!$G$628=\"\",Stamdata!$G$629=\"\",Stamdata!$G$630=\"\")),not(AND(Stamdata!$G$624=\"\",Stamdata!$G$625=\"\",Stamdata!$G$626=\"\",Stamdata!$G$631=\"\"))),IF( Stamdata!$G$633 = sum(Stamdata!$G$627,Stamdata!$G$628,Stamdata!$G$629,Stamdata!$G$630)- sum(Stamdata!$G$624,Stamdata!$G$625,Stamdata!$G$626,Stamdata!$G$631),0,1),0)+AssertionId(\"valueAssertion_NotesRevaluationReserveStatementOfChanges_PrtFST1SumOfChildrenParentCredit1E1\")","Stamdata!$G$633"]
["KvK: Jaarverantwoording 2020 NLGAAP - kleine rechtspersonen - publicatiestukken","valueAssertion_NotesRevaluationReserveStatementOfChanges_PrtFST1SumOfChildrenParentCredit1E1","`RevaluationReserveMovement` SHOULD be equal to the summation of the underlying values. ","non-blocking","IF(OR(not(AND(Stamdata!$H$627=\"\",Stamdata!$H$628=\"\",Stamdata!$H$629=\"\",Stamdata!$H$630=\"\")),not(AND(Stamdata!$H$624=\"\",Stamdata!$H$625=\"\",Stamdata!$H$626=\"\",Stamdata!$H$631=\"\"))),IF( Stamdata!$H$633 = sum(Stamdata!$H$627,Stamdata!$H$628,Stamdata!$H$629,Stamdata!$H$630)- sum(Stamdata!$H$624,Stamdata!$H$625,Stamdata!$H$626,Stamdata!$H$631),0,1),0)+AssertionId(\"valueAssertion_NotesRevaluationReserveStatementOfChanges_PrtFST1SumOfChildrenParentCredit1E1\")","Stamdata!$H$633"]
["KvK: Jaarverantwoording 2020 NLGAAP - kleine rechtspersonen - publicatiestukken","valueAssertion_NotesRevaluationReserveStatementOfChanges_PrtFST1SumOfChildrenParentCredit1E1","`RevaluationReserveMovement` SHOULD be equal to the summation of the underlying values. ","non-blocking","IF(OR(not(AND(Stamdata!$I$627=\"\",Stamdata!$I$628=\"\",Stamdata!$I$629=\"\",Stamdata!$I$630=\"\")),not(AND(Stamdata!$I$624=\"\",Stamdata!$I$625=\"\",Stamdata!$I$626=\"\",Stamdata!$I$631=\"\"))),IF( Stamdata!$I$633 = sum(Stamdata!$I$627,Stamdata!$I$628,Stamdata!$I$629,Stamdata!$I$630)- sum(Stamdata!$I$624,Stamdata!$I$625,Stamdata!$I$626,Stamdata!$I$631),0,1),0)+AssertionId(\"valueAssertion_NotesRevaluationReserveStatementOfChanges_PrtFST1SumOfChildrenParentCredit1E1\")","Stamdata!$I$633"]
["KvK: Jaarverantwoording 2020 NLGAAP - kleine rechtspersonen - publicatiestukken","valueAssertion_NotesRevaluationReserveStatementOfChanges_PrtFST1SumOfChildrenParentCredit1E1","`RevaluationReserveMovement` SHOULD be equal to the summation of the underlying values. ","non-blocking","IF(OR(not(AND(Stamdata!$D$649=\"\",Stamdata!$D$650=\"\",Stamdata!$D$651=\"\",Stamdata!$D$652=\"\")),not(AND(Stamdata!$D$646=\"\",Stamdata!$D$647=\"\",Stamdata!$D$648=\"\",Stamdata!$D$653=\"\"))),IF( Stamdata!$D$655 = sum(Stamdata!$D$649,Stamdata!$D$650,Stamdata!$D$651,Stamdata!$D$652)- sum(Stamdata!$D$646,Stamdata!$D$647,Stamdata!$D$648,Stamdata!$D$653),0,1),0)+AssertionId(\"valueAssertion_NotesRevaluationReserveStatementOfChanges_PrtFST1SumOfChildrenParentCredit1E1\")","Stamdata!$D$655"]
["KvK: Jaarverantwoording 2020 NLGAAP - kleine rechtspersonen - publicatiestukken","valueAssertion_NotesRevaluationReserveStatementOfChanges_PrtFST1SumOfChildrenParentCredit1E1","`RevaluationReserveMovement` SHOULD be equal to the summation of the underlying values. ","non-blocking","IF(OR(not(AND(Stamdata!$E$649=\"\",Stamdata!$E$650=\"\",Stamdata!$E$651=\"\",Stamdata!$E$652=\"\")),not(AND(Stamdata!$E$646=\"\",Stamdata!$E$647=\"\",Stamdata!$E$648=\"\",Stamdata!$E$653=\"\"))),IF( Stamdata!$E$655 = sum(Stamdata!$E$649,Stamdata!$E$650,Stamdata!$E$651,Stamdata!$E$652)- sum(Stamdata!$E$646,Stamdata!$E$647,Stamdata!$E$648,Stamdata!$E$653),0,1),0)+AssertionId(\"valueAssertion_NotesRevaluationReserveStatementOfChanges_PrtFST1SumOfChildrenParentCredit1E1\")","Stamdata!$E$655"]
["KvK: Jaarverantwoording 2020 NLGAAP - kleine rechtspersonen - publicatiestukken","valueAssertion_NotesRevaluationReserveStatementOfChanges_PrtFST1SumOfChildrenParentCredit1E1","`RevaluationReserveMovement` SHOULD be equal to the summation of the underlying values. ","non-blocking","IF(OR(not(AND(Stamdata!$F$649=\"\",Stamdata!$F$650=\"\",Stamdata!$F$651=\"\",Stamdata!$F$652=\"\")),not(AND(Stamdata!$F$646=\"\",Stamdata!$F$647=\"\",Stamdata!$F$648=\"\",Stamdata!$F$653=\"\"))),IF( Stamdata!$F$655 = sum(Stamdata!$F$649,Stamdata!$F$650,Stamdata!$F$651,Stamdata!$F$652)- sum(Stamdata!$F$646,Stamdata!$F$647,Stamdata!$F$648,Stamdata!$F$653),0,1),0)+AssertionId(\"valueAssertion_NotesRevaluationReserveStatementOfChanges_PrtFST1SumOfChildrenParentCredit1E1\")","Stamdata!$F$655"]
["KvK: Jaarverantwoording 2020 NLGAAP - kleine rechtspersonen - publicatiestukken","valueAssertion_NotesRevaluationReserveStatementOfChanges_PrtFST1SumOfChildrenParentCredit1E1","`RevaluationReserveMovement` SHOULD be equal to the summation of the underlying values. ","non-blocking","IF(OR(not(AND(Stamdata!$G$649=\"\",Stamdata!$G$650=\"\",Stamdata!$G$651=\"\",Stamdata!$G$652=\"\")),not(AND(Stamdata!$G$646=\"\",Stamdata!$G$647=\"\",Stamdata!$G$648=\"\",Stamdata!$G$653=\"\"))),IF( Stamdata!$G$655 = sum(Stamdata!$G$649,Stamdata!$G$650,Stamdata!$G$651,Stamdata!$G$652)- sum(Stamdata!$G$646,Stamdata!$G$647,Stamdata!$G$648,Stamdata!$G$653),0,1),0)+AssertionId(\"valueAssertion_NotesRevaluationReserveStatementOfChanges_PrtFST1SumOfChildrenParentCredit1E1\")","Stamdata!$G$655"]
["KvK: Jaarverantwoording 2020 NLGAAP - kleine rechtspersonen - publicatiestukken","valueAssertion_NotesRevaluationReserveStatementOfChanges_PrtFST1SumOfChildrenParentCredit1E1","`RevaluationReserveMovement` SHOULD be equal to the summation of the underlying values. ","non-blocking","IF(OR(not(AND(Stamdata!$H$649=\"\",Stamdata!$H$650=\"\",Stamdata!$H$651=\"\",Stamdata!$H$652=\"\")),not(AND(Stamdata!$H$646=\"\",Stamdata!$H$647=\"\",Stamdata!$H$648=\"\",Stamdata!$H$653=\"\"))),IF( Stamdata!$H$655 = sum(Stamdata!$H$649,Stamdata!$H$650,Stamdata!$H$651,Stamdata!$H$652)- sum(Stamdata!$H$646,Stamdata!$H$647,Stamdata!$H$648,Stamdata!$H$653),0,1),0)+AssertionId(\"valueAssertion_NotesRevaluationReserveStatementOfChanges_PrtFST1SumOfChildrenParentCredit1E1\")","Stamdata!$H$655"]
["KvK: Jaarverantwoording 2020 NLGAAP - kleine rechtspersonen - publicatiestukken","valueAssertion_NotesRevaluationReserveStatementOfChanges_PrtFST1SumOfChildrenParentCredit1E1","`RevaluationReserveMovement` SHOULD be equal to the summation of the underlying values. ","non-blocking","IF(OR(not(AND(Stamdata!$I$649=\"\",Stamdata!$I$650=\"\",Stamdata!$I$651=\"\",Stamdata!$I$652=\"\")),not(AND(Stamdata!$I$646=\"\",Stamdata!$I$647=\"\",Stamdata!$I$648=\"\",Stamdata!$I$653=\"\"))),IF( Stamdata!$I$655 = sum(Stamdata!$I$649,Stamdata!$I$650,Stamdata!$I$651,Stamdata!$I$652)- sum(Stamdata!$I$646,Stamdata!$I$647,Stamdata!$I$648,Stamdata!$I$653),0,1),0)+AssertionId(\"valueAssertion_NotesRevaluationReserveStatementOfChanges_PrtFST1SumOfChildrenParentCredit1E1\")","Stamdata!$I$655"]
["KvK: Jaarverantwoording 2020 NLGAAP - kleine rechtspersonen - publicatiestukken","valueAssertion_NotesShareCapitalStatementOfChangesNumberofSharesSpecification_PrtFST1PeriodStartMutationPeriodEnd1","Reported value of `ShareCapitalNumberShares` at end of period SHOULD be equal to sum of reported value of `ShareCapitalNumberShares` at beginning of period and changes in that value during period, `ShareCapitalNumberSharesMovement`. ","non-blocking","IF(OR(Stamdata!$D$550 + Stamdata!$D$560 = Stamdata!$D$550,Stamdata!$D$550 + Stamdata!$D$560 = Stamdata!$D$562),0,1)+AssertionId(\"valueAssertion_NotesShareCapitalStatementOfChangesNumberofSharesSpecification_PrtFST1PeriodStartMutationPeriodEnd1\")","Stamdata!$D$550,Stamdata!$D$562"]
["KvK: Jaarverantwoording 2020 NLGAAP - kleine rechtspersonen - publicatiestukken","valueAssertion_NotesShareCapitalStatementOfChangesNumberofSharesSpecification_PrtFST1PeriodStartMutationPeriodEnd1","Reported value of `ShareCapitalNumberShares` at end of period SHOULD be equal to sum of reported value of `ShareCapitalNumberShares` at beginning of period and changes in that value during period, `ShareCapitalNumberSharesMovement`. ","non-blocking","IF(OR(Stamdata!$E$550 + Stamdata!$E$560 = Stamdata!$E$550,Stamdata!$E$550 + Stamdata!$E$560 = Stamdata!$E$562),0,1)+AssertionId(\"valueAssertion_NotesShareCapitalStatementOfChangesNumberofSharesSpecification_PrtFST1PeriodStartMutationPeriodEnd1\")","Stamdata!$E$550,Stamdata!$E$562"]
["KvK: Jaarverantwoording 2020 NLGAAP - kleine rechtspersonen - publicatiestukken","valueAssertion_NotesShareCapitalStatementOfChangesNumberofSharesSpecification_PrtFST1PeriodStartMutationPeriodEnd1","Reported value of `ShareCapitalNumberShares` at end of period SHOULD be equal to sum of reported value of `ShareCapitalNumberShares` at beginning of period and changes in that value during period, `ShareCapitalNumberSharesMovement`. ","non-blocking","IF(OR(Stamdata!$F$550 + Stamdata!$F$560 = Stamdata!$F$550,Stamdata!$F$550 + Stamdata!$F$560 = Stamdata!$F$562),0,1)+AssertionId(\"valueAssertion_NotesShareCapitalStatementOfChangesNumberofSharesSpecification_PrtFST1PeriodStartMutationPeriodEnd1\")","Stamdata!$F$550,Stamdata!$F$562"]
["KvK: Jaarverantwoording 2020 NLGAAP - kleine rechtspersonen - publicatiestukken","valueAssertion_NotesShareCapitalStatementOfChangesNumberofSharesSpecification_PrtFST1PeriodStartMutationPeriodEnd1","Reported value of `ShareCapitalNumberShares` at end of period SHOULD be equal to sum of reported value of `ShareCapitalNumberShares` at beginning of period and changes in that value during period, `ShareCapitalNumberSharesMovement`. ","non-blocking","IF(OR(Stamdata!$G$550 + Stamdata!$G$560 = Stamdata!$G$550,Stamdata!$G$550 + Stamdata!$G$560 = Stamdata!$G$562),0,1)+AssertionId(\"valueAssertion_NotesShareCapitalStatementOfChangesNumberofSharesSpecification_PrtFST1PeriodStartMutationPeriodEnd1\")","Stamdata!$G$550,Stamdata!$G$562"]
["KvK: Jaarverantwoording 2020 NLGAAP - kleine rechtspersonen - publicatiestukken","valueAssertion_NotesShareCapitalStatementOfChangesNumberofSharesSpecification_PrtFST1PeriodStartMutationPeriodEnd1","Reported value of `ShareCapitalNumberShares` at end of period SHOULD be equal to sum of reported value of `ShareCapitalNumberShares` at beginning of period and changes in that value during period, `ShareCapitalNumberSharesMovement`. ","non-blocking","IF(OR(Stamdata!$H$550 + Stamdata!$H$560 = Stamdata!$H$550,Stamdata!$H$550 + Stamdata!$H$560 = Stamdata!$H$562),0,1)+AssertionId(\"valueAssertion_NotesShareCapitalStatementOfChangesNumberofSharesSpecification_PrtFST1PeriodStartMutationPeriodEnd1\")","Stamdata!$H$550,Stamdata!$H$562"]
["KvK: Jaarverantwoording 2020 NLGAAP - kleine rechtspersonen - publicatiestukken","valueAssertion_NotesShareCapitalStatementOfChangesNumberofSharesSpecification_PrtFST1PeriodStartMutationPeriodEnd1","Reported value of `ShareCapitalNumberShares` at end of period SHOULD be equal to sum of reported value of `ShareCapitalNumberShares` at beginning of period and changes in that value during period, `ShareCapitalNumberSharesMovement`. ","non-blocking","IF(OR(Stamdata!$D$571 + Stamdata!$D$581 = Stamdata!$D$571,Stamdata!$D$571 + Stamdata!$D$581 = Stamdata!$D$583),0,1)+AssertionId(\"valueAssertion_NotesShareCapitalStatementOfChangesNumberofSharesSpecification_PrtFST1PeriodStartMutationPeriodEnd1\")","Stamdata!$D$571,Stamdata!$D$583"]
["KvK: Jaarverantwoording 2020 NLGAAP - kleine rechtspersonen - publicatiestukken","valueAssertion_NotesShareCapitalStatementOfChangesNumberofSharesSpecification_PrtFST1PeriodStartMutationPeriodEnd1","Reported value of `ShareCapitalNumberShares` at end of period SHOULD be equal to sum of reported value of `ShareCapitalNumberShares` at beginning of period and changes in that value during period, `ShareCapitalNumberSharesMovement`. ","non-blocking","IF(OR(Stamdata!$E$571 + Stamdata!$E$581 = Stamdata!$E$571,Stamdata!$E$571 + Stamdata!$E$581 = Stamdata!$E$583),0,1)+AssertionId(\"valueAssertion_NotesShareCapitalStatementOfChangesNumberofSharesSpecification_PrtFST1PeriodStartMutationPeriodEnd1\")","Stamdata!$E$571,Stamdata!$E$583"]
["KvK: Jaarverantwoording 2020 NLGAAP - kleine rechtspersonen - publicatiestukken","valueAssertion_NotesShareCapitalStatementOfChangesNumberofSharesSpecification_PrtFST1PeriodStartMutationPeriodEnd1","Reported value of `ShareCapitalNumberShares` at end of period SHOULD be equal to sum of reported value of `ShareCapitalNumberShares` at beginning of period and changes in that value during period, `ShareCapitalNumberSharesMovement`. ","non-blocking","IF(OR(Stamdata!$F$571 + Stamdata!$F$581 = Stamdata!$F$571,Stamdata!$F$571 + Stamdata!$F$581 = Stamdata!$F$583),0,1)+AssertionId(\"valueAssertion_NotesShareCapitalStatementOfChangesNumberofSharesSpecification_PrtFST1PeriodStartMutationPeriodEnd1\")","Stamdata!$F$571,Stamdata!$F$583"]
["KvK: Jaarverantwoording 2020 NLGAAP - kleine rechtspersonen - publicatiestukken","valueAssertion_NotesShareCapitalStatementOfChangesNumberofSharesSpecification_PrtFST1PeriodStartMutationPeriodEnd1","Reported value of `ShareCapitalNumberShares` at end of period SHOULD be equal to sum of reported value of `ShareCapitalNumberShares` at beginning of period and changes in that value during period, `ShareCapitalNumberSharesMovement`. ","non-blocking","IF(OR(Stamdata!$G$571 + Stamdata!$G$581 = Stamdata!$G$571,Stamdata!$G$571 + Stamdata!$G$581 = Stamdata!$G$583),0,1)+AssertionId(\"valueAssertion_NotesShareCapitalStatementOfChangesNumberofSharesSpecification_PrtFST1PeriodStartMutationPeriodEnd1\")","Stamdata!$G$571,Stamdata!$G$583"]
["KvK: Jaarverantwoording 2020 NLGAAP - kleine rechtspersonen - publicatiestukken","valueAssertion_NotesShareCapitalStatementOfChangesNumberofSharesSpecification_PrtFST1PeriodStartMutationPeriodEnd1","Reported value of `ShareCapitalNumberShares` at end of period SHOULD be equal to sum of reported value of `ShareCapitalNumberShares` at beginning of period and changes in that value during period, `ShareCapitalNumberSharesMovement`. ","non-blocking","IF(OR(Stamdata!$H$571 + Stamdata!$H$581 = Stamdata!$H$571,Stamdata!$H$571 + Stamdata!$H$581 = Stamdata!$H$583),0,1)+AssertionId(\"valueAssertion_NotesShareCapitalStatementOfChangesNumberofSharesSpecification_PrtFST1PeriodStartMutationPeriodEnd1\")","Stamdata!$H$571,Stamdata!$H$583"]
["KvK: Jaarverantwoording 2020 NLGAAP - kleine rechtspersonen - publicatiestukken","valueAssertion_NotesShareCapitalStatementOfChangesNumberofSharesSpecification_PrtFST107Variables1","`ShareCapitalNumberSharesMovement` SHOULD be equal to + `ShareCapitalNumberSharesIssue` + `ShareCapitalNumberSharesPurchase` + `ShareCapitalNumberSharesGranting` + `ShareCapitalNumberSharesSale` + `ShareCapitalNumberSharesWithdrawal` + `ShareCapitalNumberSharesDistributionAsDividend` + `ShareCapitalNumberSharesOtherMovements`. ","non-blocking","IF(OR(not(Stamdata!$D$552=\"\"),not(Stamdata!$D$553=\"\"),not(Stamdata!$D$554=\"\"),not(Stamdata!$D$555=\"\"),not(Stamdata!$D$556=\"\"),not(Stamdata!$D$557=\"\"),not(Stamdata!$D$558=\"\")),IF(+ sum(Stamdata!$D$552) + sum(Stamdata!$D$553) + sum(Stamdata!$D$554) + sum(Stamdata!$D$555) + sum(Stamdata!$D$556) + sum(Stamdata!$D$557) + sum(Stamdata!$D$558) = Stamdata!$D$560 ,0,1),0)+AssertionId(\"valueAssertion_NotesShareCapitalStatementOfChangesNumberofSharesSpecification_PrtFST107Variables1\")","Stamdata!$D$557"]
["KvK: Jaarverantwoording 2020 NLGAAP - kleine rechtspersonen - publicatiestukken","valueAssertion_NotesShareCapitalStatementOfChangesNumberofSharesSpecification_PrtFST107Variables1","`ShareCapitalNumberSharesMovement` SHOULD be equal to + `ShareCapitalNumberSharesIssue` + `ShareCapitalNumberSharesPurchase` + `ShareCapitalNumberSharesGranting` + `ShareCapitalNumberSharesSale` + `ShareCapitalNumberSharesWithdrawal` + `ShareCapitalNumberSharesDistributionAsDividend` + `ShareCapitalNumberSharesOtherMovements`. ","non-blocking","IF(OR(not(Stamdata!$E$552=\"\"),not(Stamdata!$E$553=\"\"),not(Stamdata!$E$554=\"\"),not(Stamdata!$E$555=\"\"),not(Stamdata!$E$556=\"\"),not(Stamdata!$E$557=\"\"),not(Stamdata!$E$558=\"\")),IF(+ sum(Stamdata!$E$552) + sum(Stamdata!$E$553) + sum(Stamdata!$E$554) + sum(Stamdata!$E$555) + sum(Stamdata!$E$556) + sum(Stamdata!$E$557) + sum(Stamdata!$E$558) = Stamdata!$E$560 ,0,1),0)+AssertionId(\"valueAssertion_NotesShareCapitalStatementOfChangesNumberofSharesSpecification_PrtFST107Variables1\")","Stamdata!$E$557"]
["KvK: Jaarverantwoording 2020 NLGAAP - kleine rechtspersonen - publicatiestukken","valueAssertion_NotesShareCapitalStatementOfChangesNumberofSharesSpecification_PrtFST107Variables1","`ShareCapitalNumberSharesMovement` SHOULD be equal to + `ShareCapitalNumberSharesIssue` + `ShareCapitalNumberSharesPurchase` + `ShareCapitalNumberSharesGranting` + `ShareCapitalNumberSharesSale` + `ShareCapitalNumberSharesWithdrawal` + `ShareCapitalNumberSharesDistributionAsDividend` + `ShareCapitalNumberSharesOtherMovements`. ","non-blocking","IF(OR(not(Stamdata!$F$552=\"\"),not(Stamdata!$F$553=\"\"),not(Stamdata!$F$554=\"\"),not(Stamdata!$F$555=\"\"),not(Stamdata!$F$556=\"\"),not(Stamdata!$F$557=\"\"),not(Stamdata!$F$558=\"\")),IF(+ sum(Stamdata!$F$552) + sum(Stamdata!$F$553) + sum(Stamdata!$F$554) + sum(Stamdata!$F$555) + sum(Stamdata!$F$556) + sum(Stamdata!$F$557) + sum(Stamdata!$F$558) = Stamdata!$F$560 ,0,1),0)+AssertionId(\"valueAssertion_NotesShareCapitalStatementOfChangesNumberofSharesSpecification_PrtFST107Variables1\")","Stamdata!$F$557"]
["KvK: Jaarverantwoording 2020 NLGAAP - kleine rechtspersonen - publicatiestukken","valueAssertion_NotesShareCapitalStatementOfChangesNumberofSharesSpecification_PrtFST107Variables1","`ShareCapitalNumberSharesMovement` SHOULD be equal to + `ShareCapitalNumberSharesIssue` + `ShareCapitalNumberSharesPurchase` + `ShareCapitalNumberSharesGranting` + `ShareCapitalNumberSharesSale` + `ShareCapitalNumberSharesWithdrawal` + `ShareCapitalNumberSharesDistributionAsDividend` + `ShareCapitalNumberSharesOtherMovements`. ","non-blocking","IF(OR(not(Stamdata!$G$552=\"\"),not(Stamdata!$G$553=\"\"),not(Stamdata!$G$554=\"\"),not(Stamdata!$G$555=\"\"),not(Stamdata!$G$556=\"\"),not(Stamdata!$G$557=\"\"),not(Stamdata!$G$558=\"\")),IF(+ sum(Stamdata!$G$552) + sum(Stamdata!$G$553) + sum(Stamdata!$G$554) + sum(Stamdata!$G$555) + sum(Stamdata!$G$556) + sum(Stamdata!$G$557) + sum(Stamdata!$G$558) = Stamdata!$G$560 ,0,1),0)+AssertionId(\"valueAssertion_NotesShareCapitalStatementOfChangesNumberofSharesSpecification_PrtFST107Variables1\")","Stamdata!$G$557"]
["KvK: Jaarverantwoording 2020 NLGAAP - kleine rechtspersonen - publicatiestukken","valueAssertion_NotesShareCapitalStatementOfChangesNumberofSharesSpecification_PrtFST107Variables1","`ShareCapitalNumberSharesMovement` SHOULD be equal to + `ShareCapitalNumberSharesIssue` + `ShareCapitalNumberSharesPurchase` + `ShareCapitalNumberSharesGranting` + `ShareCapitalNumberSharesSale` + `ShareCapitalNumberSharesWithdrawal` + `ShareCapitalNumberSharesDistributionAsDividend` + `ShareCapitalNumberSharesOtherMovements`. ","non-blocking","IF(OR(not(Stamdata!$H$552=\"\"),not(Stamdata!$H$553=\"\"),not(Stamdata!$H$554=\"\"),not(Stamdata!$H$555=\"\"),not(Stamdata!$H$556=\"\"),not(Stamdata!$H$557=\"\"),not(Stamdata!$H$558=\"\")),IF(+ sum(Stamdata!$H$552) + sum(Stamdata!$H$553) + sum(Stamdata!$H$554) + sum(Stamdata!$H$555) + sum(Stamdata!$H$556) + sum(Stamdata!$H$557) + sum(Stamdata!$H$558) = Stamdata!$H$560 ,0,1),0)+AssertionId(\"valueAssertion_NotesShareCapitalStatementOfChangesNumberofSharesSpecification_PrtFST107Variables1\")","Stamdata!$H$557"]
["KvK: Jaarverantwoording 2020 NLGAAP - kleine rechtspersonen - publicatiestukken","valueAssertion_NotesShareCapitalStatementOfChangesNumberofSharesSpecification_PrtFST107Variables1","`ShareCapitalNumberSharesMovement` SHOULD be equal to + `ShareCapitalNumberSharesIssue` + `ShareCapitalNumberSharesPurchase` + `ShareCapitalNumberSharesGranting` + `ShareCapitalNumberSharesSale` + `ShareCapitalNumberSharesWithdrawal` + `ShareCapitalNumberSharesDistributionAsDividend` + `ShareCapitalNumberSharesOtherMovements`. ","non-blocking","IF(OR(not(Stamdata!$D$573=\"\"),not(Stamdata!$D$574=\"\"),not(Stamdata!$D$575=\"\"),not(Stamdata!$D$576=\"\"),not(Stamdata!$D$577=\"\"),not(Stamdata!$D$578=\"\"),not(Stamdata!$D$579=\"\")),IF(+ sum(Stamdata!$D$573) + sum(Stamdata!$D$574) + sum(Stamdata!$D$575) + sum(Stamdata!$D$576) + sum(Stamdata!$D$577) + sum(Stamdata!$D$578) + sum(Stamdata!$D$579) = Stamdata!$D$581 ,0,1),0)+AssertionId(\"valueAssertion_NotesShareCapitalStatementOfChangesNumberofSharesSpecification_PrtFST107Variables1\")","Stamdata!$D$578"]
["KvK: Jaarverantwoording 2020 NLGAAP - kleine rechtspersonen - publicatiestukken","valueAssertion_NotesShareCapitalStatementOfChangesNumberofSharesSpecification_PrtFST107Variables1","`ShareCapitalNumberSharesMovement` SHOULD be equal to + `ShareCapitalNumberSharesIssue` + `ShareCapitalNumberSharesPurchase` + `ShareCapitalNumberSharesGranting` + `ShareCapitalNumberSharesSale` + `ShareCapitalNumberSharesWithdrawal` + `ShareCapitalNumberSharesDistributionAsDividend` + `ShareCapitalNumberSharesOtherMovements`. ","non-blocking","IF(OR(not(Stamdata!$E$573=\"\"),not(Stamdata!$E$574=\"\"),not(Stamdata!$E$575=\"\"),not(Stamdata!$E$576=\"\"),not(Stamdata!$E$577=\"\"),not(Stamdata!$E$578=\"\"),not(Stamdata!$E$579=\"\")),IF(+ sum(Stamdata!$E$573) + sum(Stamdata!$E$574) + sum(Stamdata!$E$575) + sum(Stamdata!$E$576) + sum(Stamdata!$E$577) + sum(Stamdata!$E$578) + sum(Stamdata!$E$579) = Stamdata!$E$581 ,0,1),0)+AssertionId(\"valueAssertion_NotesShareCapitalStatementOfChangesNumberofSharesSpecification_PrtFST107Variables1\")","Stamdata!$E$578"]
["KvK: Jaarverantwoording 2020 NLGAAP - kleine rechtspersonen - publicatiestukken","valueAssertion_NotesShareCapitalStatementOfChangesNumberofSharesSpecification_PrtFST107Variables1","`ShareCapitalNumberSharesMovement` SHOULD be equal to + `ShareCapitalNumberSharesIssue` + `ShareCapitalNumberSharesPurchase` + `ShareCapitalNumberSharesGranting` + `ShareCapitalNumberSharesSale` + `ShareCapitalNumberSharesWithdrawal` + `ShareCapitalNumberSharesDistributionAsDividend` + `ShareCapitalNumberSharesOtherMovements`. ","non-blocking","IF(OR(not(Stamdata!$F$573=\"\"),not(Stamdata!$F$574=\"\"),not(Stamdata!$F$575=\"\"),not(Stamdata!$F$576=\"\"),not(Stamdata!$F$577=\"\"),not(Stamdata!$F$578=\"\"),not(Stamdata!$F$579=\"\")),IF(+ sum(Stamdata!$F$573) + sum(Stamdata!$F$574) + sum(Stamdata!$F$575) + sum(Stamdata!$F$576) + sum(Stamdata!$F$577) + sum(Stamdata!$F$578) + sum(Stamdata!$F$579) = Stamdata!$F$581 ,0,1),0)+AssertionId(\"valueAssertion_NotesShareCapitalStatementOfChangesNumberofSharesSpecification_PrtFST107Variables1\")","Stamdata!$F$578"]
["KvK: Jaarverantwoording 2020 NLGAAP - kleine rechtspersonen - publicatiestukken","valueAssertion_NotesShareCapitalStatementOfChangesNumberofSharesSpecification_PrtFST107Variables1","`ShareCapitalNumberSharesMovement` SHOULD be equal to + `ShareCapitalNumberSharesIssue` + `ShareCapitalNumberSharesPurchase` + `ShareCapitalNumberSharesGranting` + `ShareCapitalNumberSharesSale` + `ShareCapitalNumberSharesWithdrawal` + `ShareCapitalNumberSharesDistributionAsDividend` + `ShareCapitalNumberSharesOtherMovements`. ","non-blocking","IF(OR(not(Stamdata!$G$573=\"\"),not(Stamdata!$G$574=\"\"),not(Stamdata!$G$575=\"\"),not(Stamdata!$G$576=\"\"),not(Stamdata!$G$577=\"\"),not(Stamdata!$G$578=\"\"),not(Stamdata!$G$579=\"\")),IF(+ sum(Stamdata!$G$573) + sum(Stamdata!$G$574) + sum(Stamdata!$G$575) + sum(Stamdata!$G$576) + sum(Stamdata!$G$577) + sum(Stamdata!$G$578) + sum(Stamdata!$G$579) = Stamdata!$G$581 ,0,1),0)+AssertionId(\"valueAssertion_NotesShareCapitalStatementOfChangesNumberofSharesSpecification_PrtFST107Variables1\")","Stamdata!$G$578"]
["KvK: Jaarverantwoording 2020 NLGAAP - kleine rechtspersonen - publicatiestukken","valueAssertion_NotesShareCapitalStatementOfChangesNumberofSharesSpecification_PrtFST107Variables1","`ShareCapitalNumberSharesMovement` SHOULD be equal to + `ShareCapitalNumberSharesIssue` + `ShareCapitalNumberSharesPurchase` + `ShareCapitalNumberSharesGranting` + `ShareCapitalNumberSharesSale` + `ShareCapitalNumberSharesWithdrawal` + `ShareCapitalNumberSharesDistributionAsDividend` + `ShareCapitalNumberSharesOtherMovements`. ","non-blocking","IF(OR(not(Stamdata!$H$573=\"\"),not(Stamdata!$H$574=\"\"),not(Stamdata!$H$575=\"\"),not(Stamdata!$H$576=\"\"),not(Stamdata!$H$577=\"\"),not(Stamdata!$H$578=\"\"),not(Stamdata!$H$579=\"\")),IF(+ sum(Stamdata!$H$573) + sum(Stamdata!$H$574) + sum(Stamdata!$H$575) + sum(Stamdata!$H$576) + sum(Stamdata!$H$577) + sum(Stamdata!$H$578) + sum(Stamdata!$H$579) = Stamdata!$H$581 ,0,1),0)+AssertionId(\"valueAssertion_NotesShareCapitalStatementOfChangesNumberofSharesSpecification_PrtFST107Variables1\")","Stamdata!$H$578"]
["KvK: Jaarverantwoording 2020 NLGAAP - kleine rechtspersonen - publicatiestukken","valueAssertion_SigningFinancialStatements_PrtDateEarlierThanEQDateCurrent1","The date reported for `SignatureManagingSupervisoryDirectorsDate` SHOULD be earlier than, or equal to, the current date. ","non-blocking","IF(Stamdata!$D$1177 <= NOW,0,1)+AssertionId(\"valueAssertion_SigningFinancialStatements_PrtDateEarlierThanEQDateCurrent1\")","Stamdata!$D$1177"]
["KvK: Jaarverantwoording 2020 NLGAAP - kleine rechtspersonen - publicatiestukken","valueAssertion_SigningFinancialStatements_PrtDateEarlierThanEQDateCurrent1","The date reported for `SignatureManagingSupervisoryDirectorsDate` SHOULD be earlier than, or equal to, the current date. ","non-blocking","IF(Stamdata!$E$1177 <= NOW,0,1)+AssertionId(\"valueAssertion_SigningFinancialStatements_PrtDateEarlierThanEQDateCurrent1\")","Stamdata!$E$1177"]
["KvK: Jaarverantwoording 2020 NLGAAP - kleine rechtspersonen - publicatiestukken","valueAssertion_SigningFinancialStatements_PrtDateEarlierThanEQDateCurrent1","The date reported for `SignatureManagingSupervisoryDirectorsDate` SHOULD be earlier than, or equal to, the current date. ","non-blocking","IF(Stamdata!$F$1177 <= NOW,0,1)+AssertionId(\"valueAssertion_SigningFinancialStatements_PrtDateEarlierThanEQDateCurrent1\")","Stamdata!$F$1177"]
["KvK: Jaarverantwoording 2020 NLGAAP - kleine rechtspersonen - publicatiestukken","valueAssertion_SigningFinancialStatements_PrtDateEarlierThanEQDateCurrent1","The date reported for `SignatureManagingSupervisoryDirectorsDate` SHOULD be earlier than, or equal to, the current date. ","non-blocking","IF(Stamdata!$G$1177 <= NOW,0,1)+AssertionId(\"valueAssertion_SigningFinancialStatements_PrtDateEarlierThanEQDateCurrent1\")","Stamdata!$G$1177"]
["KvK: Jaarverantwoording 2020 NLGAAP - kleine rechtspersonen - publicatiestukken","valueAssertion_SigningFinancialStatements_PrtDateEarlierThanEQDateCurrent1","The date reported for `SignatureManagingSupervisoryDirectorsDate` SHOULD be earlier than, or equal to, the current date. ","non-blocking","IF(Stamdata!$H$1177 <= NOW,0,1)+AssertionId(\"valueAssertion_SigningFinancialStatements_PrtDateEarlierThanEQDateCurrent1\")","Stamdata!$H$1177"]
["KvK: Jaarverantwoording 2020 NLGAAP - kleine rechtspersonen - publicatiestukken","valueAssertion_SigningFinancialStatements_PrtValueThnExistence1","`SignatureManagingSupervisoryDirectorsDate` SHOULD exist at least once, because the reported value of `DirectorSignedStatus` is equal to `Ja`. ","non-blocking","IF(Stamdata!$D$1178 = \"Ja\",IF(not(Stamdata!$D$1177=\"\"),0,1),0)+AssertionId(\"valueAssertion_SigningFinancialStatements_PrtValueThnExistence1\")","Stamdata!$D$1177"]
["KvK: Jaarverantwoording 2020 NLGAAP - kleine rechtspersonen - publicatiestukken","valueAssertion_SigningFinancialStatements_PrtValueThnExistence1","`SignatureManagingSupervisoryDirectorsDate` SHOULD exist at least once, because the reported value of `DirectorSignedStatus` is equal to `Ja`. ","non-blocking","IF(Stamdata!$E$1178 = \"Ja\",IF(not(Stamdata!$E$1177=\"\"),0,1),0)+AssertionId(\"valueAssertion_SigningFinancialStatements_PrtValueThnExistence1\")","Stamdata!$E$1177"]
["KvK: Jaarverantwoording 2020 NLGAAP - kleine rechtspersonen - publicatiestukken","valueAssertion_SigningFinancialStatements_PrtValueThnExistence1","`SignatureManagingSupervisoryDirectorsDate` SHOULD exist at least once, because the reported value of `DirectorSignedStatus` is equal to `Ja`. ","non-blocking","IF(Stamdata!$F$1178 = \"Ja\",IF(not(Stamdata!$F$1177=\"\"),0,1),0)+AssertionId(\"valueAssertion_SigningFinancialStatements_PrtValueThnExistence1\")","Stamdata!$F$1177"]
["KvK: Jaarverantwoording 2020 NLGAAP - kleine rechtspersonen - publicatiestukken","valueAssertion_SigningFinancialStatements_PrtValueThnExistence1","`SignatureManagingSupervisoryDirectorsDate` SHOULD exist at least once, because the reported value of `DirectorSignedStatus` is equal to `Ja`. ","non-blocking","IF(Stamdata!$G$1178 = \"Ja\",IF(not(Stamdata!$G$1177=\"\"),0,1),0)+AssertionId(\"valueAssertion_SigningFinancialStatements_PrtValueThnExistence1\")","Stamdata!$G$1177"]
["KvK: Jaarverantwoording 2020 NLGAAP - kleine rechtspersonen - publicatiestukken","valueAssertion_SigningFinancialStatements_PrtValueThnExistence1","`SignatureManagingSupervisoryDirectorsDate` SHOULD exist at least once, because the reported value of `DirectorSignedStatus` is equal to `Ja`. ","non-blocking","IF(Stamdata!$H$1178 = \"Ja\",IF(not(Stamdata!$H$1177=\"\"),0,1),0)+AssertionId(\"valueAssertion_SigningFinancialStatements_PrtValueThnExistence1\")","Stamdata!$H$1177"]
["KvK: Jaarverantwoording 2020 NLGAAP - kleine rechtspersonen - publicatiestukken","valueAssertion_SigningFinancialStatements_PrtValueThnExistence2","`SignatureManagingSupervisoryDirectorsLocation` SHOULD exist at least once, because the reported value of `DirectorSignedStatus` is equal to `Ja`. ","non-blocking","IF(Stamdata!$D$1178 = \"Ja\",IF(not(Stamdata!$D$1176=\"\"),0,1),0)+AssertionId(\"valueAssertion_SigningFinancialStatements_PrtValueThnExistence2\")","Stamdata!$D$1176"]
["KvK: Jaarverantwoording 2020 NLGAAP - kleine rechtspersonen - publicatiestukken","valueAssertion_SigningFinancialStatements_PrtValueThnExistence2","`SignatureManagingSupervisoryDirectorsLocation` SHOULD exist at least once, because the reported value of `DirectorSignedStatus` is equal to `Ja`. ","non-blocking","IF(Stamdata!$E$1178 = \"Ja\",IF(not(Stamdata!$E$1176=\"\"),0,1),0)+AssertionId(\"valueAssertion_SigningFinancialStatements_PrtValueThnExistence2\")","Stamdata!$E$1176"]
["KvK: Jaarverantwoording 2020 NLGAAP - kleine rechtspersonen - publicatiestukken","valueAssertion_SigningFinancialStatements_PrtValueThnExistence2","`SignatureManagingSupervisoryDirectorsLocation` SHOULD exist at least once, because the reported value of `DirectorSignedStatus` is equal to `Ja`. ","non-blocking","IF(Stamdata!$F$1178 = \"Ja\",IF(not(Stamdata!$F$1176=\"\"),0,1),0)+AssertionId(\"valueAssertion_SigningFinancialStatements_PrtValueThnExistence2\")","Stamdata!$F$1176"]
["KvK: Jaarverantwoording 2020 NLGAAP - kleine rechtspersonen - publicatiestukken","valueAssertion_SigningFinancialStatements_PrtValueThnExistence2","`SignatureManagingSupervisoryDirectorsLocation` SHOULD exist at least once, because the reported value of `DirectorSignedStatus` is equal to `Ja`. ","non-blocking","IF(Stamdata!$G$1178 = \"Ja\",IF(not(Stamdata!$G$1176=\"\"),0,1),0)+AssertionId(\"valueAssertion_SigningFinancialStatements_PrtValueThnExistence2\")","Stamdata!$G$1176"]
["KvK: Jaarverantwoording 2020 NLGAAP - kleine rechtspersonen - publicatiestukken","valueAssertion_SigningFinancialStatements_PrtValueThnExistence2","`SignatureManagingSupervisoryDirectorsLocation` SHOULD exist at least once, because the reported value of `DirectorSignedStatus` is equal to `Ja`. ","non-blocking","IF(Stamdata!$H$1178 = \"Ja\",IF(not(Stamdata!$H$1176=\"\"),0,1),0)+AssertionId(\"valueAssertion_SigningFinancialStatements_PrtValueThnExistence2\")","Stamdata!$H$1176"]
["KvK: Jaarverantwoording 2020 NLGAAP - kleine rechtspersonen - publicatiestukken","valueAssertion_SigningFinancialStatements_PrtValueThnExistence3","`DirectorReasonNoSignature` SHOULD exist at least once, because the reported value of `DirectorSignedStatus` is equal to `Nee`. ","non-blocking","IF(Stamdata!$D$1178 = \"Nee\",IF(not(Stamdata!$D$1179=\"\"),0,1),0)+AssertionId(\"valueAssertion_SigningFinancialStatements_PrtValueThnExistence3\")","Stamdata!$D$1179"]
["KvK: Jaarverantwoording 2020 NLGAAP - kleine rechtspersonen - publicatiestukken","valueAssertion_SigningFinancialStatements_PrtValueThnExistence3","`DirectorReasonNoSignature` SHOULD exist at least once, because the reported value of `DirectorSignedStatus` is equal to `Nee`. ","non-blocking","IF(Stamdata!$E$1178 = \"Nee\",IF(not(Stamdata!$E$1179=\"\"),0,1),0)+AssertionId(\"valueAssertion_SigningFinancialStatements_PrtValueThnExistence3\")","Stamdata!$E$1179"]
["KvK: Jaarverantwoording 2020 NLGAAP - kleine rechtspersonen - publicatiestukken","valueAssertion_SigningFinancialStatements_PrtValueThnExistence3","`DirectorReasonNoSignature` SHOULD exist at least once, because the reported value of `DirectorSignedStatus` is equal to `Nee`. ","non-blocking","IF(Stamdata!$F$1178 = \"Nee\",IF(not(Stamdata!$F$1179=\"\"),0,1),0)+AssertionId(\"valueAssertion_SigningFinancialStatements_PrtValueThnExistence3\")","Stamdata!$F$1179"]
["KvK: Jaarverantwoording 2020 NLGAAP - kleine rechtspersonen - publicatiestukken","valueAssertion_SigningFinancialStatements_PrtValueThnExistence3","`DirectorReasonNoSignature` SHOULD exist at least once, because the reported value of `DirectorSignedStatus` is equal to `Nee`. ","non-blocking","IF(Stamdata!$G$1178 = \"Nee\",IF(not(Stamdata!$G$1179=\"\"),0,1),0)+AssertionId(\"valueAssertion_SigningFinancialStatements_PrtValueThnExistence3\")","Stamdata!$G$1179"]
["KvK: Jaarverantwoording 2020 NLGAAP - kleine rechtspersonen - publicatiestukken","valueAssertion_SigningFinancialStatements_PrtValueThnExistence3","`DirectorReasonNoSignature` SHOULD exist at least once, because the reported value of `DirectorSignedStatus` is equal to `Nee`. ","non-blocking","IF(Stamdata!$H$1178 = \"Nee\",IF(not(Stamdata!$H$1179=\"\"),0,1),0)+AssertionId(\"valueAssertion_SigningFinancialStatements_PrtValueThnExistence3\")","Stamdata!$H$1179"]
["KvK: Jaarverantwoording 2020 NLGAAP - kleine rechtspersonen - publicatiestukken","valueAssertion_SigningFinancialStatements_PrtValueThnNoExistence1","`SignatureManagingSupervisoryDirectorsDate` SHOULD NOT be reported, because the reported value of `DirectorSignedStatus` is equal to `Nee`. ","non-blocking","IF(Stamdata!$D$1178 = \"Nee\",IF(Stamdata!$D$1177=\"\",0,1),0)+AssertionId(\"valueAssertion_SigningFinancialStatements_PrtValueThnNoExistence1\")","Stamdata!$D$1177"]
["KvK: Jaarverantwoording 2020 NLGAAP - kleine rechtspersonen - publicatiestukken","valueAssertion_SigningFinancialStatements_PrtValueThnNoExistence1","`SignatureManagingSupervisoryDirectorsDate` SHOULD NOT be reported, because the reported value of `DirectorSignedStatus` is equal to `Nee`. ","non-blocking","IF(Stamdata!$E$1178 = \"Nee\",IF(Stamdata!$E$1177=\"\",0,1),0)+AssertionId(\"valueAssertion_SigningFinancialStatements_PrtValueThnNoExistence1\")","Stamdata!$E$1177"]
["KvK: Jaarverantwoording 2020 NLGAAP - kleine rechtspersonen - publicatiestukken","valueAssertion_SigningFinancialStatements_PrtValueThnNoExistence1","`SignatureManagingSupervisoryDirectorsDate` SHOULD NOT be reported, because the reported value of `DirectorSignedStatus` is equal to `Nee`. ","non-blocking","IF(Stamdata!$F$1178 = \"Nee\",IF(Stamdata!$F$1177=\"\",0,1),0)+AssertionId(\"valueAssertion_SigningFinancialStatements_PrtValueThnNoExistence1\")","Stamdata!$F$1177"]
["KvK: Jaarverantwoording 2020 NLGAAP - kleine rechtspersonen - publicatiestukken","valueAssertion_SigningFinancialStatements_PrtValueThnNoExistence1","`SignatureManagingSupervisoryDirectorsDate` SHOULD NOT be reported, because the reported value of `DirectorSignedStatus` is equal to `Nee`. ","non-blocking","IF(Stamdata!$G$1178 = \"Nee\",IF(Stamdata!$G$1177=\"\",0,1),0)+AssertionId(\"valueAssertion_SigningFinancialStatements_PrtValueThnNoExistence1\")","Stamdata!$G$1177"]
["KvK: Jaarverantwoording 2020 NLGAAP - kleine rechtspersonen - publicatiestukken","valueAssertion_SigningFinancialStatements_PrtValueThnNoExistence1","`SignatureManagingSupervisoryDirectorsDate` SHOULD NOT be reported, because the reported value of `DirectorSignedStatus` is equal to `Nee`. ","non-blocking","IF(Stamdata!$H$1178 = \"Nee\",IF(Stamdata!$H$1177=\"\",0,1),0)+AssertionId(\"valueAssertion_SigningFinancialStatements_PrtValueThnNoExistence1\")","Stamdata!$H$1177"]
["KvK: Jaarverantwoording 2020 NLGAAP - kleine rechtspersonen - publicatiestukken","valueAssertion_SigningFinancialStatements_PrtValueThnNoExistence2","`DirectorReasonNoSignature` SHOULD NOT be reported, because the reported value of `DirectorSignedStatus` is equal to `Ja`. ","non-blocking","IF(Stamdata!$D$1178 = \"Ja\",IF(Stamdata!$D$1179=\"\",0,1),0)+AssertionId(\"valueAssertion_SigningFinancialStatements_PrtValueThnNoExistence2\")","Stamdata!$D$1179"]
["KvK: Jaarverantwoording 2020 NLGAAP - kleine rechtspersonen - publicatiestukken","valueAssertion_SigningFinancialStatements_PrtValueThnNoExistence2","`DirectorReasonNoSignature` SHOULD NOT be reported, because the reported value of `DirectorSignedStatus` is equal to `Ja`. ","non-blocking","IF(Stamdata!$E$1178 = \"Ja\",IF(Stamdata!$E$1179=\"\",0,1),0)+AssertionId(\"valueAssertion_SigningFinancialStatements_PrtValueThnNoExistence2\")","Stamdata!$E$1179"]
["KvK: Jaarverantwoording 2020 NLGAAP - kleine rechtspersonen - publicatiestukken","valueAssertion_SigningFinancialStatements_PrtValueThnNoExistence2","`DirectorReasonNoSignature` SHOULD NOT be reported, because the reported value of `DirectorSignedStatus` is equal to `Ja`. ","non-blocking","IF(Stamdata!$F$1178 = \"Ja\",IF(Stamdata!$F$1179=\"\",0,1),0)+AssertionId(\"valueAssertion_SigningFinancialStatements_PrtValueThnNoExistence2\")","Stamdata!$F$1179"]
["KvK: Jaarverantwoording 2020 NLGAAP - kleine rechtspersonen - publicatiestukken","valueAssertion_SigningFinancialStatements_PrtValueThnNoExistence2","`DirectorReasonNoSignature` SHOULD NOT be reported, because the reported value of `DirectorSignedStatus` is equal to `Ja`. ","non-blocking","IF(Stamdata!$G$1178 = \"Ja\",IF(Stamdata!$G$1179=\"\",0,1),0)+AssertionId(\"valueAssertion_SigningFinancialStatements_PrtValueThnNoExistence2\")","Stamdata!$G$1179"]
["KvK: Jaarverantwoording 2020 NLGAAP - kleine rechtspersonen - publicatiestukken","valueAssertion_SigningFinancialStatements_PrtValueThnNoExistence2","`DirectorReasonNoSignature` SHOULD NOT be reported, because the reported value of `DirectorSignedStatus` is equal to `Ja`. ","non-blocking","IF(Stamdata!$H$1178 = \"Ja\",IF(Stamdata!$H$1179=\"\",0,1),0)+AssertionId(\"valueAssertion_SigningFinancialStatements_PrtValueThnNoExistence2\")","Stamdata!$H$1179"]
["KvK: Jaarverantwoording 2020 NLGAAP - kleine rechtspersonen - publicatiestukken","valueAssertion_SigningFinancialStatements_PrtValueThnNoExistence3","`SignatureManagingSupervisoryDirectorsLocation` SHOULD NOT be reported, because the reported value of `DirectorSignedStatus` is equal to `Nee`. ","non-blocking","IF(Stamdata!$D$1178 = \"Nee\",IF(Stamdata!$D$1176=\"\",0,1),0)+AssertionId(\"valueAssertion_SigningFinancialStatements_PrtValueThnNoExistence3\")","Stamdata!$D$1176"]
["KvK: Jaarverantwoording 2020 NLGAAP - kleine rechtspersonen - publicatiestukken","valueAssertion_SigningFinancialStatements_PrtValueThnNoExistence3","`SignatureManagingSupervisoryDirectorsLocation` SHOULD NOT be reported, because the reported value of `DirectorSignedStatus` is equal to `Nee`. ","non-blocking","IF(Stamdata!$E$1178 = \"Nee\",IF(Stamdata!$E$1176=\"\",0,1),0)+AssertionId(\"valueAssertion_SigningFinancialStatements_PrtValueThnNoExistence3\")","Stamdata!$E$1176"]
["KvK: Jaarverantwoording 2020 NLGAAP - kleine rechtspersonen - publicatiestukken","valueAssertion_SigningFinancialStatements_PrtValueThnNoExistence3","`SignatureManagingSupervisoryDirectorsLocation` SHOULD NOT be reported, because the reported value of `DirectorSignedStatus` is equal to `Nee`. ","non-blocking","IF(Stamdata!$F$1178 = \"Nee\",IF(Stamdata!$F$1176=\"\",0,1),0)+AssertionId(\"valueAssertion_SigningFinancialStatements_PrtValueThnNoExistence3\")","Stamdata!$F$1176"]
["KvK: Jaarverantwoording 2020 NLGAAP - kleine rechtspersonen - publicatiestukken","valueAssertion_SigningFinancialStatements_PrtValueThnNoExistence3","`SignatureManagingSupervisoryDirectorsLocation` SHOULD NOT be reported, because the reported value of `DirectorSignedStatus` is equal to `Nee`. ","non-blocking","IF(Stamdata!$G$1178 = \"Nee\",IF(Stamdata!$G$1176=\"\",0,1),0)+AssertionId(\"valueAssertion_SigningFinancialStatements_PrtValueThnNoExistence3\")","Stamdata!$G$1176"]
["KvK: Jaarverantwoording 2020 NLGAAP - kleine rechtspersonen - publicatiestukken","valueAssertion_SigningFinancialStatements_PrtValueThnNoExistence3","`SignatureManagingSupervisoryDirectorsLocation` SHOULD NOT be reported, because the reported value of `DirectorSignedStatus` is equal to `Nee`. ","non-blocking","IF(Stamdata!$H$1178 = \"Nee\",IF(Stamdata!$H$1176=\"\",0,1),0)+AssertionId(\"valueAssertion_SigningFinancialStatements_PrtValueThnNoExistence3\")","Stamdata!$H$1176"]
["KvK: Jaarverantwoording 2020 NLGAAP - kleine rechtspersonen - publicatiestukken","existenceAssertion_SigningFinancialStatements_PrtExistence1","`DirectorSignedStatus` SHOULD exist at least once.","non-blocking","IF(NOT(Stamdata!$D$1178=\"\"),0,1)+AssertionId(\"existenceAssertion_SigningFinancialStatements_PrtExistence1\")","Stamdata!$D$1178"]
["KvK: Jaarverantwoording 2020 NLGAAP - kleine rechtspersonen - publicatiestukken","existenceAssertion_SigningFinancialStatements_PrtExistence1","`DirectorSignedStatus` SHOULD exist at least once.","non-blocking","IF(NOT(Stamdata!$E$1178=\"\"),0,1)+AssertionId(\"existenceAssertion_SigningFinancialStatements_PrtExistence1\")","Stamdata!$E$1178"]
["KvK: Jaarverantwoording 2020 NLGAAP - kleine rechtspersonen - publicatiestukken","existenceAssertion_SigningFinancialStatements_PrtExistence1","`DirectorSignedStatus` SHOULD exist at least once.","non-blocking","IF(NOT(Stamdata!$F$1178=\"\"),0,1)+AssertionId(\"existenceAssertion_SigningFinancialStatements_PrtExistence1\")","Stamdata!$F$1178"]
["KvK: Jaarverantwoording 2020 NLGAAP - kleine rechtspersonen - publicatiestukken","existenceAssertion_SigningFinancialStatements_PrtExistence1","`DirectorSignedStatus` SHOULD exist at least once.","non-blocking","IF(NOT(Stamdata!$G$1178=\"\"),0,1)+AssertionId(\"existenceAssertion_SigningFinancialStatements_PrtExistence1\")","Stamdata!$G$1178"]
["KvK: Jaarverantwoording 2020 NLGAAP - kleine rechtspersonen - publicatiestukken","existenceAssertion_SigningFinancialStatements_PrtExistence1","`DirectorSignedStatus` SHOULD exist at least once.","non-blocking","IF(NOT(Stamdata!$H$1178=\"\"),0,1)+AssertionId(\"existenceAssertion_SigningFinancialStatements_PrtExistence1\")","Stamdata!$H$1178"]