{"text_format":"1","workbook":"xlsx","n_sheets":4,"sheets":["Stamdata","Enumerations","labels","Pre-validation"],"not_rendered":{"charts":0,"images":0,"macros":1,"external_links":0,"defined_names":17,"comments":0,"pivot_tables":0},"unopened":[],"bounds":{"document_bytes":16777216,"sheet_cells":100000,"rows_first":2000,"rows_last":500,"rows_between":2000,"halvings":0,"cell_chars":16384,"cell_head_chars":4096},"cells_cut":0,"cells_raw":0,"read":"whole","date_system":"1900"}

{"sheet":"Stamdata","index":0,"n_rows":1181,"n_cols":33,"rows_kept":1181,"cut":false,"hidden":false,"merged":[[22,3,22,5],[23,3,23,5],[24,3,24,5],[25,3,25,5],[26,3,26,5],[27,3,27,5],[37,3,37,5],[38,3,38,5],[39,3,39,5],[40,3,40,5],[41,3,41,5],[42,3,42,5],[28,3,28,5],[32,3,32,5],[33,3,33,5],[34,3,34,5],[35,3,35,5],[36,3,36,5],[52,3,52,5],[53,3,53,5],[54,3,54,5],[55,3,55,5],[56,3,56,5],[57,3,57,5],[43,3,43,5],[44,3,44,5],[45,3,45,5],[49,3,49,5],[50,3,50,5],[51,3,51,5],[64,3,64,5],[65,3,65,5],[66,3,66,5],[67,3,67,5],[113,3,113,5],[114,3,114,5],[58,3,58,5],[59,3,59,5],[60,3,60,5],[61,3,61,5],[62,3,62,5],[63,3,63,5],[127,3,127,5],[131,3,131,5],[135,3,135,5],[136,3,136,5],[137,3,137,5],[138,3,138,5],[118,3,118,5],[119,3,119,5],[120,3,120,5],[121,3,121,5],[125,3,125,5],[126,3,126,5],[151,3,151,5],[152,3,152,5],[153,3,153,5],[154,3,154,5],[159,3,159,5],[160,3,160,5],[139,3,139,5],[143,3,143,5],[147,3,147,5],[148,3,148,5],[149,3,149,5],[150,3,150,5],[167,3,167,5],[168,3,168,5],[172,3,172,5],[185,3,185,5],[200,3,200,5],[213,3,213,5],[161,3,161,5],[162,3,162,5],[163,3,163,5],[164,3,164,5],[165,3,165,5],[166,3,166,5],[220,3,220,5],[221,3,221,5],[222,3,222,5],[226,3,226,5],[227,3,227,5],[228,3,228,5],[214,3,214,5],[215,3,215,5],[216,3,216,5],[217,3,217,5],[218,3,218,5],[219,3,219,5],[251,3,251,5],[252,3,252,5],[253,3,253,5],[254,3,254,5],[255,3,255,5],[256,3,256,5],[232,3,232,5],[236,3,236,5],[240,3,240,5],[244,3,244,5],[245,3,245,5],[250,3,250,5],[263,3,263,5],[264,3,264,5],[265,3,265,5],[266,3,266,5],[267,3,267,5],[268,3,268,5],[257,3,257,5],[258,3,258,5],[259,3,259,5],[260,3,260,5],[261,3,261,5],[262,3,262,5],[275,3,275,5],[276,3,276,5],[277,3,277,5],[278,3,278,5],[279,3,279,5],[280,3,280,5],[269,3,269,5],[270,3,270,5],[271,3,271,5],[272,3,272,5],[273,3,273,5],[274,3,274,5],[287,3,287,5],[288,3,288,5],[289,3,289,5],[290,3,290,5],[291,3,291,5],[292,3,292,5],[281,3,281,5],[282,3,282,5],[283,3,283,5],[284,3,284,5],[285,3,285,5],[286,3,286,5],[299,3,299,5],[300,3,300,5],[301,3,301,5],[302,3,302,5],[303,3,303,5],[304,3,304,5],[293,3,293,5],[294,3,294,5],[295,3,295,5],[296,3,296,5],[297,3,297,5],[298,3,298,5],[311,3,311,5],[312,3,312,5],[313,3,313,5],[314,3,314,5],[315,3,315,5],[316,3,316,5],[305,3,305,5],[306,3,306,5],[307,3,307,5],[308,3,308,5],[309,3,309,5],[310,3,310,5],[323,3,323,5],[324,3,324,5],[325,3,325,5],[326,3,326,5],[327,3,327,5],[328,3,328,5],[317,3,317,5],[318,3,318,5],[319,3,319,5],[320,3,320,5],[321,3,321,5],[322,3,322,5],[335,3,335,5],[336,3,336,5],[337,3,337,5],[338,3,338,5],[339,3,339,5],[340,3,340,5],[329,3,329,5],[330,3,330,5],[331,3,331,5],[332,3,332,5],[333,3,333,5],[334,3,334,5],[347,3,347,5],[348,3,348,5],[349,3,349,5],[350,3,350,5],[351,3,351,5],[352,3,352,5],[341,3,341,5],[342,3,342,5],[343,3,343,5],[344,3,344,5],[345,3,345,5],[346,3,346,5],[359,3,359,5],[363,3,363,5],[364,3,364,5],[365,3,365,5],[366,3,366,5],[367,3,367,5],[353,3,353,5],[354,3,354,5],[355,3,355,5],[356,3,356,5],[357,3,357,5],[358,3,358,5],[374,3,374,5],[375,3,375,5],[376,3,376,5],[377,3,377,5],[378,3,378,5],[379,3,379,5],[368,3,368,5],[369,3,369,5],[370,3,370,5],[371,3,371,5],[372,3,372,5],[373,3,373,5],[386,3,386,5],[387,3,387,5],[388,3,388,5],[389,3,389,5],[390,3,390,5],[391,3,391,5],[380,3,380,5],[381,3,381,5],[382,3,382,5],[383,3,383,5],[384,3,384,5],[385,3,385,5],[411,3,411,5],[412,3,412,5],[413,3,413,5],[414,3,414,5],[415,3,415,5],[416,3,416,5],[392,3,392,5],[393,3,393,5],[394,3,394,5],[408,3,408,5],[409,3,409,5],[410,3,410,5],[438,3,438,5],[439,3,439,5],[440,3,440,5],[441,3,441,5],[442,3,442,5],[443,3,443,5],[417,3,417,5],[433,3,433,5],[434,3,434,5],[435,3,435,5],[436,3,436,5],[437,3,437,5],[463,3,463,5],[464,3,464,5],[465,3,465,5],[466,3,466,5],[467,3,467,5],[468,3,468,5],[453,3,453,5],[454,3,454,5],[455,3,455,5],[456,3,456,5],[457,3,457,5],[458,3,458,5],[484,3,484,5],[485,3,485,5],[486,3,486,5],[496,3,496,5],[509,3,509,5],[510,3,510,5],[478,3,478,5],[479,3,479,5],[480,3,480,5],[481,3,481,5],[482,3,482,5],[483,3,483,5],[525,3,525,5],[526,3,526,5],[531,3,531,5],[532,3,532,5],[537,3,537,5],[538,3,538,5],[511,3,511,5],[512,3,512,5],[513,3,513,5],[517,3,517,5],[518,3,518,5],[520,3,520,5],[591,3,591,5],[611,3,611,5],[660,3,660,5],[661,3,661,5],[681,3,681,5],[685,3,685,5],[539,3,539,5],[540,3,540,5],[541,3,541,5],[588,3,588,5],[589,3,589,5],[590,3,590,5],[708,3,708,5],[709,3,709,5],[710,3,710,5],[711,3,711,5],[712,3,712,5],[713,3,713,5],[689,3,689,5],[693,3,693,5],[697,3,697,5],[701,3,701,5],[706,3,706,5],[707,3,707,5],[720,3,720,5],[721,3,721,5],[722,3,722,5],[740,3,740,5],[741,3,741,5],[742,3,742,5],[714,3,714,5],[715,3,715,5],[716,3,716,5],[717,3,717,5],[718,3,718,5],[719,3,719,5],[749,3,749,5],[760,3,760,5],[761,3,761,5],[762,3,762,5],[763,3,763,5],[773,3,773,5],[743,3,743,5],[744,3,744,5],[745,3,745,5],[746,3,746,5],[747,3,747,5],[748,3,748,5],[780,3,780,5],[781,3,781,5],[782,3,782,5],[783,3,783,5],[784,3,784,5],[785,3,785,5],[774,3,774,5],[775,3,775,5],[776,3,776,5],[777,3,777,5],[778,3,778,5],[779,3,779,5],[818,3,818,5],[833,3,833,5],[834,3,834,5],[835,3,835,5],[836,3,836,5],[848,3,848,5],[786,3,786,5],[787,3,787,5],[788,3,788,5],[789,3,789,5],[790,3,790,5],[791,3,791,5],[855,3,855,5],[856,3,856,5],[857,3,857,5],[858,3,858,5],[871,3,871,5],[876,3,876,5],[849,3,849,5],[850,3,850,5],[851,3,851,5],[852,3,852,5],[853,3,853,5],[854,3,854,5],[1139,3,1139,5],[1140,3,1140,5],[1145,3,1145,5],[1146,3,1146,5],[1147,3,1147,5],[1148,3,1148,5],[877,3,877,5],[878,3,878,5],[879,3,879,5],[1136,3,1136,5],[1137,3,1137,5],[1138,3,1138,5],[1155,3,1155,5],[1156,3,1156,5],[1161,3,1161,5],[1162,3,1162,5],[1166,3,1166,5],[1167,3,1167,5],[1149,3,1149,5],[1150,3,1150,5],[1151,3,1151,5],[1152,3,1152,5],[1153,3,1153,5],[1154,3,1154,5]]}
[null,null,null,{"$f":"IF(D58=\"Fiscaal\",IF(_xlfn.SINGLE(PP_Language)=\"NL\",\"Fiscaal\",\"Fiscal\"),IF(_xlfn.SINGLE(PP_Language)=\"NL\",\"Commercieel\",\"Commercial\"))","v":"Commercial"}]
[null,"Conversion info"]
[null,null,null,null,null,null,null,null,null,null,null,null,null,null,null,null,null,null,null,null,null,null,null,null,null,"/General data label {2}","/General data value {4}"]
[null,null,null,"NL 2021 15.0"]
[null,null,null,"EN"]
[null,"entrypoint",null,"KvK: Jaarverantwoording 2020 NLGAAP - kleine rechtspersonen - publicatiestukken"]
[null,"identifier scheme",null,"http://www.kvk.nl/kvk-id"]
[null,"Vorigvorig jaar",null,{"$f":"DATE(YEAR(D54)-1,MONTH(D54),DAY(D54))","v":"3798-12-31"}]
[null,null,null,"INF"]
[null,null,null,"INF"]
[null,null,null,"INF"]
[null,null,null,"INF"]
[null,null,null,false]
[null,null,null,true]
[null,null,null,null,null,null,null,null,null,null,null,null,null,null,null,null,null,null,null,null,null,null,null,null,null,"//General data label {2}","//General data value {4}"]
[]
[]
[]
[null,{"$f":"INDEX(labels!$A$2:$C$2,1,MATCH(PP_Language,labels!$A$1:$C$1,0))","v":"Document and entity information"}]
[null,{"$f":"INDEX(labels!$A$3:$C$3,1,MATCH(PP_Language,labels!$A$1:$C$1,0))","v":"Entity information"}]
{"$rows_left_out":1162}
{"sheet":"Enumerations","index":1,"n_rows":934,"n_cols":9,"rows_kept":934,"cut":false,"hidden":true,"merged":[]}
[null,"Besloten vennootschap met beperkte aansprakelijkheid","Groot",111,"Ja","Commercieel","AED","Na","Bestuurder (huidig)"]
[null,"Commanditaire vennootschap","Klein",116,"Nee","Fiscaal","AFN","Voor","Bestuurder (voormalig)"]
[null,"Cooperatie","Micro",121,null,null,"ALL",null,"Commissaris (huidig)"]
[null,"Naamloze vennootschap","Middelgroot",127,null,null,"AMD",null,"Commissaris (voormalig)"]
[null,"Onderlinge waarborgmaatschappij",null,128,null,null,"ANG"]
[null,"Stichting",null,129,null,null,"AOA"]
[null,"Vennootschap onder firma",null,143,null,null,"ARS"]
[null,"Vereniging",null,150,null,null,"AUD"]
[null,null,null,161,null,null,"AWG"]
[null,null,null,162,null,null,"AZN"]
[null,null,null,163,null,null,"BAM"]
[null,null,null,164,null,null,"BBD"]
[null,null,null,170,null,null,"BDT"]
[null,null,null,210,null,null,"BGN"]
[null,null,null,220,null,null,"BHD"]
[null,null,null,240,null,null,"BIF"]
[null,null,null,311,null,null,"BMD"]
[null,null,null,312,null,null,"BND"]
[null,null,null,321,null,null,"BOB"]
[null,null,null,322,null,null,"BOV"]
{"$rows_left_out":915}
{"sheet":"labels","index":2,"n_rows":757,"n_cols":3,"rows_kept":757,"cut":false,"hidden":false,"merged":[]}
["id","en","nl"]
[0,"Document and entity information","Informatie over de rapportage en de rechtspersoon"]
[1,"Entity information","Informatie over de rechtspersoon"]
[2,"Name of the legal entity","Naam van de rechtspersoon"]
[3,"Legal form of the legal entity","Rechtsvorm van de rechtspersoon"]
[4,"Registered office of the legal entity","Zetel van de rechtspersoon"]
[5,"Registration number at the Chamber of Commerce","Registratienummer bij de Kamer van Koophandel"]
[6,"Business names","Handelsnamen"]
[7,"Classification of the legal entity based on the legal size criteria","Classificatie van de rechtspersoon op basis van de wettelijke groottecriteria"]
[8,"SBI-code","SBI-code"]
[9,"Address of the legal entity","Adres van de rechtspersoon"]
[10,"Description of location NL","Locatieomschrijving NL"]
[11,"Street name NL","Straatnaam NL"]
[12,"House number NL","Huisnummer NL"]
[13,"House number addition","Huisnummer toevoeging"]
[14,"PO box number","Postbusnummer"]
[15,"Postal code NL","Postcode NL"]
[16,"Place of residence NL","Vestigingsplaats NL"]
[17,"Description of location abroad","Locatieomschrijving buitenland"]
[18,"Street name abroad","Straatnaam buitenland"]
{"$rows_left_out":738}
{"sheet":"Pre-validation","index":3,"n_rows":279,"n_cols":6,"rows_kept":279,"cut":false,"hidden":true,"merged":[]}
[{"$f":"IF(NOT(Stamdata!$H$1178=\"\"),0,1)+AssertionId(\"existenceAssertion_SigningFinancialStatements_PrtExistence1\")","v":1}]
["KvK: Jaarverantwoording 2020 NLGAAP - kleine rechtspersonen - publicatiestukken","valueAssertion_BalanceSheet_PrtFST1SumOfChildrenDParentCredit1","`Equity` SHOULD be equal to the summation of the underlying values. ","non-blocking","IF(OR(not(AND(Stamdata!$D$93=\"\",Stamdata!$D$94=\"\",Stamdata!$D$95=\"\",Stamdata!$D$96=\"\",Stamdata!$D$97=\"\",Stamdata!$D$98=\"\",Stamdata!$D$99=\"\",Stamdata!$D$100=\"\",Stamdata!$D$101=\"\",Stamdata!$D$102=\"\")),not(0=0)),IF( Stamdata!$D$103 = sum(Stamdata!$D$93,Stamdata!$D$94,Stamdata!$D$95,Stamdata!$D$96,Stamdata!$D$97,Stamdata!$D$98,Stamdata!$D$99,Stamdata!$D$100,Stamdata!$D$101,Stamdata!$D$102)- 0,0,1),0)+AssertionId(\"valueAssertion_BalanceSheet_PrtFST1SumOfChildrenDParentCredit1\")","Stamdata!$D$103"]
["KvK: Jaarverantwoording 2020 NLGAAP - kleine rechtspersonen - publicatiestukken","valueAssertion_BalanceSheet_PrtFST1SumOfChildrenDParentCredit1","`Equity` SHOULD be equal to the summation of the underlying values. ","non-blocking","IF(OR(not(AND(Stamdata!$F$93=\"\",Stamdata!$F$94=\"\",Stamdata!$F$95=\"\",Stamdata!$F$96=\"\",Stamdata!$F$97=\"\",Stamdata!$F$98=\"\",Stamdata!$F$99=\"\",Stamdata!$F$100=\"\",Stamdata!$F$101=\"\",Stamdata!$F$102=\"\")),not(0=0)),IF( Stamdata!$F$103 = sum(Stamdata!$F$93,Stamdata!$F$94,Stamdata!$F$95,Stamdata!$F$96,Stamdata!$F$97,Stamdata!$F$98,Stamdata!$F$99,Stamdata!$F$100,Stamdata!$F$101,Stamdata!$F$102)- 0,0,1),0)+AssertionId(\"valueAssertion_BalanceSheet_PrtFST1SumOfChildrenDParentCredit1\")","Stamdata!$F$103"]
["KvK: Jaarverantwoording 2020 NLGAAP - kleine rechtspersonen - publicatiestukken","valueAssertion_BalanceSheet_PrtFST1SumOfChildrenDParentCredit2","`EquityAndLiabilities` SHOULD be equal to the summation of the underlying values. ","non-blocking","IF(OR(not(AND(Stamdata!$D$103=\"\",Stamdata!$D$105=\"\",Stamdata!$D$106=\"\",Stamdata!$D$107=\"\")),not(0=0)),IF( Stamdata!$D$108 = sum(Stamdata!$D$103,Stamdata!$D$105,Stamdata!$D$106,Stamdata!$D$107)- 0,0,1),0)+AssertionId(\"valueAssertion_BalanceSheet_PrtFST1SumOfChildrenDParentCredit2\")","Stamdata!$D$108"]
["KvK: Jaarverantwoording 2020 NLGAAP - kleine rechtspersonen - publicatiestukken","valueAssertion_BalanceSheet_PrtFST1SumOfChildrenDParentCredit2","`EquityAndLiabilities` SHOULD be equal to the summation of the underlying values. ","non-blocking","IF(OR(not(AND(Stamdata!$F$103=\"\",Stamdata!$F$105=\"\",Stamdata!$F$106=\"\",Stamdata!$F$107=\"\")),not(0=0)),IF( Stamdata!$F$108 = sum(Stamdata!$F$103,Stamdata!$F$105,Stamdata!$F$106,Stamdata!$F$107)- 0,0,1),0)+AssertionId(\"valueAssertion_BalanceSheet_PrtFST1SumOfChildrenDParentCredit2\")","Stamdata!$F$108"]
["KvK: Jaarverantwoording 2020 NLGAAP - kleine rechtspersonen - publicatiestukken","valueAssertion_BalanceSheet_PrtFST1SumOfChildrenDParentDebit1","`AssetsNoncurrent` SHOULD be equal to the summation of the underlying values. ","non-blocking","IF(OR(not(0=0),not(AND(Stamdata!$D$78=\"\",Stamdata!$D$79=\"\",Stamdata!$D$80=\"\",Stamdata!$D$81=\"\"))),IF( Stamdata!$D$82 = - 0+ sum(Stamdata!$D$78,Stamdata!$D$79,Stamdata!$D$80,Stamdata!$D$81),0,1),0)+AssertionId(\"valueAssertion_BalanceSheet_PrtFST1SumOfChildrenDParentDebit1\")","Stamdata!$D$82"]
["KvK: Jaarverantwoording 2020 NLGAAP - kleine rechtspersonen - publicatiestukken","valueAssertion_BalanceSheet_PrtFST1SumOfChildrenDParentDebit1","`AssetsNoncurrent` SHOULD be equal to the summation of the underlying values. ","non-blocking","IF(OR(not(0=0),not(AND(Stamdata!$F$78=\"\",Stamdata!$F$79=\"\",Stamdata!$F$80=\"\",Stamdata!$F$81=\"\"))),IF( Stamdata!$F$82 = - 0+ sum(Stamdata!$F$78,Stamdata!$F$79,Stamdata!$F$80,Stamdata!$F$81),0,1),0)+AssertionId(\"valueAssertion_BalanceSheet_PrtFST1SumOfChildrenDParentDebit1\")","Stamdata!$F$82"]
["KvK: Jaarverantwoording 2020 NLGAAP - kleine rechtspersonen - publicatiestukken","valueAssertion_BalanceSheet_PrtFST1SumOfChildrenDParentDebit2","`AssetsCurrent` SHOULD be equal to the summation of the underlying values. ","non-blocking","IF(OR(not(0=0),not(AND(Stamdata!$D$84=\"\",Stamdata!$D$85=\"\",Stamdata!$D$86=\"\",Stamdata!$D$87=\"\",Stamdata!$D$88=\"\"))),IF( Stamdata!$D$89 = - 0+ sum(Stamdata!$D$84,Stamdata!$D$85,Stamdata!$D$86,Stamdata!$D$87,Stamdata!$D$88),0,1),0)+AssertionId(\"valueAssertion_BalanceSheet_PrtFST1SumOfChildrenDParentDebit2\")","Stamdata!$D$89"]
["KvK: Jaarverantwoording 2020 NLGAAP - kleine rechtspersonen - publicatiestukken","valueAssertion_BalanceSheet_PrtFST1SumOfChildrenDParentDebit2","`AssetsCurrent` SHOULD be equal to the summation of the underlying values. ","non-blocking","IF(OR(not(0=0),not(AND(Stamdata!$F$84=\"\",Stamdata!$F$85=\"\",Stamdata!$F$86=\"\",Stamdata!$F$87=\"\",Stamdata!$F$88=\"\"))),IF( Stamdata!$F$89 = - 0+ sum(Stamdata!$F$84,Stamdata!$F$85,Stamdata!$F$86,Stamdata!$F$87,Stamdata!$F$88),0,1),0)+AssertionId(\"valueAssertion_BalanceSheet_PrtFST1SumOfChildrenDParentDebit2\")","Stamdata!$F$89"]
["KvK: Jaarverantwoording 2020 NLGAAP - kleine rechtspersonen - publicatiestukken","valueAssertion_BalanceSheet_PrtFST1SumOfChildrenDParentDebit3","`Assets` SHOULD be equal to the summation of the underlying values. ","non-blocking","IF(OR(not(0=0),not(AND(Stamdata!$D$82=\"\",Stamdata!$D$89=\"\"))),IF( Stamdata!$D$91 = - 0+ sum(Stamdata!$D$82,Stamdata!$D$89),0,1),0)+AssertionId(\"valueAssertion_BalanceSheet_PrtFST1SumOfChildrenDParentDebit3\")","Stamdata!$D$91"]
["KvK: Jaarverantwoording 2020 NLGAAP - kleine rechtspersonen - publicatiestukken","valueAssertion_BalanceSheet_PrtFST1SumOfChildrenDParentDebit3","`Assets` SHOULD be equal to the summation of the underlying values. ","non-blocking","IF(OR(not(0=0),not(AND(Stamdata!$F$82=\"\",Stamdata!$F$89=\"\"))),IF( Stamdata!$F$91 = - 0+ sum(Stamdata!$F$82,Stamdata!$F$89),0,1),0)+AssertionId(\"valueAssertion_BalanceSheet_PrtFST1SumOfChildrenDParentDebit3\")","Stamdata!$F$91"]
["KvK: Jaarverantwoording 2020 NLGAAP - kleine rechtspersonen - publicatiestukken","valueAssertion_BalanceSheet_PrtFST101Variable1","`EquityAndLiabilities` SHOULD be equal to + `Assets`. ","non-blocking","IF(+ sum(Stamdata!$D$91) = Stamdata!$D$108 ,0,1)+AssertionId(\"valueAssertion_BalanceSheet_PrtFST101Variable1\")","Stamdata!$D$91"]
["KvK: Jaarverantwoording 2020 NLGAAP - kleine rechtspersonen - publicatiestukken","valueAssertion_BalanceSheet_PrtFST101Variable1","`EquityAndLiabilities` SHOULD be equal to + `Assets`. ","non-blocking","IF(+ sum(Stamdata!$F$91) = Stamdata!$F$108 ,0,1)+AssertionId(\"valueAssertion_BalanceSheet_PrtFST101Variable1\")","Stamdata!$F$91"]
["KvK: Jaarverantwoording 2020 NLGAAP - kleine rechtspersonen - publicatiestukken","valueAssertion_BalanceSheet_PrtValueThnNoExistenceCovA1","`ResultForTheYear` SHOULD NOT be reported, because the reported value of `BalanceSheetBeforeAfterAppropriationResults` is equal to `Na`. ","non-blocking","IF(Stamdata!$D$76 = \"Na\",IF(Stamdata!$D$101=\"\",0,1),0)+AssertionId(\"valueAssertion_BalanceSheet_PrtValueThnNoExistenceCovA1\")","Stamdata!$D$101"]
["KvK: Jaarverantwoording 2020 NLGAAP - kleine rechtspersonen - publicatiestukken","valueAssertion_BalanceSheet_PrtValueThnNoExistenceCovA1","`ResultForTheYear` SHOULD NOT be reported, because the reported value of `BalanceSheetBeforeAfterAppropriationResults` is equal to `Na`. ","non-blocking","IF(Stamdata!$F$76 = \"Na\",IF(Stamdata!$F$101=\"\",0,1),0)+AssertionId(\"valueAssertion_BalanceSheet_PrtValueThnNoExistenceCovA1\")","Stamdata!$F$101"]
["KvK: Jaarverantwoording 2020 NLGAAP - kleine rechtspersonen - publicatiestukken","existenceAssertion_BalanceSheet_PrtOnlyReportFactPeriodEQParam1","`BalanceSheetBeforeAfterAppropriationResults` SHOULD not exist for any period other than the current period.","non-blocking","IF(NOT(Stamdata!$D$76=\"\"),0,1)+AssertionId(\"existenceAssertion_BalanceSheet_PrtOnlyReportFactPeriodEQParam1\")","Stamdata!$D$76"]
["KvK: Jaarverantwoording 2020 NLGAAP - kleine rechtspersonen - publicatiestukken","existenceAssertion_BalanceSheet_PrtOnlyReportFactPeriodEQParam1","`BalanceSheetBeforeAfterAppropriationResults` SHOULD not exist for any period other than the current period.","non-blocking","IF(NOT(Stamdata!$F$76=\"\"),0,1)+AssertionId(\"existenceAssertion_BalanceSheet_PrtOnlyReportFactPeriodEQParam1\")","Stamdata!$F$76"]
["KvK: Jaarverantwoording 2020 NLGAAP - kleine rechtspersonen - publicatiestukken","valueAssertion_DocumentInformation_PrtDateEarlier24HDateLater1","The date reported for `FinancialReportingPeriodPreviousEndDate` MUST be one day earlier than the date reported for `FinancialReportingPeriodCurrentStartDate`. ","blocking","IF((Stamdata!$D$54)+ 1 = (Stamdata!$D$51),0,1)+AssertionId(\"valueAssertion_DocumentInformation_PrtDateEarlier24HDateLater1\")","Stamdata!$D$51"]
["KvK: Jaarverantwoording 2020 NLGAAP - kleine rechtspersonen - publicatiestukken","valueAssertion_DocumentInformation_PrtDateEarlierDateLater1","The date reported for `FinancialReportingPeriodCurrentEndDate` MUST be earlier than the date reported for `DocumentAdoptionDate`. ","blocking","IF(Stamdata!$D$52 < Stamdata!$D$63,0,1)+AssertionId(\"valueAssertion_DocumentInformation_PrtDateEarlierDateLater1\")","Stamdata!$D$63"]
["KvK: Jaarverantwoording 2020 NLGAAP - kleine rechtspersonen - publicatiestukken","valueAssertion_DocumentInformation_PrtDateEarlierDateLater2","The date reported for `FinancialReportingPeriodPreviousStartDate` MUST be earlier than the date reported for `FinancialReportingPeriodPreviousEndDate`. ","blocking","IF(Stamdata!$D$53 < Stamdata!$D$54,0,1)+AssertionId(\"valueAssertion_DocumentInformation_PrtDateEarlierDateLater2\")","Stamdata!$D$54"]
{"$rows_left_out":259}