{"text_format":"1","workbook":"xlsx","n_sheets":5,"sheets":["Stamdata","Enumerations","labels","Pre-validation","XBRL errors"],"not_rendered":{"charts":0,"images":0,"macros":1,"external_links":0,"defined_names":17,"comments":0,"pivot_tables":0},"unopened":[],"bounds":{"document_bytes":16777216,"sheet_cells":100000,"rows_first":2000,"rows_last":500,"rows_between":2000,"halvings":0,"cell_chars":16384,"cell_head_chars":4096},"cells_cut":0,"cells_raw":0,"read":"whole","date_system":"1900"}

{"sheet":"Stamdata","index":0,"n_rows":116,"n_cols":32,"rows_kept":116,"cut":false,"hidden":false,"merged":[[36,3,36,5],[22,3,22,5],[23,3,23,5],[24,3,24,5],[25,3,25,5],[26,3,26,5],[27,3,27,5],[28,3,28,5],[32,3,32,5],[33,3,33,5],[34,3,34,5],[35,3,35,5],[51,3,51,5],[37,3,37,5],[38,3,38,5],[39,3,39,5],[40,3,40,5],[41,3,41,5],[42,3,42,5],[43,3,43,5],[44,3,44,5],[45,3,45,5],[49,3,49,5],[50,3,50,5],[63,3,63,5],[52,3,52,5],[53,3,53,5],[54,3,54,5],[55,3,55,5],[56,3,56,5],[57,3,57,5],[58,3,58,5],[59,3,59,5],[60,3,60,5],[61,3,61,5],[62,3,62,5],[101,3,101,5],[102,3,102,5],[64,3,64,5],[65,3,65,5],[66,3,66,5],[67,3,67,5],[96,3,96,5],[100,3,100,5]]}
[null,null,null,{"$f":"IF(D58=\"Fiscaal\",IF(PP_Language=\"NL\",\"Fiscaal\",\"Fiscal\"),IF(PP_Language=\"NL\",\"Commercieel\",\"Commercial\"))","v":"Commercieel"}]
[null,"Conversion info"]
[null,null,null,null,null,null,null,null,null,null,null,null,null,null,null,null,null,null,null,null,null,null,null,null,null,"/General data label {2}","/General data value {4}"]
[null,null,null,"NL 2021 15.0"]
[null,null,null,"NL"]
[null,"entrypoint",null,"KvK: Jaarverantwoording 2020 NLGAAP - micro rechtspersonen - publicatiestukken"]
[null,"identifier scheme",null,"http://www.kvk.nl/kvk-id"]
[null,"Vorigvorig jaar",null,{"$f":"DATE(YEAR(D54)-1,MONTH(D54),DAY(D54))","v":"3798-12-31"}]
[null,null,null,"INF"]
[null,null,null,"INF"]
[null,null,null,"INF"]
[null,null,null,"INF"]
[null,null,null,false]
[null,null,null,true]
[null,null,null,null,null,null,null,null,null,null,null,null,null,null,null,null,null,null,null,null,null,null,null,null,null,"//General data label {2}","//General data value {4}"]
[]
[]
[]
[null,{"$f":"INDEX(labels!$A$2:$C$2,1,MATCH(PP_Language,labels!$A$1:$C$1,0))","v":"Informatie over de rapportage en de rechtspersoon"}]
[null,{"$f":"INDEX(labels!$A$3:$C$3,1,MATCH(PP_Language,labels!$A$1:$C$1,0))","v":"Informatie over de rechtspersoon"}]
[null,{"$f":"INDEX(labels!$A$3:$C$3,1,MATCH(PP_Language,labels!$A$1:$C$1,0))","v":"Informatie over de rechtspersoon"}]
[null,null,null,null,null,null,null,null,null,null,null,null,null,null,null,null,null,null,null,null,null,null,null,null,null,{"$f":"\"/entity-information label {\"&COLUMN($B$23)&\"}\"","v":"/entity-information label {2}"},null,{"$f":"\"/entity-information values {\"&COLUMN($D$23)&\"}\"","v":"/entity-information values {4}"}]
[null,{"$f":"INDEX(labels!$A$4:$C$4,1,MATCH(PP_Language,labels!$A$1:$C$1,0))","v":"Naam van de rechtspersoon"}]
[null,{"$f":"INDEX(labels!$A$5:$C$5,1,MATCH(PP_Language,labels!$A$1:$C$1,0))","v":"Rechtsvorm van de rechtspersoon"}]
[null,{"$f":"INDEX(labels!$A$6:$C$6,1,MATCH(PP_Language,labels!$A$1:$C$1,0))","v":"Zetel van de rechtspersoon"}]
[null,{"$f":"INDEX(labels!$A$7:$C$7,1,MATCH(PP_Language,labels!$A$1:$C$1,0))","v":"Registratienummer bij de Kamer van Koophandel"}]
[null,{"$f":"INDEX(labels!$A$8:$C$8,1,MATCH(PP_Language,labels!$A$1:$C$1,0))","v":"Handelsnamen"}]
[null,{"$f":"INDEX(labels!$A$9:$C$9,1,MATCH(PP_Language,labels!$A$1:$C$1,0))","v":"Classificatie van de rechtspersoon op basis van de wettelijke groottecriteria"}]
[null,{"$f":"INDEX(labels!$A$10:$C$10,1,MATCH(PP_Language,labels!$A$1:$C$1,0))","v":"SBI-code"}]
[null,null,null,null,null,null,null,null,null,null,null,null,null,null,null,null,null,null,null,null,null,null,null,null,null,{"$f":"\"//entity-information label {\"&COLUMN($B$30)&\"}\"","v":"//entity-information label {2}"},null,{"$f":"\"//entity-information values {\"&COLUMN($D$30)&\"}\"","v":"//entity-information values {4}"}]
{"$rows_left_out":87}
{"sheet":"Enumerations","index":1,"n_rows":934,"n_cols":9,"rows_kept":934,"cut":false,"hidden":true,"merged":[]}
[null,"Besloten vennootschap met beperkte aansprakelijkheid","Groot",111,"Ja","Commercieel","AED","Na","Bestuurder (huidig)"]
[null,"Commanditaire vennootschap","Klein",116,"Nee","Fiscaal","AFN","Voor","Bestuurder (voormalig)"]
[null,"Cooperatie","Micro",121,null,null,"ALL",null,"Commissaris (huidig)"]
[null,"Naamloze vennootschap","Middelgroot",127,null,null,"AMD",null,"Commissaris (voormalig)"]
[null,"Onderlinge waarborgmaatschappij",null,128,null,null,"ANG"]
[null,"Stichting",null,129,null,null,"AOA"]
[null,"Vennootschap onder firma",null,143,null,null,"ARS"]
[null,"Vereniging",null,150,null,null,"AUD"]
[null,null,null,161,null,null,"AWG"]
[null,null,null,162,null,null,"AZN"]
[null,null,null,163,null,null,"BAM"]
[null,null,null,164,null,null,"BBD"]
[null,null,null,170,null,null,"BDT"]
[null,null,null,210,null,null,"BGN"]
[null,null,null,220,null,null,"BHD"]
[null,null,null,240,null,null,"BIF"]
[null,null,null,311,null,null,"BMD"]
[null,null,null,312,null,null,"BND"]
[null,null,null,321,null,null,"BOB"]
[null,null,null,322,null,null,"BOV"]
[null,null,null,610,null,null,"BRL"]
[null,null,null,620,null,null,"BSD"]
[null,null,null,812,null,null,"BTN"]
[null,null,null,892,null,null,"BWP"]
[null,null,null,893,null,null,"BYR"]
[null,null,null,899,null,null,"BZD"]
[null,null,null,910,null,null,"CAD"]
[null,null,null,990,null,null,"CDF"]
[null,null,null,1011,null,null,"CHE"]
[null,null,null,1012,null,null,"CHF"]
{"$rows_left_out":905}
{"sheet":"labels","index":2,"n_rows":80,"n_cols":3,"rows_kept":80,"cut":false,"hidden":true,"merged":[]}
["id","en","nl"]
[0,"Document and entity information","Informatie over de rapportage en de rechtspersoon"]
[1,"Entity information","Informatie over de rechtspersoon"]
[2,"Name of the legal entity","Naam van de rechtspersoon"]
[3,"Legal form of the legal entity","Rechtsvorm van de rechtspersoon"]
[4,"Registered office of the legal entity","Zetel van de rechtspersoon"]
[5,"Registration number at the Chamber of Commerce","Registratienummer bij de Kamer van Koophandel"]
[6,"Business names","Handelsnamen"]
[7,"Classification of the legal entity based on the legal size criteria","Classificatie van de rechtspersoon op basis van de wettelijke groottecriteria"]
[8,"SBI-code","SBI-code"]
[9,"Address of the legal entity","Adres van de rechtspersoon"]
[10,"Description of location NL","Locatieomschrijving NL"]
[11,"Street name NL","Straatnaam NL"]
[12,"House number NL","Huisnummer NL"]
[13,"House number addition","Huisnummer toevoeging"]
[14,"PO box number","Postbusnummer"]
[15,"Postal code NL","Postcode NL"]
[16,"Place of residence NL","Vestigingsplaats NL"]
[17,"Description of location abroad","Locatieomschrijving buitenland"]
[18,"Street name abroad","Straatnaam buitenland"]
[19,"House number abroad","Huisnummer buitenland"]
[20,"Postal code abroad","Postcode buitenland"]
[21,"Place of residence abroad","Vestigingsplaats buitenland"]
[22,"Name region","Regionaam"]
[23,"Country name, ISO","Landnaam, ISO"]
[24,"Document information","Informatie over de rapportage"]
[25,"Title of the document","Titel van het document"]
[26,"Start date of the period concerning the financial statement","Startdatum van de periode waarop de jaarrekening betrekking heeft"]
[27,"End date of the period concerning the financial statement","Einddatum van de periode waarop de jaarrekening betrekking heeft"]
[28,"Start date of the previous period concerning the financial statement","Startdatum van de voorgaande periode waarop de jaarrekening betrekking heeft"]
{"$rows_left_out":51}
{"sheet":"Pre-validation","index":3,"n_rows":105,"n_cols":6,"rows_kept":105,"cut":false,"hidden":true,"merged":[]}
[{"$f":"IF(NOT(Stamdata!$H$113=\"\"),0,1)+AssertionId(\"existenceAssertion_SigningFinancialStatements_PrtExistence1\")","v":1}]
["KvK: Jaarverantwoording 2020 NLGAAP - micro rechtspersonen - publicatiestukken","valueAssertion_BalanceSheetMicroEntities_PrtFST1SumOfChildrenDParentCredit1","`EquityAndLiabilities` SHOULD be equal to the summation of the underlying values. ","blocking","IF(OR(not(AND(Stamdata!$D$87=\"\",Stamdata!$D$88=\"\",Stamdata!$D$91=\"\")),not(0=0)),IF( Stamdata!$D$93 = sum(Stamdata!$D$87,Stamdata!$D$88,Stamdata!$D$91)- 0,0,1),0)+AssertionId(\"valueAssertion_BalanceSheetMicroEntities_PrtFST1SumOfChildrenDParentCredit1\")","Stamdata!$D$93"]
["KvK: Jaarverantwoording 2020 NLGAAP - micro rechtspersonen - publicatiestukken","valueAssertion_BalanceSheetMicroEntities_PrtFST1SumOfChildrenDParentCredit1","`EquityAndLiabilities` SHOULD be equal to the summation of the underlying values. ","blocking","IF(OR(not(AND(Stamdata!$F$87=\"\",Stamdata!$F$88=\"\",Stamdata!$F$91=\"\")),not(0=0)),IF( Stamdata!$F$93 = sum(Stamdata!$F$87,Stamdata!$F$88,Stamdata!$F$91)- 0,0,1),0)+AssertionId(\"valueAssertion_BalanceSheetMicroEntities_PrtFST1SumOfChildrenDParentCredit1\")","Stamdata!$F$93"]
["KvK: Jaarverantwoording 2020 NLGAAP - micro rechtspersonen - publicatiestukken","valueAssertion_BalanceSheetMicroEntities_PrtFST1SumOfChildrenDParentCredit2","`Liabilities` SHOULD be equal to the summation of the underlying values. ","blocking","IF(OR(not(AND(Stamdata!$D$89=\"\",Stamdata!$D$90=\"\")),not(0=0)),IF( Stamdata!$D$91 = sum(Stamdata!$D$89,Stamdata!$D$90)- 0,0,1),0)+AssertionId(\"valueAssertion_BalanceSheetMicroEntities_PrtFST1SumOfChildrenDParentCredit2\")","Stamdata!$D$91"]
["KvK: Jaarverantwoording 2020 NLGAAP - micro rechtspersonen - publicatiestukken","valueAssertion_BalanceSheetMicroEntities_PrtFST1SumOfChildrenDParentCredit2","`Liabilities` SHOULD be equal to the summation of the underlying values. ","blocking","IF(OR(not(AND(Stamdata!$F$89=\"\",Stamdata!$F$90=\"\")),not(0=0)),IF( Stamdata!$F$91 = sum(Stamdata!$F$89,Stamdata!$F$90)- 0,0,1),0)+AssertionId(\"valueAssertion_BalanceSheetMicroEntities_PrtFST1SumOfChildrenDParentCredit2\")","Stamdata!$F$91"]
["KvK: Jaarverantwoording 2020 NLGAAP - micro rechtspersonen - publicatiestukken","valueAssertion_BalanceSheetMicroEntities_PrtFST1SumOfChildrenDParentDebit1","`AssetsCurrent` SHOULD be equal to the summation of the underlying values. ","blocking","IF(OR(not(0=0),not(AND(Stamdata!$D$81=\"\",Stamdata!$D$82=\"\"))),IF( Stamdata!$D$83 = - 0+ sum(Stamdata!$D$81,Stamdata!$D$82),0,1),0)+AssertionId(\"valueAssertion_BalanceSheetMicroEntities_PrtFST1SumOfChildrenDParentDebit1\")","Stamdata!$D$83"]
["KvK: Jaarverantwoording 2020 NLGAAP - micro rechtspersonen - publicatiestukken","valueAssertion_BalanceSheetMicroEntities_PrtFST1SumOfChildrenDParentDebit1","`AssetsCurrent` SHOULD be equal to the summation of the underlying values. ","blocking","IF(OR(not(0=0),not(AND(Stamdata!$F$81=\"\",Stamdata!$F$82=\"\"))),IF( Stamdata!$F$83 = - 0+ sum(Stamdata!$F$81,Stamdata!$F$82),0,1),0)+AssertionId(\"valueAssertion_BalanceSheetMicroEntities_PrtFST1SumOfChildrenDParentDebit1\")","Stamdata!$F$83"]
["KvK: Jaarverantwoording 2020 NLGAAP - micro rechtspersonen - publicatiestukken","valueAssertion_BalanceSheetMicroEntities_PrtFST1SumOfChildrenDParentDebit2","`AssetsNoncurrent` SHOULD be equal to the summation of the underlying values. ","blocking","IF(OR(not(0=0),not(AND(Stamdata!$D$77=\"\",Stamdata!$D$78=\"\"))),IF( Stamdata!$D$79 = - 0+ sum(Stamdata!$D$77,Stamdata!$D$78),0,1),0)+AssertionId(\"valueAssertion_BalanceSheetMicroEntities_PrtFST1SumOfChildrenDParentDebit2\")","Stamdata!$D$79"]
["KvK: Jaarverantwoording 2020 NLGAAP - micro rechtspersonen - publicatiestukken","valueAssertion_BalanceSheetMicroEntities_PrtFST1SumOfChildrenDParentDebit2","`AssetsNoncurrent` SHOULD be equal to the summation of the underlying values. ","blocking","IF(OR(not(0=0),not(AND(Stamdata!$F$77=\"\",Stamdata!$F$78=\"\"))),IF( Stamdata!$F$79 = - 0+ sum(Stamdata!$F$77,Stamdata!$F$78),0,1),0)+AssertionId(\"valueAssertion_BalanceSheetMicroEntities_PrtFST1SumOfChildrenDParentDebit2\")","Stamdata!$F$79"]
["KvK: Jaarverantwoording 2020 NLGAAP - micro rechtspersonen - publicatiestukken","valueAssertion_BalanceSheetMicroEntities_PrtFST1SumOfChildrenDParentDebit3","`Assets` SHOULD be equal to the summation of the underlying values. ","blocking","IF(OR(not(0=0),not(AND(Stamdata!$D$79=\"\",Stamdata!$D$83=\"\"))),IF( Stamdata!$D$85 = - 0+ sum(Stamdata!$D$79,Stamdata!$D$83),0,1),0)+AssertionId(\"valueAssertion_BalanceSheetMicroEntities_PrtFST1SumOfChildrenDParentDebit3\")","Stamdata!$D$85"]
["KvK: Jaarverantwoording 2020 NLGAAP - micro rechtspersonen - publicatiestukken","valueAssertion_BalanceSheetMicroEntities_PrtFST1SumOfChildrenDParentDebit3","`Assets` SHOULD be equal to the summation of the underlying values. ","blocking","IF(OR(not(0=0),not(AND(Stamdata!$F$79=\"\",Stamdata!$F$83=\"\"))),IF( Stamdata!$F$85 = - 0+ sum(Stamdata!$F$79,Stamdata!$F$83),0,1),0)+AssertionId(\"valueAssertion_BalanceSheetMicroEntities_PrtFST1SumOfChildrenDParentDebit3\")","Stamdata!$F$85"]
["KvK: Jaarverantwoording 2020 NLGAAP - micro rechtspersonen - publicatiestukken","valueAssertion_BalanceSheetMicroEntities_PrtFST101Variable1","`EquityAndLiabilities` SHOULD be equal to + `Assets`. ","blocking","IF(+ sum(Stamdata!$D$85) = Stamdata!$D$93 ,0,1)+AssertionId(\"valueAssertion_BalanceSheetMicroEntities_PrtFST101Variable1\")","Stamdata!$D$85"]
["KvK: Jaarverantwoording 2020 NLGAAP - micro rechtspersonen - publicatiestukken","valueAssertion_BalanceSheetMicroEntities_PrtFST101Variable1","`EquityAndLiabilities` SHOULD be equal to + `Assets`. ","blocking","IF(+ sum(Stamdata!$F$85) = Stamdata!$F$93 ,0,1)+AssertionId(\"valueAssertion_BalanceSheetMicroEntities_PrtFST101Variable1\")","Stamdata!$F$85"]
["KvK: Jaarverantwoording 2020 NLGAAP - micro rechtspersonen - publicatiestukken","existenceAssertion_BalanceSheetMicroEntities_PrtExistence1","`BalanceSheetBeforeAfterAppropriationResults` MUST exist at least once.","blocking","IF(NOT(Stamdata!$D$75=\"\"),0,1)+AssertionId(\"existenceAssertion_BalanceSheetMicroEntities_PrtExistence1\")","Stamdata!$D$75"]
["KvK: Jaarverantwoording 2020 NLGAAP - micro rechtspersonen - publicatiestukken","existenceAssertion_BalanceSheetMicroEntities_PrtExistence1","`BalanceSheetBeforeAfterAppropriationResults` MUST exist at least once.","blocking","IF(NOT(Stamdata!$F$75=\"\"),0,1)+AssertionId(\"existenceAssertion_BalanceSheetMicroEntities_PrtExistence1\")","Stamdata!$F$75"]
["KvK: Jaarverantwoording 2020 NLGAAP - micro rechtspersonen - publicatiestukken","existenceAssertion_BalanceSheetMicroEntities_PrtOnlyReportFactPeriodEQParam1","`BalanceSheetBeforeAfterAppropriationResults` SHOULD not exist for any period other than the current period.","blocking","IF(NOT(Stamdata!$D$75=\"\"),0,1)+AssertionId(\"existenceAssertion_BalanceSheetMicroEntities_PrtOnlyReportFactPeriodEQParam1\")","Stamdata!$D$75"]
["KvK: Jaarverantwoording 2020 NLGAAP - micro rechtspersonen - publicatiestukken","existenceAssertion_BalanceSheetMicroEntities_PrtOnlyReportFactPeriodEQParam1","`BalanceSheetBeforeAfterAppropriationResults` SHOULD not exist for any period other than the current period.","blocking","IF(NOT(Stamdata!$F$75=\"\"),0,1)+AssertionId(\"existenceAssertion_BalanceSheetMicroEntities_PrtOnlyReportFactPeriodEQParam1\")","Stamdata!$F$75"]
["KvK: Jaarverantwoording 2020 NLGAAP - micro rechtspersonen - publicatiestukken","valueAssertion_DocumentInformation_PrtDateEarlier24HDateLater1","The date reported for `FinancialReportingPeriodPreviousEndDate` MUST be one day earlier than the date reported for `FinancialReportingPeriodCurrentStartDate`. ","blocking","IF((Stamdata!$D$54)+ 1 = (Stamdata!$D$51),0,1)+AssertionId(\"valueAssertion_DocumentInformation_PrtDateEarlier24HDateLater1\")","Stamdata!$D$51"]
["KvK: Jaarverantwoording 2020 NLGAAP - micro rechtspersonen - publicatiestukken","valueAssertion_DocumentInformation_PrtDateEarlierDateLater1","The date reported for `FinancialReportingPeriodCurrentEndDate` MUST be earlier than the date reported for `DocumentAdoptionDate`. ","blocking","IF(Stamdata!$D$52 < Stamdata!$D$63,0,1)+AssertionId(\"valueAssertion_DocumentInformation_PrtDateEarlierDateLater1\")","Stamdata!$D$63"]
["KvK: Jaarverantwoording 2020 NLGAAP - micro rechtspersonen - publicatiestukken","valueAssertion_DocumentInformation_PrtDateEarlierDateLater2","The date reported for `FinancialReportingPeriodPreviousStartDate` MUST be earlier than the date reported for `FinancialReportingPeriodPreviousEndDate`. ","blocking","IF(Stamdata!$D$53 < Stamdata!$D$54,0,1)+AssertionId(\"valueAssertion_DocumentInformation_PrtDateEarlierDateLater2\")","Stamdata!$D$54"]
["KvK: Jaarverantwoording 2020 NLGAAP - micro rechtspersonen - publicatiestukken","valueAssertion_DocumentInformation_PrtDateEarlierDateLater3","The date reported for `FinancialReportingPeriodCurrentStartDate` MUST be earlier than the date reported for `FinancialReportingPeriodCurrentEndDate`. ","blocking","IF(Stamdata!$D$51 < Stamdata!$D$52,0,1)+AssertionId(\"valueAssertion_DocumentInformation_PrtDateEarlierDateLater3\")","Stamdata!$D$52"]
["KvK: Jaarverantwoording 2020 NLGAAP - micro rechtspersonen - publicatiestukken","valueAssertion_DocumentInformation_PrtDateEarlierEQDateLater1","The date reported for `FinancialStatementsDateOfPreparation` SHOULD be earlier than, or equal to, the date reported for `DocumentAdoptionDate`. ","blocking","IF(Stamdata!$D$61 <= Stamdata!$D$63,0,1)+AssertionId(\"valueAssertion_DocumentInformation_PrtDateEarlierEQDateLater1\")","Stamdata!$D$63"]
["KvK: Jaarverantwoording 2020 NLGAAP - micro rechtspersonen - publicatiestukken","valueAssertion_DocumentInformation_PrtDateEarlierEQYearDateLaterThnValue1","The reported value of `FinancialReportingPeriodDifferentThanAnnualStatus` SHOULD be equal to `Nee`, because the period from `FinancialReportingPeriodCurrentStartDate` to `FinancialReportingPeriodCurrentEndDate` is equal to the standard reporting period of one year. ","blocking","IF(((Stamdata!$D$51) + 365 - xs:dayTimeDuration(\"PT24H) = (Stamdata!$D$52),IF(Stamdata!$D$55 = \"Nee\",0,1),0)+AssertionId(\"valueAssertion_DocumentInformation_PrtDateEarlierEQYearDateLaterThnValue1\")","Stamdata!$D$55"]
["KvK: Jaarverantwoording 2020 NLGAAP - micro rechtspersonen - publicatiestukken","valueAssertion_DocumentInformation_PrtDateEarlierNEYearDateLaterThnValue1","The reported value of `FinancialReportingPeriodDifferentThanAnnualStatus` SHOULD be equal to `Ja`, because the period from `FinancialReportingPeriodCurrentStartDate` to `FinancialReportingPeriodCurrentEndDate` differs from than the standard reporting period of one year. ","blocking","IF(((Stamdata!$D$51) + 365 - xs:dayTimeDuration(\"PT24H) <> (Stamdata!$D$52),IF(Stamdata!$D$55 = \"Ja\",0,1),0)+AssertionId(\"valueAssertion_DocumentInformation_PrtDateEarlierNEYearDateLaterThnValue1\")","Stamdata!$D$55"]
["KvK: Jaarverantwoording 2020 NLGAAP - micro rechtspersonen - publicatiestukken","valueAssertion_DocumentInformation_PrtDateEarlierThanCurrent1","The date reported for `FinancialReportingPeriodCurrentEndDate` SHOULD be earlier than the current date. ","blocking","IF(Stamdata!$D$52 < NOW,0,1)+AssertionId(\"valueAssertion_DocumentInformation_PrtDateEarlierThanCurrent1\")","Stamdata!$D$52"]
["KvK: Jaarverantwoording 2020 NLGAAP - micro rechtspersonen - publicatiestukken","valueAssertion_DocumentInformation_PrtDateEarlierThanEQDateCurrent1","The date reported for `DocumentAdoptionDate` SHOULD be earlier than, or equal to, the current date. ","blocking","IF(Stamdata!$D$63 <= NOW,0,1)+AssertionId(\"valueAssertion_DocumentInformation_PrtDateEarlierThanEQDateCurrent1\")","Stamdata!$D$63"]
["KvK: Jaarverantwoording 2020 NLGAAP - micro rechtspersonen - publicatiestukken","valueAssertion_DocumentInformation_PrtExistenceThnExistence1","`FinancialReportingPeriodPreviousStartDate` SHOULD exist at least once within the same context, because `FinancialReportingPeriodPreviousEndDate` is reported. ","blocking","IF(not(Stamdata!$D$53=\"\"),0,1)+AssertionId(\"valueAssertion_DocumentInformation_PrtExistenceThnExistence1\")","Stamdata!$D$53"]
["KvK: Jaarverantwoording 2020 NLGAAP - micro rechtspersonen - publicatiestukken","valueAssertion_DocumentInformation_PrtExistenceThnExistence2","`FinancialReportingPeriodPreviousEndDate` SHOULD exist at least once within the same context, because `FinancialReportingPeriodPreviousStartDate` is reported. ","blocking","IF(not(Stamdata!$D$54=\"\"),0,1)+AssertionId(\"valueAssertion_DocumentInformation_PrtExistenceThnExistence2\")","Stamdata!$D$54"]
["KvK: Jaarverantwoording 2020 NLGAAP - micro rechtspersonen - publicatiestukken","valueAssertion_DocumentInformation_PrtValueThnExistence1","`FinancialReportingPeriodDifferentThanAnnualReason` SHOULD exist at least once, because the reported value of `FinancialReportingPeriodDifferentThanAnnualStatus` is equal to `Ja`. ","blocking","IF(Stamdata!$D$55 = \"Ja\",IF(not(Stamdata!$D$56=\"\"),0,1),0)+AssertionId(\"valueAssertion_DocumentInformation_PrtValueThnExistence1\")","Stamdata!$D$56"]
["KvK: Jaarverantwoording 2020 NLGAAP - micro rechtspersonen - publicatiestukken","valueAssertion_DocumentInformation_PrtValueThnExistence2","`FinancialReportingPeriodDifferentThanAnnualImpactComparatives` SHOULD exist at least once, because the reported value of `FinancialReportingPeriodDifferentThanAnnualStatus` is equal to `Ja`. ","blocking","IF(Stamdata!$D$55 = \"Ja\",IF(not(Stamdata!$D$57=\"\"),0,1),0)+AssertionId(\"valueAssertion_DocumentInformation_PrtValueThnExistence2\")","Stamdata!$D$57"]
{"$rows_left_out":76}
{"sheet":"XBRL errors","index":4,"n_rows":1,"n_cols":2,"rows_kept":1,"cut":false,"hidden":false,"merged":[]}
["Timestamp","Validation message"]