{"text_format":"1","workbook":"xlsx","n_sheets":5,"sheets":["Stamdata","labels","Enumerations","Pre-validation","XBRL Errors"],"not_rendered":{"charts":0,"images":0,"macros":1,"external_links":0,"defined_names":19,"comments":0,"pivot_tables":0},"unopened":[],"bounds":{"document_bytes":16777216,"sheet_cells":100000,"rows_first":2000,"rows_last":500,"rows_between":2000,"halvings":0,"cell_chars":16384,"cell_head_chars":4096},"cells_cut":0,"cells_raw":0,"read":"whole","date_system":"1900"}

{"sheet":"Stamdata","index":0,"n_rows":1385,"n_cols":33,"rows_kept":1385,"cut":false,"hidden":false,"merged":[[23,3,23,5],[24,3,24,5],[25,3,25,5],[26,3,26,5],[27,3,27,5],[38,3,38,5],[39,3,39,5],[40,3,40,5],[41,3,41,5],[42,3,42,5],[28,3,28,5],[29,3,29,5],[35,3,35,5],[36,3,36,5],[37,3,37,5],[48,3,48,5],[54,3,54,5],[55,3,55,5],[56,3,56,5],[57,3,57,5],[43,3,43,5],[44,3,44,5],[45,3,45,5],[46,3,46,5],[47,3,47,5],[63,3,63,5],[64,3,64,5],[65,3,65,5],[66,3,66,5],[67,3,67,5],[58,3,58,5],[59,3,59,5],[60,3,60,5],[61,3,61,5],[62,3,62,5],[73,3,73,5],[74,3,74,5],[126,3,126,5],[127,3,127,5],[133,3,133,5],[68,3,68,5],[69,3,69,5],[70,3,70,5],[71,3,71,5],[72,3,72,5],[144,3,144,5],[150,3,150,5],[156,3,156,5],[157,3,157,5],[158,3,158,5],[134,3,134,5],[135,3,135,5],[136,3,136,5],[142,3,142,5],[143,3,143,5],[174,3,174,5],[175,3,175,5],[176,3,176,5],[177,3,177,5],[178,3,178,5],[159,3,159,5],[160,3,160,5],[166,3,166,5],[172,3,172,5],[173,3,173,5],[190,3,190,5],[191,3,191,5],[192,3,192,5],[193,3,193,5],[194,3,194,5],[179,3,179,5],[186,3,186,5],[187,3,187,5],[188,3,188,5],[189,3,189,5],[256,3,256,5],[257,3,257,5],[258,3,258,5],[259,3,259,5],[260,3,260,5],[195,3,195,5],[201,3,201,5],[220,3,220,5],[221,3,221,5],[240,3,240,5],[271,3,271,5],[272,3,272,5],[273,3,273,5],[279,3,279,5],[285,3,285,5],[261,3,261,5],[262,3,262,5],[263,3,263,5],[264,3,264,5],[265,3,265,5],[307,3,307,5],[308,3,308,5],[309,3,309,5],[310,3,310,5],[311,3,311,5],[291,3,291,5],[297,3,297,5],[298,3,298,5],[305,3,305,5],[306,3,306,5],[317,3,317,5],[318,3,318,5],[319,3,319,5],[320,3,320,5],[321,3,321,5],[312,3,312,5],[313,3,313,5],[314,3,314,5],[315,3,315,5],[316,3,316,5],[327,3,327,5],[328,3,328,5],[329,3,329,5],[330,3,330,5],[331,3,331,5],[322,3,322,5],[323,3,323,5],[324,3,324,5],[325,3,325,5],[326,3,326,5],[337,3,337,5],[338,3,338,5],[339,3,339,5],[340,3,340,5],[341,3,341,5],[332,3,332,5],[333,3,333,5],[334,3,334,5],[335,3,335,5],[336,3,336,5],[347,3,347,5],[348,3,348,5],[349,3,349,5],[350,3,350,5],[351,3,351,5],[342,3,342,5],[343,3,343,5],[344,3,344,5],[345,3,345,5],[346,3,346,5],[357,3,357,5],[358,3,358,5],[359,3,359,5],[360,3,360,5],[361,3,361,5],[352,3,352,5],[353,3,353,5],[354,3,354,5],[355,3,355,5],[356,3,356,5],[367,3,367,5],[368,3,368,5],[369,3,369,5],[370,3,370,5],[371,3,371,5],[362,3,362,5],[363,3,363,5],[364,3,364,5],[365,3,365,5],[366,3,366,5],[377,3,377,5],[378,3,378,5],[379,3,379,5],[380,3,380,5],[381,3,381,5],[372,3,372,5],[373,3,373,5],[374,3,374,5],[375,3,375,5],[376,3,376,5],[387,3,387,5],[388,3,388,5],[389,3,389,5],[390,3,390,5],[391,3,391,5],[382,3,382,5],[383,3,383,5],[384,3,384,5],[385,3,385,5],[386,3,386,5],[397,3,397,5],[398,3,398,5],[399,3,399,5],[400,3,400,5],[401,3,401,5],[392,3,392,5],[393,3,393,5],[394,3,394,5],[395,3,395,5],[396,3,396,5],[407,3,407,5],[408,3,408,5],[409,3,409,5],[410,3,410,5],[411,3,411,5],[402,3,402,5],[403,3,403,5],[404,3,404,5],[405,3,405,5],[406,3,406,5],[417,3,417,5],[418,3,418,5],[419,3,419,5],[420,3,420,5],[421,3,421,5],[412,3,412,5],[413,3,413,5],[414,3,414,5],[415,3,415,5],[416,3,416,5],[432,3,432,5],[433,3,433,5],[434,3,434,5],[435,3,435,5],[436,3,436,5],[427,3,427,5],[428,3,428,5],[429,3,429,5],[430,3,430,5],[431,3,431,5],[442,3,442,5],[443,3,443,5],[444,3,444,5],[445,3,445,5],[446,3,446,5],[437,3,437,5],[438,3,438,5],[439,3,439,5],[440,3,440,5],[441,3,441,5],[452,3,452,5],[453,3,453,5],[454,3,454,5],[471,3,471,5],[472,3,472,5],[447,3,447,5],[448,3,448,5],[449,3,449,5],[450,3,450,5],[451,3,451,5],[478,3,478,5],[479,3,479,5],[480,3,480,5],[500,3,500,5],[501,3,501,5],[473,3,473,5],[474,3,474,5],[475,3,475,5],[476,3,476,5],[477,3,477,5],[507,3,507,5],[508,3,508,5],[509,3,509,5],[510,3,510,5],[523,3,523,5],[502,3,502,5],[503,3,503,5],[504,3,504,5],[505,3,505,5],[506,3,506,5],[535,3,535,5],[536,3,536,5],[537,3,537,5],[538,3,538,5],[539,3,539,5],[524,3,524,5],[525,3,525,5],[526,3,526,5],[527,3,527,5],[528,3,528,5],[557,3,557,5],[558,3,558,5],[559,3,559,5],[560,3,560,5],[561,3,561,5],[540,3,540,5],[553,3,553,5],[554,3,554,5],[555,3,555,5],[556,3,556,5],[595,3,595,5],[611,3,611,5],[612,3,612,5],[619,3,619,5],[620,3,620,5],[575,3,575,5],[591,3,591,5],[592,3,592,5],[593,3,593,5],[594,3,594,5],[684,3,684,5],[685,3,685,5],[686,3,686,5],[687,3,687,5],[711,3,711,5],[627,3,627,5],[628,3,628,5],[629,3,629,5],[630,3,630,5],[631,3,631,5],[808,3,808,5],[814,3,814,5],[820,3,820,5],[826,3,826,5],[833,3,833,5],[766,3,766,5],[767,3,767,5],[790,3,790,5],[796,3,796,5],[802,3,802,5],[839,3,839,5],[840,3,840,5],[841,3,841,5],[842,3,842,5],[843,3,843,5],[834,3,834,5],[835,3,835,5],[836,3,836,5],[837,3,837,5],[838,3,838,5],[849,3,849,5],[855,3,855,5],[871,3,871,5],[872,3,872,5],[873,3,873,5],[844,3,844,5],[845,3,845,5],[846,3,846,5],[847,3,847,5],[848,3,848,5],[879,3,879,5],[880,3,880,5],[894,3,894,5],[895,3,895,5],[896,3,896,5],[874,3,874,5],[875,3,875,5],[876,3,876,5],[877,3,877,5],[878,3,878,5],[914,3,914,5],[915,3,915,5],[916,3,916,5],[917,3,917,5],[918,3,918,5],[897,3,897,5],[910,3,910,5],[911,3,911,5],[912,3,912,5],[913,3,913,5],[924,3,924,5],[925,3,925,5],[926,3,926,5],[927,3,927,5],[928,3,928,5],[919,3,919,5],[920,3,920,5],[921,3,921,5],[922,3,922,5],[923,3,923,5],[981,3,981,5],[996,3,996,5],[997,3,997,5],[998,3,998,5],[999,3,999,5],[929,3,929,5],[960,3,960,5],[978,3,978,5],[979,3,979,5],[980,3,980,5],[1005,3,1005,5],[1006,3,1006,5],[1022,3,1022,5],[1029,3,1029,5],[1030,3,1030,5],[1000,3,1000,5],[1001,3,1001,5],[1002,3,1002,5],[1003,3,1003,5],[1004,3,1004,5],[1335,3,1335,5],[1342,3,1342,5],[1343,3,1343,5],[1344,3,1344,5],[1345,3,1345,5],[1031,3,1031,5],[1032,3,1032,5],[1331,3,1331,5],[1332,3,1332,5],[1333,3,1333,5],[1367,3,1367,5],[1368,3,1368,5],[1351,3,1351,5],[1352,3,1352,5],[1353,3,1353,5],[1360,3,1360,5],[1361,3,1361,5],[1346,3,1346,5],[1347,3,1347,5],[1348,3,1348,5],[1349,3,1349,5],[1350,3,1350,5]]}
["",null,null,{"$f":"IF(D63=\"Fiscaal\",\"Fiscal\",\"Commercial\")","v":"Commercial"}]
["","Conversion info"]
["",null,null,null,null,null,null,null,null,null,null,null,null,null,null,null,null,null,null,null,null,null,null,null,null,{"$f":"\"/entity-information label {\"&COLUMN(B22)&\"}\"","v":"/entity-information label {2}"},null,{"$f":"\"/entity-information   {\"&COLUMN(D22)&\"}\"","v":"/entity-information   {4}"}]
["","",null,"NL NT 16.0"]
["","",null,"EN"]
["","entrypoint",null,"KvK: Jaarverantwoording 2021 NLGAAP - kleine rechtspersonen - publicatiestukken"]
["","identifier scheme",null,"http://www.kvk.nl/kvk-id"]
["","Vorigvorig jaar"]
["","",null,0]
["","",null,0]
["","",null,"INF"]
["","",null,"INF"]
["","",null,"FALSE"]
["","",null,"TRUE"]
["",null,null,"TRUE"]
[""]
[""]
[""]
["",{"$f":"INDEX(labels!A2:C2,1,MATCH(PP_Language,labels!A1:C1,0))","v":"Document and entity information"}]
["",{"$f":"INDEX(labels!A3:C3,1,MATCH(PP_Language,labels!A1:C1,0))","v":"Entity information"}]
{"$rows_left_out":1366}
{"sheet":"labels","index":1,"n_rows":746,"n_cols":3,"rows_kept":746,"cut":false,"hidden":true,"merged":[]}
["id","en","nl"]
[0,"Document and entity information","Informatie over de rapportage en de rechtspersoon"]
[1,"Entity information","Informatie over de rechtspersoon"]
[2,"Name of the legal entity","Naam van de rechtspersoon"]
[3,"Legal form of the legal entity","Rechtsvorm van de rechtspersoon"]
[4,"Registered office of the legal entity","Zetel van de rechtspersoon"]
[5,"Registration number at the Chamber of Commerce","Registratienummer bij de Kamer van Koophandel"]
[6,"Business names","Handelsnamen"]
[7,"Classification of the legal entity based on the legal size criteria small","Classificatie van de rechtspersoon op basis van de wettelijke groottecriteria klein"]
[8,"SBI-code","SBI-code"]
[9,"Address of the legal entity","Adres van de rechtspersoon"]
[10,"Description of location NL","Locatieomschrijving NL"]
[11,"Street name NL","Straatnaam NL"]
[12,"House number NL","Huisnummer NL"]
[13,"House number addition","Huisnummer toevoeging"]
[14,"PO box number","Postbusnummer"]
[15,"Postal code NL","Postcode NL"]
[16,"Place of residence NL","Vestigingsplaats NL"]
[17,"Description of location abroad","Locatieomschrijving buitenland"]
[18,"Street name abroad","Straatnaam buitenland"]
{"$rows_left_out":727}
{"sheet":"Enumerations","index":2,"n_rows":934,"n_cols":173,"rows_kept":934,"cut":false,"hidden":true,"merged":[]}
["Besloten vennootschap met beperkte aansprakelijkheid",null,"Klein",null,"0111",null,"Ja",null,"Commercieel",null,"AED",null,"Ja",null,"Ja",null,"Ja",null,"Enkelvoudig",null,"Na",null,"Na",null,"Ja",null,"Ja",null,"Ja",null,"Ja",null,"Ja",null,"Ja",null,"Ja",null,"Ja",null,"Ja",null,"Ja",null,"Ja",null,"Ja",null,"Ja",null,"Ja",null,"Ja",null,"Ja",null,"Ja",null,"Ja",null,"Ja",null,"Ja",null,"Ja",null,"Ja",null,"Ja",null,"Ja",null,"Ja",null,"Ja",null,"Ja",null,"Ja",null,"Ja",null,"Ja",null,"Ja",null,"Ja",null,"Ja",null,"Ja",null,"Ja",null,"Ja",null,"Ja",null,"Ja",null,"Ja",null,"Ja",null,"Ja",null,"Ja",null,"Ja",null,"Ja",null,"Ja",null,"Ja",null,"Ja",null,"Ja",null,"Ja",null,"Ja",null,"Ja",null,"Ja",null,"Ja",null,"Ja",null,"Ja",null,"Ja",null,"Ja",null,"Ja",null,"Ja",null,"Ja",null,"Ja",null,"Ja",null,"Ja",null,"Ja",null,"Ja",null,"Bestuurder (huidig)",null,"Bestuurder (huidig)",null,"Bestuurder (huidig)",null,"Bestuurder (huidig)",null,"Bestuurder (huidig)",null,"Ja",null,"Ja",null,"Ja",null,"Ja",null,"Ja"]
["Commanditaire vennootschap",null,"Micro",null,"0116",null,"Nee",null,"Fiscaal",null,"AFN",null,"Nee",null,"Nee",null,"Nee",null,"Geconsolideerd en enkelvoudig",null,"Voor",null,"Voor",null,"Nee",null,"Nee",null,"Nee",null,"Nee",null,"Nee",null,"Nee",null,"Nee",null,"Nee",null,"Nee",null,"Nee",null,"Nee",null,"Nee",null,"Nee",null,"Nee",null,"Nee",null,"Nee",null,"Nee",null,"Nee",null,"Nee",null,"Nee",null,"Nee",null,"Nee",null,"Nee",null,"Nee",null,"Nee",null,"Nee",null,"Nee",null,"Nee",null,"Nee",null,"Nee",null,"Nee",null,"Nee",null,"Nee",null,"Nee",null,"Nee",null,"Nee",null,"Nee",null,"Nee",null,"Nee",null,"Nee",null,"Nee",null,"Nee",null,"Nee",null,"Nee",null,"Nee",null,"Nee",null,"Nee",null,"Nee",null,"Nee",null,"Nee",null,"Nee",null,"Nee",null,"Nee",null,"Nee",null,"Nee",null,"Nee",null,"Nee",null,"Nee",null,"Nee",null,"Nee",null,"Nee",null,"Nee",null,"Nee",null,"Nee",null,"Nee",null,"Bestuurder (voormalig)",null,"Bestuurder (voormalig)",null,"Bestuurder (voormalig)",null,"Bestuurder (voormalig)",null,"Bestuurder (voormalig)",null,"Nee",null,"Nee",null,"Nee",null,"Nee",null,"Nee"]
["Cooperatie",null,null,null,"0121",null,null,null,null,null,"ALL",null,null,null,null,null,null,null,"Geconsolideerd",null,null,null,null,null,null,null,null,null,null,null,null,null,null,null,null,null,null,null,null,null,null,null,null,null,null,null,null,null,null,null,null,null,null,null,null,null,null,null,null,null,null,null,null,null,null,null,null,null,null,null,null,null,null,null,null,null,null,null,null,null,null,null,null,null,null,null,null,null,null,null,null,null,null,null,null,null,null,null,null,null,null,null,null,null,null,null,null,null,null,null,null,null,null,null,null,null,null,null,null,null,null,null,null,null,null,null,null,null,null,null,null,null,null,null,null,null,null,null,null,null,null,null,null,null,null,null,null,null,null,null,null,null,null,null,"Commissaris (huidig)",null,"Commissaris (huidig)",null,"Commissaris (huidig)",null,"Commissaris (huidig)",null,"Commissaris (huidig)"]
["Naamloze vennootschap",null,null,null,"0127",null,null,null,null,null,"AMD",null,null,null,null,null,null,null,"Jaarrekening andere rechtspersoon",null,null,null,null,null,null,null,null,null,null,null,null,null,null,null,null,null,null,null,null,null,null,null,null,null,null,null,null,null,null,null,null,null,null,null,null,null,null,null,null,null,null,null,null,null,null,null,null,null,null,null,null,null,null,null,null,null,null,null,null,null,null,null,null,null,null,null,null,null,null,null,null,null,null,null,null,null,null,null,null,null,null,null,null,null,null,null,null,null,null,null,null,null,null,null,null,null,null,null,null,null,null,null,null,null,null,null,null,null,null,null,null,null,null,null,null,null,null,null,null,null,null,null,null,null,null,null,null,null,null,null,null,null,null,null,"Commissaris (voormalig)",null,"Commissaris (voormalig)",null,"Commissaris (voormalig)",null,"Commissaris (voormalig)",null,"Commissaris (voormalig)"]
["Onderlinge waarborgmaatschappij",null,null,null,"0128",null,null,null,null,null,"ANG"]
["Stichting",null,null,null,"0129",null,null,null,null,null,"AOA"]
["Vennootschap onder firma",null,null,null,"0143",null,null,null,null,null,"ARS"]
["Vereniging",null,null,null,"0150",null,null,null,null,null,"AUD"]
[null,null,null,null,"0161",null,null,null,null,null,"AWG"]
[null,null,null,null,"0162",null,null,null,null,null,"AZN"]
[null,null,null,null,"0163",null,null,null,null,null,"BAM"]
[null,null,null,null,"0164",null,null,null,null,null,"BBD"]
[null,null,null,null,"0170",null,null,null,null,null,"BDT"]
[null,null,null,null,"0210",null,null,null,null,null,"BGN"]
[null,null,null,null,"0220",null,null,null,null,null,"BHD"]
[null,null,null,null,"0240",null,null,null,null,null,"BIF"]
[null,null,null,null,"0311",null,null,null,null,null,"BMD"]
[null,null,null,null,"0312",null,null,null,null,null,"BND"]
[null,null,null,null,"0321",null,null,null,null,null,"BOB"]
[null,null,null,null,"0322",null,null,null,null,null,"BOV"]
{"$rows_left_out":915}
{"sheet":"Pre-validation","index":3,"n_rows":268,"n_cols":6,"rows_kept":268,"cut":false,"hidden":true,"merged":[]}
[{"$f":"IF(NOT(Stamdata!H1381=\"\"),0,1)+AssertionId(\"existenceAssertion_SigningFinancialStatements_PrtExistence1\")","v":1}]
["KvK: Jaarverantwoording 2021 NLGAAP - kleine rechtspersonen - publicatiestukken","valueAssertion_BalanceSheet_PrtFST1SumOfChildrenDParentCredit1","`Equity` SHOULD be equal to the summation of the underlying values. ","non-blocking","IF(OR(not(AND(Stamdata!D102=\"\",Stamdata!D103=\"\",Stamdata!D104=\"\",Stamdata!D105=\"\",Stamdata!D106=\"\",Stamdata!D107=\"\",Stamdata!D108=\"\",Stamdata!D109=\"\",Stamdata!D110=\"\",Stamdata!D111=\"\")),not(0=0)),IF( Stamdata!D112 = sum(Stamdata!D102,Stamdata!D103,Stamdata!D104,Stamdata!D105,Stamdata!D106,Stamdata!D107,Stamdata!D108,Stamdata!D109,Stamdata!D110,Stamdata!D111),0,1),0)+AssertionId(\"valueAssertion_BalanceSheet_PrtFST1SumOfChildrenDParentCredit1\")","Stamdata!D112"]
["KvK: Jaarverantwoording 2021 NLGAAP - kleine rechtspersonen - publicatiestukken","valueAssertion_BalanceSheet_PrtFST1SumOfChildrenDParentCredit1","`Equity` SHOULD be equal to the summation of the underlying values. ","non-blocking","IF(OR(not(AND(Stamdata!F102=\"\",Stamdata!F103=\"\",Stamdata!F104=\"\",Stamdata!F105=\"\",Stamdata!F106=\"\",Stamdata!F107=\"\",Stamdata!F108=\"\",Stamdata!F109=\"\",Stamdata!F110=\"\",Stamdata!F111=\"\")),not(0=0)),IF( Stamdata!F112 = sum(Stamdata!F102,Stamdata!F103,Stamdata!F104,Stamdata!F105,Stamdata!F106,Stamdata!F107,Stamdata!F108,Stamdata!F109,Stamdata!F110,Stamdata!F111),0,1),0)+AssertionId(\"valueAssertion_BalanceSheet_PrtFST1SumOfChildrenDParentCredit1\")","Stamdata!F112"]
["KvK: Jaarverantwoording 2021 NLGAAP - kleine rechtspersonen - publicatiestukken","valueAssertion_BalanceSheet_PrtFST1SumOfChildrenDParentCredit2","`EquityAndLiabilities` SHOULD be equal to the summation of the underlying values. ","non-blocking","IF(OR(not(AND(Stamdata!D112=\"\",Stamdata!D114=\"\",Stamdata!D115=\"\",Stamdata!D116=\"\")),not(0=0)),IF( Stamdata!D117 = sum(Stamdata!D112,Stamdata!D114,Stamdata!D115,Stamdata!D116),0,1),0)+AssertionId(\"valueAssertion_BalanceSheet_PrtFST1SumOfChildrenDParentCredit2\")","Stamdata!D117"]
["KvK: Jaarverantwoording 2021 NLGAAP - kleine rechtspersonen - publicatiestukken","valueAssertion_BalanceSheet_PrtFST1SumOfChildrenDParentCredit2","`EquityAndLiabilities` SHOULD be equal to the summation of the underlying values. ","non-blocking","IF(OR(not(AND(Stamdata!F112=\"\",Stamdata!F114=\"\",Stamdata!F115=\"\",Stamdata!F116=\"\")),not(0=0)),IF( Stamdata!F117 = sum(Stamdata!F112,Stamdata!F114,Stamdata!F115,Stamdata!F116),0,1),0)+AssertionId(\"valueAssertion_BalanceSheet_PrtFST1SumOfChildrenDParentCredit2\")","Stamdata!F117"]
["KvK: Jaarverantwoording 2021 NLGAAP - kleine rechtspersonen - publicatiestukken","valueAssertion_BalanceSheet_PrtFST1SumOfChildrenDParentDebit1","`AssetsNoncurrent` SHOULD be equal to the summation of the underlying values. ","non-blocking","IF(OR(not(0=0),not(AND(Stamdata!D87=\"\",Stamdata!D88=\"\",Stamdata!D89=\"\",Stamdata!D90=\"\"))),IF( Stamdata!D91 = + sum(Stamdata!D87,Stamdata!D88,Stamdata!D89,Stamdata!D90),0,1),0)+AssertionId(\"valueAssertion_BalanceSheet_PrtFST1SumOfChildrenDParentDebit1\")","Stamdata!D91"]
["KvK: Jaarverantwoording 2021 NLGAAP - kleine rechtspersonen - publicatiestukken","valueAssertion_BalanceSheet_PrtFST1SumOfChildrenDParentDebit1","`AssetsNoncurrent` SHOULD be equal to the summation of the underlying values. ","non-blocking","IF(OR(not(0=0),not(AND(Stamdata!F87=\"\",Stamdata!F88=\"\",Stamdata!F89=\"\",Stamdata!F90=\"\"))),IF( Stamdata!F91 = + sum(Stamdata!F87,Stamdata!F88,Stamdata!F89,Stamdata!F90),0,1),0)+AssertionId(\"valueAssertion_BalanceSheet_PrtFST1SumOfChildrenDParentDebit1\")","Stamdata!F91"]
["KvK: Jaarverantwoording 2021 NLGAAP - kleine rechtspersonen - publicatiestukken","valueAssertion_BalanceSheet_PrtFST1SumOfChildrenDParentDebit2","`AssetsCurrent` SHOULD be equal to the summation of the underlying values. ","non-blocking","IF(OR(not(0=0),not(AND(Stamdata!D93=\"\",Stamdata!D94=\"\",Stamdata!D95=\"\",Stamdata!D96=\"\",Stamdata!D97=\"\"))),IF( Stamdata!D98 = + sum(Stamdata!D93,Stamdata!D94,Stamdata!D95,Stamdata!D96,Stamdata!D97),0,1),0)+AssertionId(\"valueAssertion_BalanceSheet_PrtFST1SumOfChildrenDParentDebit2\")","Stamdata!D98"]
["KvK: Jaarverantwoording 2021 NLGAAP - kleine rechtspersonen - publicatiestukken","valueAssertion_BalanceSheet_PrtFST1SumOfChildrenDParentDebit2","`AssetsCurrent` SHOULD be equal to the summation of the underlying values. ","non-blocking","IF(OR(not(0=0),not(AND(Stamdata!F93=\"\",Stamdata!F94=\"\",Stamdata!F95=\"\",Stamdata!F96=\"\",Stamdata!F97=\"\"))),IF( Stamdata!F98 = + sum(Stamdata!F93,Stamdata!F94,Stamdata!F95,Stamdata!F96,Stamdata!F97),0,1),0)+AssertionId(\"valueAssertion_BalanceSheet_PrtFST1SumOfChildrenDParentDebit2\")","Stamdata!F98"]
["KvK: Jaarverantwoording 2021 NLGAAP - kleine rechtspersonen - publicatiestukken","valueAssertion_BalanceSheet_PrtFST1SumOfChildrenDParentDebit3","`Assets` SHOULD be equal to the summation of the underlying values. ","non-blocking","IF(OR(not(0=0),not(AND(Stamdata!D91=\"\",Stamdata!D98=\"\"))),IF( Stamdata!D100 = + sum(Stamdata!D91,Stamdata!D98),0,1),0)+AssertionId(\"valueAssertion_BalanceSheet_PrtFST1SumOfChildrenDParentDebit3\")","Stamdata!D100"]
["KvK: Jaarverantwoording 2021 NLGAAP - kleine rechtspersonen - publicatiestukken","valueAssertion_BalanceSheet_PrtFST1SumOfChildrenDParentDebit3","`Assets` SHOULD be equal to the summation of the underlying values. ","non-blocking","IF(OR(not(0=0),not(AND(Stamdata!F91=\"\",Stamdata!F98=\"\"))),IF( Stamdata!F100 = + sum(Stamdata!F91,Stamdata!F98),0,1),0)+AssertionId(\"valueAssertion_BalanceSheet_PrtFST1SumOfChildrenDParentDebit3\")","Stamdata!F100"]
["KvK: Jaarverantwoording 2021 NLGAAP - kleine rechtspersonen - publicatiestukken","valueAssertion_BalanceSheet_PrtFST101Variable1","`EquityAndLiabilities` SHOULD be equal to + `Assets`. ","non-blocking","IF(+ Stamdata!D100 = Stamdata!D117 ,0,1)+AssertionId(\"valueAssertion_BalanceSheet_PrtFST101Variable1\")","Stamdata!D100"]
["KvK: Jaarverantwoording 2021 NLGAAP - kleine rechtspersonen - publicatiestukken","valueAssertion_BalanceSheet_PrtFST101Variable1","`EquityAndLiabilities` SHOULD be equal to + `Assets`. ","non-blocking","IF(+ Stamdata!F100 = Stamdata!F117 ,0,1)+AssertionId(\"valueAssertion_BalanceSheet_PrtFST101Variable1\")","Stamdata!F100"]
["KvK: Jaarverantwoording 2021 NLGAAP - kleine rechtspersonen - publicatiestukken","valueAssertion_BalanceSheet_PrtValueThnNoExistenceCovA1","`ResultForTheYear` SHOULD NOT be reported, because the reported value of `BalanceSheetBeforeAfterAppropriationResults` is equal to `Na`. ","non-blocking","IF(Stamdata!D85 = \"Na\",IF(Stamdata!D110=\"\",0,1),0)+AssertionId(\"valueAssertion_BalanceSheet_PrtValueThnNoExistenceCovA1\")","Stamdata!D110"]
["KvK: Jaarverantwoording 2021 NLGAAP - kleine rechtspersonen - publicatiestukken","valueAssertion_BalanceSheet_PrtValueThnNoExistenceCovA1","`ResultForTheYear` SHOULD NOT be reported, because the reported value of `BalanceSheetBeforeAfterAppropriationResults` is equal to `Na`. ","non-blocking","IF(Stamdata!F85 = \"Na\",IF(Stamdata!F110=\"\",0,1),0)+AssertionId(\"valueAssertion_BalanceSheet_PrtValueThnNoExistenceCovA1\")","Stamdata!F110"]
["KvK: Jaarverantwoording 2021 NLGAAP - kleine rechtspersonen - publicatiestukken","existenceAssertion_BalanceSheet_PrtOnlyReportFactPeriodEQParam1","`BalanceSheetBeforeAfterAppropriationResults` SHOULD not exist for any period other than the current period.","non-blocking","IF(NOT(Stamdata!D85=\"\"),0,1)+AssertionId(\"existenceAssertion_BalanceSheet_PrtOnlyReportFactPeriodEQParam1\")","Stamdata!D85"]
["KvK: Jaarverantwoording 2021 NLGAAP - kleine rechtspersonen - publicatiestukken","existenceAssertion_BalanceSheet_PrtOnlyReportFactPeriodEQParam1","`BalanceSheetBeforeAfterAppropriationResults` SHOULD not exist for any period other than the current period.","non-blocking","IF(NOT(Stamdata!F85=\"\"),0,1)+AssertionId(\"existenceAssertion_BalanceSheet_PrtOnlyReportFactPeriodEQParam1\")","Stamdata!F85"]
["KvK: Jaarverantwoording 2021 NLGAAP - kleine rechtspersonen - publicatiestukken","valueAssertion_DocumentInformation_PrtDateEarlier24HDateLater1","The date reported for `FinancialReportingPeriodPreviousEndDate` MUST be one day earlier than the date reported for `FinancialReportingPeriodCurrentStartDate`. ","blocking","IF((Stamdata!D59)+ 1 = (Stamdata!D56),0,1)+AssertionId(\"valueAssertion_DocumentInformation_PrtDateEarlier24HDateLater1\")","Stamdata!D56"]
["KvK: Jaarverantwoording 2021 NLGAAP - kleine rechtspersonen - publicatiestukken","valueAssertion_DocumentInformation_PrtDateEarlierDateLater1","The date reported for `FinancialReportingPeriodCurrentEndDate` MUST be earlier than the date reported for `DocumentAdoptionDate`. ","blocking","IF(Stamdata!D57 < Stamdata!D68,0,1)+AssertionId(\"valueAssertion_DocumentInformation_PrtDateEarlierDateLater1\")","Stamdata!D68"]
["KvK: Jaarverantwoording 2021 NLGAAP - kleine rechtspersonen - publicatiestukken","valueAssertion_DocumentInformation_PrtDateEarlierDateLater2","The date reported for `FinancialReportingPeriodPreviousStartDate` MUST be earlier than the date reported for `FinancialReportingPeriodPreviousEndDate`. ","blocking","IF(Stamdata!D58 < Stamdata!D59,0,1)+AssertionId(\"valueAssertion_DocumentInformation_PrtDateEarlierDateLater2\")","Stamdata!D59"]
{"$rows_left_out":249}
{"sheet":"XBRL Errors","index":4,"n_rows":1,"n_cols":2,"rows_kept":1,"cut":false,"hidden":false,"merged":[]}
["timestamp","Error"]