{"text_format":"1","workbook":"xlsx","n_sheets":5,"sheets":["Stamdata","labels","Enumerations","Pre-validation","XBRL Errors"],"not_rendered":{"charts":0,"images":0,"macros":1,"external_links":0,"defined_names":22,"comments":0,"pivot_tables":0},"unopened":[],"bounds":{"document_bytes":16777216,"sheet_cells":100000,"rows_first":2000,"rows_last":500,"rows_between":2000,"halvings":0,"cell_chars":16384,"cell_head_chars":4096},"cells_cut":0,"cells_raw":0,"read":"whole","date_system":"1900"}

{"sheet":"Stamdata","index":0,"n_rows":1409,"n_cols":33,"rows_kept":1409,"cut":false,"hidden":false,"merged":[[1385,3,1385,5],[1391,3,1391,5],[1392,3,1392,5],[1374,3,1374,5],[1375,3,1375,5],[1376,3,1376,5],[1377,3,1377,5],[1384,3,1384,5],[1369,3,1369,5],[1370,3,1370,5],[1371,3,1371,5],[1372,3,1372,5],[1373,3,1373,5],[1357,3,1357,5],[1359,3,1359,5],[1366,3,1366,5],[1367,3,1367,5],[1368,3,1368,5],[1058,3,1058,5],[1059,3,1059,5],[1060,3,1060,5],[1355,3,1355,5],[1356,3,1356,5],[1032,3,1032,5],[1033,3,1033,5],[1034,3,1034,5],[1050,3,1050,5],[1057,3,1057,5],[1027,3,1027,5],[1028,3,1028,5],[1029,3,1029,5],[1030,3,1030,5],[1031,3,1031,5],[1008,3,1008,5],[1009,3,1009,5],[1024,3,1024,5],[1025,3,1025,5],[1026,3,1026,5],[986,3,986,5],[987,3,987,5],[1005,3,1005,5],[1006,3,1006,5],[1007,3,1007,5],[951,3,951,5],[952,3,952,5],[953,3,953,5],[984,3,984,5],[985,3,985,5],[946,3,946,5],[947,3,947,5],[948,3,948,5],[949,3,949,5],[950,3,950,5],[941,3,941,5],[942,3,942,5],[943,3,943,5],[944,3,944,5],[945,3,945,5],[936,3,936,5],[937,3,937,5],[938,3,938,5],[939,3,939,5],[940,3,940,5],[919,3,919,5],[920,3,920,5],[921,3,921,5],[934,3,934,5],[935,3,935,5],[900,3,900,5],[901,3,901,5],[902,3,902,5],[903,3,903,5],[918,3,918,5],[895,3,895,5],[896,3,896,5],[897,3,897,5],[898,3,898,5],[899,3,899,5],[870,3,870,5],[871,3,871,5],[872,3,872,5],[878,3,878,5],[894,3,894,5],[865,3,865,5],[866,3,866,5],[867,3,867,5],[868,3,868,5],[869,3,869,5],[860,3,860,5],[861,3,861,5],[862,3,862,5],[863,3,863,5],[864,3,864,5],[855,3,855,5],[856,3,856,5],[857,3,857,5],[858,3,858,5],[859,3,859,5],[823,3,823,5],[829,3,829,5],[835,3,835,5],[842,3,842,5],[848,3,848,5],[731,3,731,5],[786,3,786,5],[787,3,787,5],[810,3,810,5],[817,3,817,5],[651,3,651,5],[704,3,704,5],[705,3,705,5],[706,3,706,5],[707,3,707,5],[640,3,640,5],[647,3,647,5],[648,3,648,5],[649,3,649,5],[650,3,650,5],[614,3,614,5],[615,3,615,5],[631,3,631,5],[632,3,632,5],[639,3,639,5],[577,3,577,5],[595,3,595,5],[611,3,611,5],[612,3,612,5],[613,3,613,5],[572,3,572,5],[573,3,573,5],[574,3,574,5],[575,3,575,5],[576,3,576,5],[549,3,549,5],[550,3,550,5],[569,3,569,5],[570,3,570,5],[571,3,571,5],[538,3,538,5],[545,3,545,5],[546,3,546,5],[547,3,547,5],[548,3,548,5],[533,3,533,5],[534,3,534,5],[535,3,535,5],[536,3,536,5],[537,3,537,5],[516,3,516,5],[517,3,517,5],[518,3,518,5],[519,3,519,5],[520,3,520,5],[511,3,511,5],[512,3,512,5],[513,3,513,5],[514,3,514,5],[515,3,515,5],[479,3,479,5],[480,3,480,5],[481,3,481,5],[482,3,482,5],[510,3,510,5],[474,3,474,5],[475,3,475,5],[476,3,476,5],[477,3,477,5],[478,3,478,5],[453,3,453,5],[454,3,454,5],[455,3,455,5],[456,3,456,5],[473,3,473,5],[448,3,448,5],[449,3,449,5],[450,3,450,5],[451,3,451,5],[452,3,452,5],[443,3,443,5],[444,3,444,5],[445,3,445,5],[446,3,446,5],[447,3,447,5],[438,3,438,5],[439,3,439,5],[440,3,440,5],[441,3,441,5],[442,3,442,5],[433,3,433,5],[434,3,434,5],[435,3,435,5],[436,3,436,5],[437,3,437,5],[428,3,428,5],[429,3,429,5],[430,3,430,5],[431,3,431,5],[432,3,432,5],[418,3,418,5],[419,3,419,5],[420,3,420,5],[421,3,421,5],[422,3,422,5],[413,3,413,5],[414,3,414,5],[415,3,415,5],[416,3,416,5],[417,3,417,5],[408,3,408,5],[409,3,409,5],[410,3,410,5],[411,3,411,5],[412,3,412,5],[403,3,403,5],[404,3,404,5],[405,3,405,5],[406,3,406,5],[407,3,407,5],[398,3,398,5],[399,3,399,5],[400,3,400,5],[401,3,401,5],[402,3,402,5],[393,3,393,5],[394,3,394,5],[395,3,395,5],[396,3,396,5],[397,3,397,5],[388,3,388,5],[389,3,389,5],[390,3,390,5],[391,3,391,5],[392,3,392,5],[383,3,383,5],[384,3,384,5],[385,3,385,5],[386,3,386,5],[387,3,387,5],[378,3,378,5],[379,3,379,5],[380,3,380,5],[381,3,381,5],[382,3,382,5],[373,3,373,5],[374,3,374,5],[375,3,375,5],[376,3,376,5],[377,3,377,5],[368,3,368,5],[369,3,369,5],[370,3,370,5],[371,3,371,5],[372,3,372,5],[363,3,363,5],[364,3,364,5],[365,3,365,5],[366,3,366,5],[367,3,367,5],[358,3,358,5],[359,3,359,5],[360,3,360,5],[361,3,361,5],[362,3,362,5],[353,3,353,5],[354,3,354,5],[355,3,355,5],[356,3,356,5],[357,3,357,5],[348,3,348,5],[349,3,349,5],[350,3,350,5],[351,3,351,5],[352,3,352,5],[343,3,343,5],[344,3,344,5],[345,3,345,5],[346,3,346,5],[347,3,347,5],[338,3,338,5],[339,3,339,5],[340,3,340,5],[341,3,341,5],[342,3,342,5],[333,3,333,5],[334,3,334,5],[335,3,335,5],[336,3,336,5],[337,3,337,5],[328,3,328,5],[329,3,329,5],[330,3,330,5],[331,3,331,5],[332,3,332,5],[323,3,323,5],[324,3,324,5],[325,3,325,5],[326,3,326,5],[327,3,327,5],[318,3,318,5],[319,3,319,5],[320,3,320,5],[321,3,321,5],[322,3,322,5],[313,3,313,5],[314,3,314,5],[315,3,315,5],[316,3,316,5],[317,3,317,5],[308,3,308,5],[309,3,309,5],[310,3,310,5],[311,3,311,5],[312,3,312,5],[297,3,297,5],[298,3,298,5],[299,3,299,5],[306,3,306,5],[307,3,307,5],[272,3,272,5],[273,3,273,5],[279,3,279,5],[285,3,285,5],[291,3,291,5],[262,3,262,5],[263,3,263,5],[264,3,264,5],[265,3,265,5],[271,3,271,5],[257,3,257,5],[258,3,258,5],[259,3,259,5],[260,3,260,5],[261,3,261,5],[201,3,201,5],[220,3,220,5],[221,3,221,5],[240,3,240,5],[256,3,256,5],[191,3,191,5],[192,3,192,5],[193,3,193,5],[194,3,194,5],[195,3,195,5],[186,3,186,5],[187,3,187,5],[188,3,188,5],[189,3,189,5],[190,3,190,5],[175,3,175,5],[176,3,176,5],[177,3,177,5],[178,3,178,5],[179,3,179,5],[160,3,160,5],[166,3,166,5],[172,3,172,5],[173,3,173,5],[174,3,174,5],[150,3,150,5],[156,3,156,5],[157,3,157,5],[158,3,158,5],[159,3,159,5],[135,3,135,5],[136,3,136,5],[142,3,142,5],[143,3,143,5],[144,3,144,5],[74,3,74,5],[126,3,126,5],[127,3,127,5],[133,3,133,5],[134,3,134,5],[69,3,69,5],[70,3,70,5],[71,3,71,5],[72,3,72,5],[73,3,73,5],[65,3,65,5],[66,3,66,5],[67,3,67,5],[68,3,68,5],[56,3,56,5],[42,3,42,5],[43,3,43,5],[44,3,44,5],[45,3,45,5],[46,3,46,5],[62,3,62,5],[63,3,63,5],[64,3,64,5],[57,3,57,5],[58,3,58,5],[59,3,59,5],[60,3,60,5],[61,3,61,5],[41,3,41,5],[28,3,28,5],[29,3,29,5],[35,3,35,5],[36,3,36,5],[47,3,47,5],[48,3,48,5],[54,3,54,5],[55,3,55,5],[23,3,23,5],[24,3,24,5],[25,3,25,5],[26,3,26,5],[27,3,27,5],[37,3,37,5],[38,3,38,5],[39,3,39,5],[40,3,40,5]]}
["",null,null,{"$f":"IF(D63=\"Fiscaal\",\"Fiscal\",\"Commercial\")","v":"Commercial"}]
["","Conversion info"]
["",null,null,null,null,null,null,null,null,null,null,null,null,null,null,null,null,null,null,null,null,null,null,null,null,"/General data label {2}","/General data value {4}"]
["","",null,"NL NT 18.0"]
["","",null,"nl"]
["","entrypoint",null,"KvK: Jaarverantwoording 2023 NLGAAP - kleine rechtspersonen - publicatiestukken"]
["","identifier scheme",null,"http://www.kvk.nl/kvk-id"]
["","Vorigvorig jaar",null,{"$f":"DATE(YEAR(D59)-1,MONTH(D59),DAY(D59))","v":"3798-12-31"}]
["","",null,0]
["","",null,0]
["","",null,"INF"]
["","",null,"INF"]
["","",null,"FALSE"]
["","",null,"TRUE"]
["",null,null,null,null,null,null,null,null,null,null,null,null,null,null,null,null,null,null,null,null,null,null,null,null,"//General data label {2}","//General data value {4}"]
[""]
[""]
[""]
["",{"$f":"INDEX(labels!A2:C2,1,MATCH(PP_Language,labels!A1:C1,0))","v":"Informatie over de rapportage en de rechtspersoon"}]
["",{"$f":"INDEX(labels!A3:C3,1,MATCH(PP_Language,labels!A1:C1,0))","v":"Informatie over de rechtspersoon"}]
["",{"$f":"INDEX(labels!A3:C3,1,MATCH(PP_Language,labels!A1:C1,0))","v":"Informatie over de rechtspersoon"}]
[""]
[""]
["",{"$f":"INDEX(labels!A4:C4,1,MATCH(PP_Language,labels!A1:C1,0))","v":"Naam van de rechtspersoon"},"",null,null,null,null,null,null,null,null,null,null,null,null,null,null,null,null,null,null,null,null,null,null,{"$f":"\"/entity-information label {\"&COLUMN(B22)&\"}\"","v":"/entity-information label {2}"},null,{"$f":"\"/entity-information   {\"&COLUMN(D22)&\"}\"","v":"/entity-information   {4}"}]
["",{"$f":"INDEX(labels!A5:C5,1,MATCH(PP_Language,labels!A1:C1,0))","v":"Rechtsvorm van de rechtspersoon"},""]
["",{"$f":"INDEX(labels!A6:C6,1,MATCH(PP_Language,labels!A1:C1,0))","v":"Zetel van de rechtspersoon"},""]
["",{"$f":"INDEX(labels!A7:C7,1,MATCH(PP_Language,labels!A1:C1,0))","v":"Registratienummer bij de Kamer van Koophandel"},""]
["",{"$f":"INDEX(labels!A8:C8,1,MATCH(PP_Language,labels!A1:C1,0))","v":"Handelsnamen"},""]
["",{"$f":"INDEX(labels!A9:C9,1,MATCH(PP_Language,labels!A1:C1,0))","v":"Classificatie van de rechtspersoon op basis van de wettelijke groottecriteria klein"},""]
["",{"$f":"INDEX(labels!A10:C10,1,MATCH(PP_Language,labels!A1:C1,0))","v":"SBI-code"},""]
[""]
["",null,null,null,null,null,null,null,null,null,null,null,null,null,null,null,null,null,null,null,null,null,null,null,null,{"$f":"\"//entity-information label {\"&COLUMN(B30)&\"}\"","v":"//entity-information label {2}"},null,{"$f":"\"//entity-information   {\"&COLUMN(D30)&\"}\"","v":"//entity-information   {4}"}]
["",{"$f":"INDEX(labels!A11:C11,1,MATCH(PP_Language,labels!A1:C1,0))","v":"Adres van de rechtspersoon"}]
[""]
[""]
["",{"$f":"INDEX(labels!A12:C12,1,MATCH(PP_Language,labels!A1:C1,0))","v":"Locatieomschrijving NL"},"",null,null,null,null,null,null,null,null,null,null,null,null,null,null,null,null,null,null,null,null,null,null,{"$f":"\"/entity-address label {\"&COLUMN(B34)&\"}\"","v":"/entity-address label {2}"},null,{"$f":"\"/entity-address   {\"&COLUMN(D34)&\"}\"","v":"/entity-address   {4}"}]
["",{"$f":"INDEX(labels!A13:C13,1,MATCH(PP_Language,labels!A1:C1,0))","v":"Straatnaam NL"},""]
["",{"$f":"INDEX(labels!A14:C14,1,MATCH(PP_Language,labels!A1:C1,0))","v":"Huisnummer NL"},""]
["",{"$f":"INDEX(labels!A15:C15,1,MATCH(PP_Language,labels!A1:C1,0))","v":"Huisnummertoevoeging"},""]
["",{"$f":"INDEX(labels!A16:C16,1,MATCH(PP_Language,labels!A1:C1,0))","v":"Postbusnummer"},""]
["",{"$f":"INDEX(labels!A17:C17,1,MATCH(PP_Language,labels!A1:C1,0))","v":"Postcode NL"},""]
["",{"$f":"INDEX(labels!A18:C18,1,MATCH(PP_Language,labels!A1:C1,0))","v":"Vestigingsplaats NL"},""]
["",{"$f":"INDEX(labels!A19:C19,1,MATCH(PP_Language,labels!A1:C1,0))","v":"Locatieomschrijving buitenland"},""]
["",{"$f":"INDEX(labels!A20:C20,1,MATCH(PP_Language,labels!A1:C1,0))","v":"Straatnaam buitenland"},""]
["",{"$f":"INDEX(labels!A21:C21,1,MATCH(PP_Language,labels!A1:C1,0))","v":"Huisnummer buitenland"},""]
["",{"$f":"INDEX(labels!A22:C22,1,MATCH(PP_Language,labels!A1:C1,0))","v":"Postcode buitenland"},""]
["",{"$f":"INDEX(labels!A23:C23,1,MATCH(PP_Language,labels!A1:C1,0))","v":"Vestigingsplaats buitenland"},""]
["",{"$f":"INDEX(labels!A24:C24,1,MATCH(PP_Language,labels!A1:C1,0))","v":"Regionaam"},""]
["",{"$f":"INDEX(labels!A25:C25,1,MATCH(PP_Language,labels!A1:C1,0))","v":"Landnaam, ISO"},""]
[""]
["",null,null,null,null,null,null,null,null,null,null,null,null,null,null,null,null,null,null,null,null,null,null,null,null,{"$f":"\"//entity-address label {\"&COLUMN(B49)&\"}\"","v":"//entity-address label {2}"},null,{"$f":"\"//entity-address   {\"&COLUMN(D49)&\"}\"","v":"//entity-address   {4}"}]
["",{"$f":"INDEX(labels!A26:C26,1,MATCH(PP_Language,labels!A1:C1,0))","v":"Informatie over de rapportage"}]
[""]
[""]
["",{"$f":"INDEX(labels!A27:C27,1,MATCH(PP_Language,labels!A1:C1,0))","v":"Titel van het document"},"",null,null,null,null,null,null,null,null,null,null,null,null,null,null,null,null,null,null,null,null,null,null,{"$f":"\"/document-information label {\"&COLUMN(B53)&\"}\"","v":"/document-information label {2}"},null,{"$f":"\"/document-information   {\"&COLUMN(D53)&\"}\"","v":"/document-information   {4}"}]
["",{"$f":"INDEX(labels!A28:C28,1,MATCH(PP_Language,labels!A1:C1,0))","v":"Startdatum van de periode waarop de jaarrekening betrekking heeft"},""]
["",{"$f":"INDEX(labels!A29:C29,1,MATCH(PP_Language,labels!A1:C1,0))","v":"Einddatum van de periode waarop de jaarrekening betrekking heeft"},""]
["",{"$f":"INDEX(labels!A30:C30,1,MATCH(PP_Language,labels!A1:C1,0))","v":"Startdatum van de voorgaande periode waarop de jaarrekening betrekking heeft"},""]
["",{"$f":"INDEX(labels!A31:C31,1,MATCH(PP_Language,labels!A1:C1,0))","v":"Einddatum van de voorgaande periode waarop de jaarrekening betrekking heeft"},""]
["",{"$f":"INDEX(labels!A32:C32,1,MATCH(PP_Language,labels!A1:C1,0))","v":"Rapportageperiode afwijkend van een jaar (J/N)"},""]
["",{"$f":"INDEX(labels!A33:C33,1,MATCH(PP_Language,labels!A1:C1,0))","v":"Beschrijving van de reden voor het afwijken van een rapportageperiode van een jaar"},""]
["",{"$f":"INDEX(labels!A34:C34,1,MATCH(PP_Language,labels!A1:C1,0))","v":"Beschrijving van het effect op de vergelijkende cijfers bij het afwijken van rapportageperiode van een jaar"},""]
["",{"$f":"INDEX(labels!A35:C35,1,MATCH(PP_Language,labels!A1:C1,0))","v":"Type grondslag"},""]
["",{"$f":"INDEX(labels!A37:C37,1,MATCH(PP_Language,labels!A1:C1,0))","v":"Rapporteringsvaluta van het document"},""]
["",{"$f":"INDEX(labels!A38:C38,1,MATCH(PP_Language,labels!A1:C1,0))","v":"Geldeenheid waarin de cijfers in de jaarrekening zijn uitgedrukt"},""]
["",{"$f":"INDEX(labels!A41:C41,1,MATCH(PP_Language,labels!A1:C1,0))","v":"Datum van opmaak van de jaarrekening"},""]
["",{"$f":"INDEX(labels!A42:C42,1,MATCH(PP_Language,labels!A1:C1,0))","v":"Jaarrekening vastgesteld (J/N)"},""]
["",{"$f":"INDEX(labels!A43:C43,1,MATCH(PP_Language,labels!A1:C1,0))","v":"Datum van vaststelling van de jaarrekening"},""]
["",{"$f":"INDEX(labels!A44:C44,1,MATCH(PP_Language,labels!A1:C1,0))","v":"Heraanlevering van het document op basis van inhoudelijk en onoverkomelijke onjuistheden (J/N)"},""]
["",{"$f":"INDEX(labels!A45:C45,1,MATCH(PP_Language,labels!A1:C1,0))","v":"Toelichting op heraanlevering van het document op basis van inhoudelijk en onoverkomelijke onjuistheden"},""]
["",{"$f":"INDEX(labels!A46:C46,1,MATCH(PP_Language,labels!A1:C1,0))","v":"Heraanlevering van het document op basis van technische en/of procesmatige onjuistheden (J/N)"},""]
["",{"$f":"INDEX(labels!A47:C47,1,MATCH(PP_Language,labels!A1:C1,0))","v":"Toelichting op heraanlevering van het document op basis van technische en/of procesmatige onjuistheden"},""]
["",{"$f":"INDEX(labels!A48:C48,1,MATCH(PP_Language,labels!A1:C1,0))","v":"E-mailadres"},""]
["",{"$f":"INDEX(labels!A49:C49,1,MATCH(PP_Language,labels!A1:C1,0))","v":"Publicatie WNT in de geconsolideerde en/of enkelvoudige jaarrekening danwel jaarrekening van een van de andere rechtspersonen binnen de groep"},""]
["",{"$f":"INDEX(labels!A50:C50,1,MATCH(PP_Language,labels!A1:C1,0))","v":"Verwijzing verantwoorde WNT gegevens naar topfunctionaris en gelieerde rechtsperso(o)n(en)"},""]
["",{"$f":"INDEX(labels!A51:C51,1,MATCH(PP_Language,labels!A1:C1,0))","v":"Het toepasselijke bezoldigingsmaximum voor de instelling"},"-"]
[""]
["",null,null,null,null,null,null,null,null,null,null,null,null,null,null,null,null,null,null,null,null,null,null,null,null,{"$f":"\"//document-information label {\"&COLUMN(B76)&\"}\"","v":"//document-information label {2}"},null,{"$f":"\"//document-information   {\"&COLUMN(D76)&\"}\"","v":"//document-information   {4}"}]
["",{"$f":"INDEX(labels!A52:C52,1,MATCH(PP_Language,labels!A1:C1,0))","v":"Jaarrekening"}]
["",{"$f":"INDEX(labels!A53:C53,1,MATCH(PP_Language,labels!A1:C1,0))","v":"Enkelvoudige jaarrekening"}]
["",{"$f":"INDEX(labels!A54:C54,1,MATCH(PP_Language,labels!A1:C1,0))","v":"Balans"}]
["",{"$f":"INDEX(labels!A54:C54,1,MATCH(PP_Language,labels!A1:C1,0))","v":"Balans"}]
["",null,null,{"$f":"INDEX(labels!A55:C55,1,MATCH(PP_Language,labels!A1:C1,0))","v":"Huidig"},null,{"$f":"INDEX(labels!A57:C57,1,MATCH(PP_Language,labels!A1:C1,0))","v":"Voorgaand"}]
[""]
["",{"$f":"INDEX(labels!A58:C58,1,MATCH(PP_Language,labels!A1:C1,0))","v":"Balans voor of na resultaatbestemming"},"",null,null,null,null,null,null,null,null,null,null,null,null,null,null,null,null,null,null,null,null,null,null,{"$f":"\"/balance-sheet label {\"&COLUMN(B83)&\"}\"","v":"/balance-sheet label {2}"},null,{"$f":"\"/balance-sheet \" & INDEX(labels!A56:C56,1,MATCH(PP_Language,labels!A1:C1,0)) & \" \" & BasisOfPreparationAxis & \" \" & INDEX(labels!A55:C55,1,MATCH(PP_Language,labels!A1:C1,0)) &  \"  {\"&COLUMN(D83)&\"}\"","v":"/balance-sheet Enkelvoudig Commercial Huidig  {4}"},null,{"$f":"\"/balance-sheet \" & INDEX(labels!A56:C56,1,MATCH(PP_Language,labels!A1:C1,0)) & \" \" & BasisOfPreparationAxis & \" \" & INDEX(labels!A57:C57,1,MATCH(PP_Language,labels!A1:C1,0)) &  \"  {\"&COLUMN(F83)&\"}\"","v":"/balance-sheet Enkelvoudig Commercial Voorgaand  {6}"}]
[""]
["",{"$f":"INDEX(labels!A59:C59,1,MATCH(PP_Language,labels!A1:C1,0))","v":"Immateriële vaste activa"},"-"]
["",{"$f":"INDEX(labels!A60:C60,1,MATCH(PP_Language,labels!A1:C1,0))","v":"Materiële vaste activa"},"-"]
["",{"$f":"INDEX(labels!A61:C61,1,MATCH(PP_Language,labels!A1:C1,0))","v":"Vastgoedbeleggingen"},"-"]
["",{"$f":"INDEX(labels!A62:C62,1,MATCH(PP_Language,labels!A1:C1,0))","v":"Financiële vaste activa"},"-"]
["",{"$f":"INDEX(labels!A63:C63,1,MATCH(PP_Language,labels!A1:C1,0))","v":"Totaal van vaste activa"},"-",{"$f":"IF(OR(NOT(0=0),NOT(AND(Stamdata!D87=\"\",Stamdata!D88=\"\",Stamdata!D89=\"\",Stamdata!D90=\"\"))), + SUM(Stamdata!D87,Stamdata!D88,Stamdata!D89,Stamdata!D90),\"\")","v":""},null,{"$f":"IF(OR(NOT(0=0),NOT(AND(Stamdata!F87=\"\",Stamdata!F88=\"\",Stamdata!F89=\"\",Stamdata!F90=\"\"))), + SUM(Stamdata!F87,Stamdata!F88,Stamdata!F89,Stamdata!F90),\"\")","v":""}]
[""]
["",{"$f":"INDEX(labels!A64:C64,1,MATCH(PP_Language,labels!A1:C1,0))","v":"Voorraden"},"-"]
["",{"$f":"INDEX(labels!A65:C65,1,MATCH(PP_Language,labels!A1:C1,0))","v":"Onderhanden projecten"},"-"]
["",{"$f":"INDEX(labels!A66:C66,1,MATCH(PP_Language,labels!A1:C1,0))","v":"Vorderingen"},"-"]
["",{"$f":"INDEX(labels!A67:C67,1,MATCH(PP_Language,labels!A1:C1,0))","v":"Effecten"},"-"]
["",{"$f":"INDEX(labels!A68:C68,1,MATCH(PP_Language,labels!A1:C1,0))","v":"Liquide middelen"},"-"]
["",{"$f":"INDEX(labels!A69:C69,1,MATCH(PP_Language,labels!A1:C1,0))","v":"Totaal van vlottende activa"},"-",{"$f":"IF(OR(NOT(0=0),NOT(AND(Stamdata!D93=\"\",Stamdata!D94=\"\",Stamdata!D95=\"\",Stamdata!D96=\"\",Stamdata!D97=\"\"))), + SUM(Stamdata!D93,Stamdata!D94,Stamdata!D95,Stamdata!D96,Stamdata!D97),\"\")","v":""},null,{"$f":"IF(OR(NOT(0=0),NOT(AND(Stamdata!F93=\"\",Stamdata!F94=\"\",Stamdata!F95=\"\",Stamdata!F96=\"\",Stamdata!F97=\"\"))), + SUM(Stamdata!F93,Stamdata!F94,Stamdata!F95,Stamdata!F96,Stamdata!F97),\"\")","v":""}]
[""]
["",{"$f":"INDEX(labels!A70:C70,1,MATCH(PP_Language,labels!A1:C1,0))","v":"Totaal van activa"},"-",{"$f":"IF(OR(NOT(0=0),NOT(AND(Stamdata!D91=\"\",Stamdata!D98=\"\"))), + SUM(Stamdata!D91,Stamdata!D98),\"\")","v":""},null,{"$f":"IF(OR(NOT(0=0),NOT(AND(Stamdata!F91=\"\",Stamdata!F98=\"\"))), + SUM(Stamdata!F91,Stamdata!F98),\"\")","v":""}]
[""]
["",{"$f":"INDEX(labels!A71:C71,1,MATCH(PP_Language,labels!A1:C1,0))","v":"Gestort en opgevraagd aandelenkapitaal"},"+"]
["",{"$f":"INDEX(labels!A72:C72,1,MATCH(PP_Language,labels!A1:C1,0))","v":"Agio"},"+"]
["",{"$f":"INDEX(labels!A73:C73,1,MATCH(PP_Language,labels!A1:C1,0))","v":"Herwaarderingsreserves"},"+"]
["",{"$f":"INDEX(labels!A74:C74,1,MATCH(PP_Language,labels!A1:C1,0))","v":"Andere wettelijke reserves"},"+"]
["",{"$f":"INDEX(labels!A75:C75,1,MATCH(PP_Language,labels!A1:C1,0))","v":"Statutaire reserves"},"+"]
["",{"$f":"INDEX(labels!A76:C76,1,MATCH(PP_Language,labels!A1:C1,0))","v":"Herinvesteringsreserve"},"+"]
["",{"$f":"INDEX(labels!A77:C77,1,MATCH(PP_Language,labels!A1:C1,0))","v":"Overige reserves"},"+"]
["",{"$f":"INDEX(labels!A78:C78,1,MATCH(PP_Language,labels!A1:C1,0))","v":"Overige fiscale reserves"},"+"]
["",{"$f":"INDEX(labels!A79:C79,1,MATCH(PP_Language,labels!A1:C1,0))","v":"Resultaat na belastingen van het boekjaar"},"+"]
["",{"$f":"INDEX(labels!A80:C80,1,MATCH(PP_Language,labels!A1:C1,0))","v":"Niet verdeelde winsten"},"+"]
["",{"$f":"INDEX(labels!A81:C81,1,MATCH(PP_Language,labels!A1:C1,0))","v":"Totaal van eigen vermogen"},"+",{"$f":"IF(OR(NOT(AND(Stamdata!D102=\"\",Stamdata!D103=\"\",Stamdata!D104=\"\",Stamdata!D105=\"\",Stamdata!D106=\"\",Stamdata!D107=\"\",Stamdata!D108=\"\",Stamdata!D109=\"\",Stamdata!D110=\"\",Stamdata!D111=\"\")),NOT(0=0)), SUM(Stamdata!D102,Stamdata!D103,Stamdata!D104,Stamdata!D105,Stamdata!D106,Stamdata!D107,Stamdata!D108,Stamdata!D109,Stamdata!D110,Stamdata!D111),\"\")","v":""},null,{"$f":"IF(OR(NOT(AND(Stamdata!F102=\"\",Stamdata!F103=\"\",Stamdata!F104=\"\",Stamdata!F105=\"\",Stamdata!F106=\"\",Stamdata!F107=\"\",Stamdata!F108=\"\",Stamdata!F109=\"\",Stamdata!F110=\"\",Stamdata!F111=\"\")),NOT(0=0)), SUM(Stamdata!F102,Stamdata!F103,Stamdata!F104,Stamdata!F105,Stamdata!F106,Stamdata!F107,Stamdata!F108,Stamdata!F109,Stamdata!F110,Stamdata!F111),\"\")","v":""}]
[""]
["",{"$f":"INDEX(labels!A82:C82,1,MATCH(PP_Language,labels!A1:C1,0))","v":"Voorzieningen"},"+"]
["",{"$f":"INDEX(labels!A83:C83,1,MATCH(PP_Language,labels!A1:C1,0))","v":"Langlopende schulden"},"+"]
["",{"$f":"INDEX(labels!A84:C84,1,MATCH(PP_Language,labels!A1:C1,0))","v":"Kortlopende schulden"},"+"]
["",{"$f":"INDEX(labels!A85:C85,1,MATCH(PP_Language,labels!A1:C1,0))","v":"Totaal van passiva"},"+",{"$f":"IF(OR(NOT(AND(Stamdata!D112=\"\",Stamdata!D114=\"\",Stamdata!D115=\"\",Stamdata!D116=\"\")),NOT(0=0)), SUM(Stamdata!D112,Stamdata!D114,Stamdata!D115,Stamdata!D116),\"\")","v":""},null,{"$f":"IF(OR(NOT(AND(Stamdata!F112=\"\",Stamdata!F114=\"\",Stamdata!F115=\"\",Stamdata!F116=\"\")),NOT(0=0)), SUM(Stamdata!F112,Stamdata!F114,Stamdata!F115,Stamdata!F116),\"\")","v":""}]
[""]
[""]
[""]
["",null,null,null,null,null,null,null,null,null,null,null,null,null,null,null,null,null,null,null,null,null,null,null,null,{"$f":"\"//balance-sheet label {\"&COLUMN(B119)&\"}\"","v":"//balance-sheet label {2}"},null,{"$f":"\"//balance-sheet \" & INDEX(labels!A56:C56,1,MATCH(PP_Language,labels!A1:C1,0)) & \" \" & BasisOfPreparationAxis & \" \" & INDEX(labels!A55:C55,1,MATCH(PP_Language,labels!A1:C1,0)) &  \"  {\"&COLUMN(D119)&\"}\"","v":"//balance-sheet Enkelvoudig Commercial Huidig  {4}"},null,{"$f":"\"//balance-sheet \" & INDEX(labels!A56:C56,1,MATCH(PP_Language,labels!A1:C1,0)) & \" \" & BasisOfPreparationAxis & \" \" & INDEX(labels!A57:C57,1,MATCH(PP_Language,labels!A1:C1,0)) &  \"  {\"&COLUMN(F119)&\"}\"","v":"//balance-sheet Enkelvoudig Commercial Voorgaand  {6}"}]
["",{"$f":"INDEX(labels!A86:C86,1,MATCH(PP_Language,labels!A1:C1,0))","v":"Toelichting op de jaarrekening"}]
["",{"$f":"INDEX(labels!A87:C87,1,MATCH(PP_Language,labels!A1:C1,0))","v":"Algemene toelichting"}]
["",{"$f":"INDEX(labels!A88:C88,1,MATCH(PP_Language,labels!A1:C1,0))","v":"Toelichting op de jaarrekening - Algemene toelichting"}]
[""]
[""]
["",{"$f":"INDEX(labels!A89:C89,1,MATCH(PP_Language,labels!A1:C1,0))","v":"Beschrijving van de belangrijkste activiteiten van de rechtspersoon"},"",null,null,null,null,null,null,null,null,null,null,null,null,null,null,null,null,null,null,null,null,null,null,{"$f":"\"/notes-general-notes label {\"&COLUMN(B125)&\"}\"","v":"/notes-general-notes label {2}"},null,{"$f":"\"/notes-general-notes \" & INDEX(labels!A56:C56,1,MATCH(PP_Language,labels!A1:C1,0)) & \" \" & BasisOfPreparationAxis & \"  {\"&COLUMN(D125)&\"}\"","v":"/notes-general-notes Enkelvoudig Commercial  {4}"}]
["",{"$f":"INDEX(labels!A90:C90,1,MATCH(PP_Language,labels!A1:C1,0))","v":"Beschrijving van de locatie van de feitelijke activiteiten"},""]
[""]
["",null,null,null,null,null,null,null,null,null,null,null,null,null,null,null,null,null,null,null,null,null,null,null,null,{"$f":"\"//notes-general-notes label {\"&COLUMN(B128)&\"}\"","v":"//notes-general-notes label {2}"},null,{"$f":"\"//notes-general-notes \" & INDEX(labels!A56:C56,1,MATCH(PP_Language,labels!A1:C1,0)) & \" \" & BasisOfPreparationAxis & \"  {\"&COLUMN(D128)&\"}\"","v":"//notes-general-notes Enkelvoudig Commercial  {4}"}]
["",{"$f":"INDEX(labels!A91:C91,1,MATCH(PP_Language,labels!A1:C1,0))","v":"Toelichting op de jaarrekening - Algemene toelichting: Continuïteit"}]
[""]
[""]
["",{"$f":"INDEX(labels!A92:C92,1,MATCH(PP_Language,labels!A1:C1,0))","v":"Informatieverschaffing over continuïteit"},"",null,null,null,null,null,null,null,null,null,null,null,null,null,null,null,null,null,null,null,null,null,null,{"$f":"\"/notes-general-notes-going-concern label {\"&COLUMN(B132)&\"}\"","v":"/notes-general-notes-going-concern label {2}"},null,{"$f":"\"/notes-general-notes-going-concern \" & INDEX(labels!A56:C56,1,MATCH(PP_Language,labels!A1:C1,0)) & \" \" & BasisOfPreparationAxis & \"  {\"&COLUMN(D132)&\"}\"","v":"/notes-general-notes-going-concern Enkelvoudig Commercial  {4}"}]
["",{"$f":"INDEX(labels!A93:C93,1,MATCH(PP_Language,labels!A1:C1,0))","v":"Beschrijving van de ernstige onzekerheden omtrent de continuïteit van de organisatie"},""]
["",{"$f":"INDEX(labels!A94:C94,1,MATCH(PP_Language,labels!A1:C1,0))","v":"Beschrijving van de grondslag van waardering wanneer dit niet op continuïteitsbasis is"},""]
["",{"$f":"INDEX(labels!A95:C95,1,MATCH(PP_Language,labels!A1:C1,0))","v":"Beschrijving van de invloed van het niet waarderen op continuïteitsbasis op het vermogen en resultaat"},""]
[""]
["",null,null,null,null,null,null,null,null,null,null,null,null,null,null,null,null,null,null,null,null,null,null,null,null,{"$f":"\"//notes-general-notes-going-concern label {\"&COLUMN(B137)&\"}\"","v":"//notes-general-notes-going-concern label {2}"},null,{"$f":"\"//notes-general-notes-going-concern \" & INDEX(labels!A56:C56,1,MATCH(PP_Language,labels!A1:C1,0)) & \" \" & BasisOfPreparationAxis & \"  {\"&COLUMN(D137)&\"}\"","v":"//notes-general-notes-going-concern Enkelvoudig Commercial  {4}"}]
["",{"$f":"INDEX(labels!A96:C96,1,MATCH(PP_Language,labels!A1:C1,0))","v":"Toelichting op de jaarrekening - Algemene toelichting: Groepsverhoudingen"}]
[""]
[""]
["",{"$f":"INDEX(labels!A97:C97,1,MATCH(PP_Language,labels!A1:C1,0))","v":"Informatieverschaffing over groepsverhoudingen"},"",null,null,null,null,null,null,null,null,null,null,null,null,null,null,null,null,null,null,null,null,null,null,{"$f":"\"/notes-general-notes-group-structure label {\"&COLUMN(B141)&\"}\"","v":"/notes-general-notes-group-structure label {2}"},null,{"$f":"\"/notes-general-notes-group-structure \" & INDEX(labels!A56:C56,1,MATCH(PP_Language,labels!A1:C1,0)) & \" \" & BasisOfPreparationAxis & \"  {\"&COLUMN(D141)&\"}\"","v":"/notes-general-notes-group-structure Enkelvoudig Commercial  {4}"}]
["",{"$f":"INDEX(labels!A98:C98,1,MATCH(PP_Language,labels!A1:C1,0))","v":"Naam van de maatschappij die de geconsolideerde jaarrekening opstelt van het groepsdeel waartoe de rechtspersoon behoort"},""]
["",{"$f":"INDEX(labels!A99:C99,1,MATCH(PP_Language,labels!A1:C1,0))","v":"Woonplaats van de maatschappij die de geconsolideerde jaarrekening opstelt van het groepsdeel waartoe de rechtspersoon behoort"},""]
[""]
["",null,null,null,null,null,null,null,null,null,null,null,null,null,null,null,null,null,null,null,null,null,null,null,null,{"$f":"\"//notes-general-notes-group-structure label {\"&COLUMN(B145)&\"}\"","v":"//notes-general-notes-group-structure label {2}"},null,{"$f":"\"//notes-general-notes-group-structure \" & INDEX(labels!A56:C56,1,MATCH(PP_Language,labels!A1:C1,0)) & \" \" & BasisOfPreparationAxis & \"  {\"&COLUMN(D145)&\"}\"","v":"//notes-general-notes-group-structure Enkelvoudig Commercial  {4}"}]
["",{"$f":"INDEX(labels!A100:C100,1,MATCH(PP_Language,labels!A1:C1,0))","v":"Toelichting op de jaarrekening - Algemene toelichting: Schattingen"}]
[""]
[""]
["",{"$f":"INDEX(labels!A101:C101,1,MATCH(PP_Language,labels!A1:C1,0))","v":"Informatieverschaffing over schattingen, oordelen, veronderstellingen en onzekerheden"},"",null,null,null,null,null,null,null,null,null,null,null,null,null,null,null,null,null,null,null,null,null,null,{"$f":"\"/notes-general-notes-estimates label {\"&COLUMN(B149)&\"}\"","v":"/notes-general-notes-estimates label {2}"},null,{"$f":"\"/notes-general-notes-estimates \" & INDEX(labels!A56:C56,1,MATCH(PP_Language,labels!A1:C1,0)) & \" \" & BasisOfPreparationAxis & \"  {\"&COLUMN(D149)&\"}\"","v":"/notes-general-notes-estimates Enkelvoudig Commercial  {4}"}]
[""]
["",null,null,null,null,null,null,null,null,null,null,null,null,null,null,null,null,null,null,null,null,null,null,null,null,{"$f":"\"//notes-general-notes-estimates label {\"&COLUMN(B151)&\"}\"","v":"//notes-general-notes-estimates label {2}"},null,{"$f":"\"//notes-general-notes-estimates \" & INDEX(labels!A56:C56,1,MATCH(PP_Language,labels!A1:C1,0)) & \" \" & BasisOfPreparationAxis & \"  {\"&COLUMN(D151)&\"}\"","v":"//notes-general-notes-estimates Enkelvoudig Commercial  {4}"}]
["",{"$f":"INDEX(labels!A102:C102,1,MATCH(PP_Language,labels!A1:C1,0))","v":"Toelichting op de jaarrekening - Algemene toelichting: Consolidatie"}]
[""]
[""]
["",{"$f":"INDEX(labels!A103:C103,1,MATCH(PP_Language,labels!A1:C1,0))","v":"Informatieverschaffing over consolidatie"},"",null,null,null,null,null,null,null,null,null,null,null,null,null,null,null,null,null,null,null,null,null,null,{"$f":"\"/notes-general-notes-consolidation label {\"&COLUMN(B155)&\"}\"","v":"/notes-general-notes-consolidation label {2}"},null,{"$f":"\"/notes-general-notes-consolidation \" & INDEX(labels!A56:C56,1,MATCH(PP_Language,labels!A1:C1,0)) & \" \" & BasisOfPreparationAxis & \"  {\"&COLUMN(D155)&\"}\"","v":"/notes-general-notes-consolidation Enkelvoudig Commercial  {4}"}]
["",{"$f":"INDEX(labels!A104:C104,1,MATCH(PP_Language,labels!A1:C1,0))","v":"Beschrijving van de vrijstelling van consolidatie in verband met toepassing van artikel 2:408"},""]
["",{"$f":"INDEX(labels!A105:C105,1,MATCH(PP_Language,labels!A1:C1,0))","v":"Beschrijving van de reden voor het niet meeconsolideren van een dochtermaatschappij"},""]
["",{"$f":"INDEX(labels!A106:C106,1,MATCH(PP_Language,labels!A1:C1,0))","v":"Beschrijving van toepassing en reden van toepassing consolidatievrijstelling voor participatiemaatschappij of beleggingsmaatschappij"},""]
["",{"$f":"INDEX(labels!A107:C107,1,MATCH(PP_Language,labels!A1:C1,0))","v":"Vermelding van de rechtspersonen waarvoor de rechtspersoon een aansprakelijkstelling overeenkomstig Art. 2:403 heeft afgegeven"},""]
[""]
["",null,null,null,null,null,null,null,null,null,null,null,null,null,null,null,null,null,null,null,null,null,null,null,null,{"$f":"\"//notes-general-notes-consolidation label {\"&COLUMN(B161)&\"}\"","v":"//notes-general-notes-consolidation label {2}"},null,{"$f":"\"//notes-general-notes-consolidation \" & INDEX(labels!A56:C56,1,MATCH(PP_Language,labels!A1:C1,0)) & \" \" & BasisOfPreparationAxis & \"  {\"&COLUMN(D161)&\"}\"","v":"//notes-general-notes-consolidation Enkelvoudig Commercial  {4}"}]
["",{"$f":"INDEX(labels!A108:C108,1,MATCH(PP_Language,labels!A1:C1,0))","v":"Toelichting op de jaarrekening - Algemene toelichting: Fusies en overnames"}]
[""]
[""]
["",{"$f":"INDEX(labels!A109:C109,1,MATCH(PP_Language,labels!A1:C1,0))","v":"Informatieverschaffing over fusies en overnames"},"",null,null,null,null,null,null,null,null,null,null,null,null,null,null,null,null,null,null,null,null,null,null,{"$f":"\"/notes-general-notes-mergers-acquisitions label {\"&COLUMN(B165)&\"}\"","v":"/notes-general-notes-mergers-acquisitions label {2}"},null,{"$f":"\"/notes-general-notes-mergers-acquisitions \" & INDEX(labels!A56:C56,1,MATCH(PP_Language,labels!A1:C1,0)) & \" \" & BasisOfPreparationAxis & \"  {\"&COLUMN(D165)&\"}\"","v":"/notes-general-notes-mergers-acquisitions Enkelvoudig Commercial  {4}"}]
[""]
["",null,null,null,null,null,null,null,null,null,null,null,null,null,null,null,null,null,null,null,null,null,null,null,null,{"$f":"\"//notes-general-notes-mergers-acquisitions label {\"&COLUMN(B167)&\"}\"","v":"//notes-general-notes-mergers-acquisitions label {2}"},null,{"$f":"\"//notes-general-notes-mergers-acquisitions \" & INDEX(labels!A56:C56,1,MATCH(PP_Language,labels!A1:C1,0)) & \" \" & BasisOfPreparationAxis & \"  {\"&COLUMN(D167)&\"}\"","v":"//notes-general-notes-mergers-acquisitions Enkelvoudig Commercial  {4}"}]
["",{"$f":"INDEX(labels!A110:C110,1,MATCH(PP_Language,labels!A1:C1,0))","v":"Toelichting op de jaarrekening - Algemene toelichting: Bedrijfsactiviteiten die niet duurzaam worden voortgezet"}]
[""]
[""]
["",{"$f":"INDEX(labels!A111:C111,1,MATCH(PP_Language,labels!A1:C1,0))","v":"Informatieverschaffing over beëindiging van bedrijfsactiviteiten"},"",null,null,null,null,null,null,null,null,null,null,null,null,null,null,null,null,null,null,null,null,null,null,{"$f":"\"/notes-general-notes-discontinued-operations label {\"&COLUMN(B171)&\"}\"","v":"/notes-general-notes-discontinued-operations label {2}"},null,{"$f":"\"/notes-general-notes-discontinued-operations \" & INDEX(labels!A56:C56,1,MATCH(PP_Language,labels!A1:C1,0)) & \" \" & BasisOfPreparationAxis & \"  {\"&COLUMN(D171)&\"}\"","v":"/notes-general-notes-discontinued-operations Enkelvoudig Commercial  {4}"}]
["",{"$f":"INDEX(labels!A112:C112,1,MATCH(PP_Language,labels!A1:C1,0))","v":"Beschrijving van het resultaat voor belastingen dat wordt behaald met de verkoop van activa van een bedrijfsactiviteit die niet duurzaam wordt voortgezet"},""]
["",{"$f":"INDEX(labels!A113:C113,1,MATCH(PP_Language,labels!A1:C1,0))","v":"Beschrijving van de aard van de initiële gebeurtenis bij de beëindiging van bedijfsactiviteiten"},""]
["",{"$f":"INDEX(labels!A114:C114,1,MATCH(PP_Language,labels!A1:C1,0))","v":"Beschrijving van het tijdstip van de initiële gebeurtenis bij de beëindiging van bedijfsactiviteiten"},""]
["",{"$f":"INDEX(labels!A115:C115,1,MATCH(PP_Language,labels!A1:C1,0))","v":"Beschrijving van het tijdstip waarop of de periode waarin de beëindiging van bedijfsactiviteiten zal zijn afgerond"},""]
["",{"$f":"INDEX(labels!A116:C116,1,MATCH(PP_Language,labels!A1:C1,0))","v":"Beschrijving van het verwachte tijdstip van ontvangst van nettoverkoopbrengst van activa waarvoor de rechtspersoon een bindende overeenkomst is aangegaan van een bedrijfsactiviteit die niet duurzaam wordt voortgezet"},""]
["",{"$f":"INDEX(labels!A117:C117,1,MATCH(PP_Language,labels!A1:C1,0))","v":"Beschrijving van verwachte tijdstip van ontvangst van nettoverkoopbrengst van vreemd vermogen waarvoor de rechtspersoon een bindende overeenkomst is aangegaan van een bedrijfsactiviteit die niet duurzaam wordt voortgezet"},""]
["",{"$f":"INDEX(labels!A118:C118,1,MATCH(PP_Language,labels!A1:C1,0))","v":"Beschrijving van het resultaat voor belastingen dat wordt behaald met de afwikkeling van posten van het vreemd vermogen van een bedrijfsactiviteit die niet duurzaam wordt voortgezet"},""]
[""]
["",null,null,null,null,null,null,null,null,null,null,null,null,null,null,null,null,null,null,null,null,null,null,null,null,{"$f":"\"//notes-general-notes-discontinued-operations label {\"&COLUMN(B180)&\"}\"","v":"//notes-general-notes-discontinued-operations label {2}"},null,{"$f":"\"//notes-general-notes-discontinued-operations \" & INDEX(labels!A56:C56,1,MATCH(PP_Language,labels!A1:C1,0)) & \" \" & BasisOfPreparationAxis & \"  {\"&COLUMN(D180)&\"}\"","v":"//notes-general-notes-discontinued-operations Enkelvoudig Commercial  {4}"}]
["",{"$f":"INDEX(labels!A119:C119,1,MATCH(PP_Language,labels!A1:C1,0))","v":"Algemene grondslagen voor verslaggeving"}]
["",{"$f":"INDEX(labels!A120:C120,1,MATCH(PP_Language,labels!A1:C1,0))","v":"Toelichting op de jaarrekening - Algemene grondslagen voor verslaggeving"}]
[""]
[""]
["",{"$f":"INDEX(labels!A121:C121,1,MATCH(PP_Language,labels!A1:C1,0))","v":"Beschrijving van de standaarden op basis waarvan de jaarrekening is opgesteld"},"",null,null,null,null,null,null,null,null,null,null,null,null,null,null,null,null,null,null,null,null,null,null,{"$f":"\"/notes-general-accounting-principles label {\"&COLUMN(B185)&\"}\"","v":"/notes-general-accounting-principles label {2}"},null,{"$f":"\"/notes-general-accounting-principles \" & INDEX(labels!A56:C56,1,MATCH(PP_Language,labels!A1:C1,0)) & \" \" & BasisOfPreparationAxis & \"  {\"&COLUMN(D185)&\"}\"","v":"/notes-general-accounting-principles Enkelvoudig Commercial  {4}"}]
["",{"$f":"INDEX(labels!A122:C122,1,MATCH(PP_Language,labels!A1:C1,0))","v":"Beschrijving van de standaarden die eerder worden toegepast dan de uiterste ingangsdata volgens de nieuwe Richtlijnen"},""]
["",{"$f":"INDEX(labels!A123:C123,1,MATCH(PP_Language,labels!A1:C1,0))","v":"Beschrijving van de verschillen en redenen die tot herziening van de indeling en bedragen ten opzichte van voorgaand jaar hebben geleid"},""]
["",{"$f":"INDEX(labels!A124:C124,1,MATCH(PP_Language,labels!A1:C1,0))","v":"Informatieverschaffing over de actuele waarde bij toepassing van de historische prijsgrondslag"},""]
["",{"$f":"INDEX(labels!A125:C125,1,MATCH(PP_Language,labels!A1:C1,0))","v":"Informatieverschaffing over de verschillen tussen de waardering volgens fiscale en commerciële grondslagen"},""]
["",{"$f":"INDEX(labels!A126:C126,1,MATCH(PP_Language,labels!A1:C1,0))","v":"Beschrijving van de mate waarin bij de bepaling van de vervaardigingsprijs rekening is gehouden met indirecte kosten"},""]
["",{"$f":"INDEX(labels!A127:C127,1,MATCH(PP_Language,labels!A1:C1,0))","v":"Beschrijving van de functionele valuta"},""]
["",{"$f":"INDEX(labels!A128:C128,1,MATCH(PP_Language,labels!A1:C1,0))","v":"Beschrijving van de reden waarom de presentatievaluta afwijkt van de functionele valuta"},""]
["",{"$f":"INDEX(labels!A129:C129,1,MATCH(PP_Language,labels!A1:C1,0))","v":"Beschrijving van de reden voor het wijzigen van de presentatievaluta"},""]
["",{"$f":"INDEX(labels!A130:C130,1,MATCH(PP_Language,labels!A1:C1,0))","v":"Informatieverschaffing over afwijkingen in bedragen van het voorgaande boekjaar als gevolg van een herziening"},""]
[""]
["",null,null,null,null,null,null,null,null,null,null,null,null,null,null,null,null,null,null,null,null,null,null,null,null,{"$f":"\"//notes-general-accounting-principles label {\"&COLUMN(B196)&\"}\"","v":"//notes-general-accounting-principles label {2}"},null,{"$f":"\"//notes-general-accounting-principles \" & INDEX(labels!A56:C56,1,MATCH(PP_Language,labels!A1:C1,0)) & \" \" & BasisOfPreparationAxis & \"  {\"&COLUMN(D196)&\"}\"","v":"//notes-general-accounting-principles Enkelvoudig Commercial  {4}"}]
["",{"$f":"INDEX(labels!A131:C131,1,MATCH(PP_Language,labels!A1:C1,0))","v":"Toelichting op de jaarrekening - Algemene grondslagen voor verslaggeving: Schattingswijzigingen"}]
[""]
[""]
["",{"$f":"INDEX(labels!A132:C132,1,MATCH(PP_Language,labels!A1:C1,0))","v":"Toelichting op de aard en de kwantitatieve effecten van een schattingswijziging indien deze van belang is voor de verslagperiode of toekomstige perioden"},"",null,null,null,null,null,null,null,null,null,null,null,null,null,null,null,null,null,null,null,null,null,null,{"$f":"\"/notes-general-accounting-principles-change-accounting-estimates label {\"&COLUMN(B200)&\"}\"","v":"/notes-general-accounting-principles-change-accounting-estimates label {2}"},null,{"$f":"\"/notes-general-accounting-principles-change-accounting-estimates \" & INDEX(labels!A56:C56,1,MATCH(PP_Language,labels!A1:C1,0)) & \" \" & BasisOfPreparationAxis & \"  {\"&COLUMN(D200)&\"}\"","v":"/notes-general-accounting-principles-change-accounting-estimates Enkelvoudig Commercial  {4}"}]
[""]
["",null,null,null,null,null,null,null,null,null,null,null,null,null,null,null,null,null,null,null,null,null,null,null,null,{"$f":"\"//notes-general-accounting-principles-change-accounting-estimates label {\"&COLUMN(B202)&\"}\"","v":"//notes-general-accounting-principles-change-accounting-estimates label {2}"},null,{"$f":"\"//notes-general-accounting-principles-change-accounting-estimates \" & INDEX(labels!A56:C56,1,MATCH(PP_Language,labels!A1:C1,0)) & \" \" & BasisOfPreparationAxis & \"  {\"&COLUMN(D202)&\"}\"","v":"//notes-general-accounting-principles-change-accounting-estimates Enkelvoudig Commercial  {4}"}]
["",{"$f":"INDEX(labels!A133:C133,1,MATCH(PP_Language,labels!A1:C1,0))","v":"Toelichting op de jaarrekening - Algemene grondslagen voor verslaggeving: Schattingswijzigingen: Specificatie"}]
["",null,null,{"$f":"INDEX(labels!A55:C55,1,MATCH(PP_Language,labels!A1:C1,0))","v":"Huidig"}]
[""]
["",null,null,{"$f":"\" \"  & INDEX(labels!A56:C56,1,MATCH(PP_Language,labels!A1:C1,0)) &  \"  \"  & INDEX(labels!A134:C134,1,MATCH(PP_Language,labels!A1:C1,0)) &  \" \"","v":" Enkelvoudig  Schattingswijziging "},{"$f":"\" \"  & INDEX(labels!A56:C56,1,MATCH(PP_Language,labels!A1:C1,0)) &  \"  \"  & INDEX(labels!A134:C134,1,MATCH(PP_Language,labels!A1:C1,0)) &  \" \"","v":" Enkelvoudig  Schattingswijziging "},{"$f":"\" \"  & INDEX(labels!A56:C56,1,MATCH(PP_Language,labels!A1:C1,0)) &  \"  \"  & INDEX(labels!A134:C134,1,MATCH(PP_Language,labels!A1:C1,0)) &  \" \"","v":" Enkelvoudig  Schattingswijziging "},{"$f":"\" \"  & INDEX(labels!A56:C56,1,MATCH(PP_Language,labels!A1:C1,0)) &  \"  \"  & INDEX(labels!A134:C134,1,MATCH(PP_Language,labels!A1:C1,0)) &  \" \"","v":" Enkelvoudig  Schattingswijziging "},{"$f":"\" \"  & INDEX(labels!A56:C56,1,MATCH(PP_Language,labels!A1:C1,0)) &  \"  \"  & INDEX(labels!A134:C134,1,MATCH(PP_Language,labels!A1:C1,0)) &  \" \"","v":" Enkelvoudig  Schattingswijziging "},null,null,null,null,null,null,null,null,null,null,null,null,null,null,null,null,null,{"$f":"\"/notes-general-accounting-principles-change-accounting-estimates-specification label {\"&COLUMN(B206)&\"}\"","v":"/notes-general-accounting-principles-change-accounting-estimates-specification label {2}"},null,{"$f":"\"/notes-general-accounting-principles-change-accounting-estimates-specification \" & INDEX(labels!A56:C56,1,MATCH(PP_Language,labels!A1:C1,0)) & \" \" & INDEX(labels!A134:C134,1,MATCH(PP_Language,labels!A1:C1,0)) & \" \" & BasisOfPreparationAxis & \"  {\"&COLUMN(D206)&\"}\"","v":"/notes-general-accounting-principles-change-accounting-estimates-specification Enkelvoudig Schattingswijziging Commercial  {4}"},{"$f":"\"/notes-general-accounting-principles-change-accounting-estimates-specification \" & INDEX(labels!A56:C56,1,MATCH(PP_Language,labels!A1:C1,0)) & \" \" & INDEX(labels!A134:C134,1,MATCH(PP_Language,labels!A1:C1,0)) & \" \" & BasisOfPreparationAxis & \"  {\"&COLUMN(E206)&\"}\"","v":"/notes-general-accounting-principles-change-accounting-estimates-specification Enkelvoudig Schattingswijziging Commercial  {5}"},{"$f":"\"/notes-general-accounting-principles-change-accounting-estimates-specification \" & INDEX(labels!A56:C56,1,MATCH(PP_Language,labels!A1:C1,0)) & \" \" & INDEX(labels!A134:C134,1,MATCH(PP_Language,labels!A1:C1,0)) & \" \" & BasisOfPreparationAxis & \"  {\"&COLUMN(F206)&\"}\"","v":"/notes-general-accounting-principles-change-accounting-estimates-specification Enkelvoudig Schattingswijziging Commercial  {6}"},{"$f":"\"/notes-general-accounting-principles-change-accounting-estimates-specification \" & INDEX(labels!A56:C56,1,MATCH(PP_Language,labels!A1:C1,0)) & \" \" & INDEX(labels!A134:C134,1,MATCH(PP_Language,labels!A1:C1,0)) & \" \" & BasisOfPreparationAxis & \"  {\"&COLUMN(G206)&\"}\"","v":"/notes-general-accounting-principles-change-accounting-estimates-specification Enkelvoudig Schattingswijziging Commercial  {7}"},{"$f":"\"/notes-general-accounting-principles-change-accounting-estimates-specification \" & INDEX(labels!A56:C56,1,MATCH(PP_Language,labels!A1:C1,0)) & \" \" & INDEX(labels!A134:C134,1,MATCH(PP_Language,labels!A1:C1,0)) & \" \" & BasisOfPreparationAxis & \"  {\"&COLUMN(H206)&\"}\"","v":"/notes-general-accounting-principles-change-accounting-estimates-specification Enkelvoudig Schattingswijziging Commercial  {8}"}]
["",{"$f":"INDEX(labels!A135:C135,1,MATCH(PP_Language,labels!A1:C1,0))","v":"Omschrijving Schattingswijziging"}]
["",{"$f":"INDEX(labels!A136:C136,1,MATCH(PP_Language,labels!A1:C1,0))","v":"Beschrijving van de schattingswijziging"},""]
["",{"$f":"INDEX(labels!A137:C137,1,MATCH(PP_Language,labels!A1:C1,0))","v":"Beschrijving van het effect van de schattingswijziging op de huidige periode"},""]
["",{"$f":"INDEX(labels!A138:C138,1,MATCH(PP_Language,labels!A1:C1,0))","v":"Beschrijving van de indicatie van het effect van de schattingswijzing op toekomstige periodes"},""]
["",{"$f":"INDEX(labels!A139:C139,1,MATCH(PP_Language,labels!A1:C1,0))","v":"Beschrijving van de vermelding indien het kwantitatieve effect van een schattingswijziging voor de verslagperiode praktisch niet te bepalen is"},""]
["",{"$f":"INDEX(labels!A140:C140,1,MATCH(PP_Language,labels!A1:C1,0))","v":"Beschrijving van het niet kunnen bepalen van een cijfermatige indicatie van de schattingswijzing op toekomstige periodes"},""]
["",{"$f":"INDEX(labels!A141:C141,1,MATCH(PP_Language,labels!A1:C1,0))","v":"Presentatievolgorde"},""]
[""]
["",null,null,null,null,null,null,null,null,null,null,null,null,null,null,null,null,null,null,null,null,null,null,null,null,{"$f":"\"//notes-general-accounting-principles-change-accounting-estimates-specification label {\"&COLUMN(B215)&\"}\"","v":"//notes-general-accounting-principles-change-accounting-estimates-specification label {2}"},null,{"$f":"\"//notes-general-accounting-principles-change-accounting-estimates-specification \" & INDEX(labels!A56:C56,1,MATCH(PP_Language,labels!A1:C1,0)) & \" \" & INDEX(labels!A134:C134,1,MATCH(PP_Language,labels!A1:C1,0)) & \" \" & BasisOfPreparationAxis & \"  {\"&COLUMN(D215)&\"}\"","v":"//notes-general-accounting-principles-change-accounting-estimates-specification Enkelvoudig Schattingswijziging Commercial  {4}"},{"$f":"\"//notes-general-accounting-principles-change-accounting-estimates-specification \" & INDEX(labels!A56:C56,1,MATCH(PP_Language,labels!A1:C1,0)) & \" \" & INDEX(labels!A134:C134,1,MATCH(PP_Language,labels!A1:C1,0)) & \" \" & BasisOfPreparationAxis & \"  {\"&COLUMN(E215)&\"}\"","v":"//notes-general-accounting-principles-change-accounting-estimates-specification Enkelvoudig Schattingswijziging Commercial  {5}"},{"$f":"\"//notes-general-accounting-principles-change-accounting-estimates-specification \" & INDEX(labels!A56:C56,1,MATCH(PP_Language,labels!A1:C1,0)) & \" \" & INDEX(labels!A134:C134,1,MATCH(PP_Language,labels!A1:C1,0)) & \" \" & BasisOfPreparationAxis & \"  {\"&COLUMN(F215)&\"}\"","v":"//notes-general-accounting-principles-change-accounting-estimates-specification Enkelvoudig Schattingswijziging Commercial  {6}"},{"$f":"\"//notes-general-accounting-principles-change-accounting-estimates-specification \" & INDEX(labels!A56:C56,1,MATCH(PP_Language,labels!A1:C1,0)) & \" \" & INDEX(labels!A134:C134,1,MATCH(PP_Language,labels!A1:C1,0)) & \" \" & BasisOfPreparationAxis & \"  {\"&COLUMN(G215)&\"}\"","v":"//notes-general-accounting-principles-change-accounting-estimates-specification Enkelvoudig Schattingswijziging Commercial  {7}"},{"$f":"\"//notes-general-accounting-principles-change-accounting-estimates-specification \" & INDEX(labels!A56:C56,1,MATCH(PP_Language,labels!A1:C1,0)) & \" \" & INDEX(labels!A134:C134,1,MATCH(PP_Language,labels!A1:C1,0)) & \" \" & BasisOfPreparationAxis & \"  {\"&COLUMN(H215)&\"}\"","v":"//notes-general-accounting-principles-change-accounting-estimates-specification Enkelvoudig Schattingswijziging Commercial  {8}"}]
["",{"$f":"INDEX(labels!A142:C142,1,MATCH(PP_Language,labels!A1:C1,0))","v":"Toelichting op de jaarrekening - Algemene grondslagen voor verslaggeving: Stelselwijzigingen"}]
[""]
[""]
["",{"$f":"INDEX(labels!A143:C143,1,MATCH(PP_Language,labels!A1:C1,0))","v":"Informatieverschaffing over stelselwijzigingen"},"",null,null,null,null,null,null,null,null,null,null,null,null,null,null,null,null,null,null,null,null,null,null,{"$f":"\"/notes-general-accounting-principles-change-accounting-policies label {\"&COLUMN(B219)&\"}\"","v":"/notes-general-accounting-principles-change-accounting-policies label {2}"},null,{"$f":"\"/notes-general-accounting-principles-change-accounting-policies \" & INDEX(labels!A56:C56,1,MATCH(PP_Language,labels!A1:C1,0)) & \" \" & BasisOfPreparationAxis & \"  {\"&COLUMN(D219)&\"}\"","v":"/notes-general-accounting-principles-change-accounting-policies Enkelvoudig Commercial  {4}"}]
["",{"$f":"INDEX(labels!A144:C144,1,MATCH(PP_Language,labels!A1:C1,0))","v":"Beschrijving van de betekenis van de stelselwijziging indien het praktisch niet mogelijk is om het effect te kwantificeren"},""]
[""]
["",null,null,null,null,null,null,null,null,null,null,null,null,null,null,null,null,null,null,null,null,null,null,null,null,{"$f":"\"//notes-general-accounting-principles-change-accounting-policies label {\"&COLUMN(B222)&\"}\"","v":"//notes-general-accounting-principles-change-accounting-policies label {2}"},null,{"$f":"\"//notes-general-accounting-principles-change-accounting-policies \" & INDEX(labels!A56:C56,1,MATCH(PP_Language,labels!A1:C1,0)) & \" \" & BasisOfPreparationAxis & \"  {\"&COLUMN(D222)&\"}\"","v":"//notes-general-accounting-principles-change-accounting-policies Enkelvoudig Commercial  {4}"}]
["",{"$f":"INDEX(labels!A145:C145,1,MATCH(PP_Language,labels!A1:C1,0))","v":"Toelichting op de jaarrekening - Algemene grondslagen voor verslaggeving: Stelselwijzigingen: Specificatie"}]
["",null,null,{"$f":"INDEX(labels!A55:C55,1,MATCH(PP_Language,labels!A1:C1,0))","v":"Huidig"}]
[""]
["",null,null,{"$f":"\" \"  & INDEX(labels!A56:C56,1,MATCH(PP_Language,labels!A1:C1,0)) &  \"  \"  & INDEX(labels!A146:C146,1,MATCH(PP_Language,labels!A1:C1,0)) &  \" \"","v":" Enkelvoudig  Stelselwijziging "},{"$f":"\" \"  & INDEX(labels!A56:C56,1,MATCH(PP_Language,labels!A1:C1,0)) &  \"  \"  & INDEX(labels!A146:C146,1,MATCH(PP_Language,labels!A1:C1,0)) &  \" \"","v":" Enkelvoudig  Stelselwijziging "},{"$f":"\" \"  & INDEX(labels!A56:C56,1,MATCH(PP_Language,labels!A1:C1,0)) &  \"  \"  & INDEX(labels!A146:C146,1,MATCH(PP_Language,labels!A1:C1,0)) &  \" \"","v":" Enkelvoudig  Stelselwijziging "},{"$f":"\" \"  & INDEX(labels!A56:C56,1,MATCH(PP_Language,labels!A1:C1,0)) &  \"  \"  & INDEX(labels!A146:C146,1,MATCH(PP_Language,labels!A1:C1,0)) &  \" \"","v":" Enkelvoudig  Stelselwijziging "},{"$f":"\" \"  & INDEX(labels!A56:C56,1,MATCH(PP_Language,labels!A1:C1,0)) &  \"  \"  & INDEX(labels!A146:C146,1,MATCH(PP_Language,labels!A1:C1,0)) &  \" \"","v":" Enkelvoudig  Stelselwijziging "},null,null,null,null,null,null,null,null,null,null,null,null,null,null,null,null,null,{"$f":"\"/notes-general-accounting-principles-change-accounting-policies-specification label {\"&COLUMN(B226)&\"}\"","v":"/notes-general-accounting-principles-change-accounting-policies-specification label {2}"},null,{"$f":"\"/notes-general-accounting-principles-change-accounting-policies-specification \" & INDEX(labels!A56:C56,1,MATCH(PP_Language,labels!A1:C1,0)) & \" \" & INDEX(labels!A146:C146,1,MATCH(PP_Language,labels!A1:C1,0)) & \" \" & BasisOfPreparationAxis & \"  {\"&COLUMN(D226)&\"}\"","v":"/notes-general-accounting-principles-change-accounting-policies-specification Enkelvoudig Stelselwijziging Commercial  {4}"},{"$f":"\"/notes-general-accounting-principles-change-accounting-policies-specification \" & INDEX(labels!A56:C56,1,MATCH(PP_Language,labels!A1:C1,0)) & \" \" & INDEX(labels!A146:C146,1,MATCH(PP_Language,labels!A1:C1,0)) & \" \" & BasisOfPreparationAxis & \"  {\"&COLUMN(E226)&\"}\"","v":"/notes-general-accounting-principles-change-accounting-policies-specification Enkelvoudig Stelselwijziging Commercial  {5}"},{"$f":"\"/notes-general-accounting-principles-change-accounting-policies-specification \" & INDEX(labels!A56:C56,1,MATCH(PP_Language,labels!A1:C1,0)) & \" \" & INDEX(labels!A146:C146,1,MATCH(PP_Language,labels!A1:C1,0)) & \" \" & BasisOfPreparationAxis & \"  {\"&COLUMN(F226)&\"}\"","v":"/notes-general-accounting-principles-change-accounting-policies-specification Enkelvoudig Stelselwijziging Commercial  {6}"},{"$f":"\"/notes-general-accounting-principles-change-accounting-policies-specification \" & INDEX(labels!A56:C56,1,MATCH(PP_Language,labels!A1:C1,0)) & \" \" & INDEX(labels!A146:C146,1,MATCH(PP_Language,labels!A1:C1,0)) & \" \" & BasisOfPreparationAxis & \"  {\"&COLUMN(G226)&\"}\"","v":"/notes-general-accounting-principles-change-accounting-policies-specification Enkelvoudig Stelselwijziging Commercial  {7}"},{"$f":"\"/notes-general-accounting-principles-change-accounting-policies-specification \" & INDEX(labels!A56:C56,1,MATCH(PP_Language,labels!A1:C1,0)) & \" \" & INDEX(labels!A146:C146,1,MATCH(PP_Language,labels!A1:C1,0)) & \" \" & BasisOfPreparationAxis & \"  {\"&COLUMN(H226)&\"}\"","v":"/notes-general-accounting-principles-change-accounting-policies-specification Enkelvoudig Stelselwijziging Commercial  {8}"}]
["",{"$f":"INDEX(labels!A147:C147,1,MATCH(PP_Language,labels!A1:C1,0))","v":"Omschrijving Stelselwijziging"}]
["",{"$f":"INDEX(labels!A148:C148,1,MATCH(PP_Language,labels!A1:C1,0))","v":"Beschrijving van de reden tot het doorvoeren van een stelselwijziging"},""]
["",{"$f":"INDEX(labels!A149:C149,1,MATCH(PP_Language,labels!A1:C1,0))","v":"Beschrijving van de wijze van verwerken van de effecten van de stelselwijziging"},""]
["",{"$f":"INDEX(labels!A150:C150,1,MATCH(PP_Language,labels!A1:C1,0))","v":"Beschrijving van de betekenis van de stelselwijziging voor vermogen en resultaat"},""]
["",{"$f":"INDEX(labels!A151:C151,1,MATCH(PP_Language,labels!A1:C1,0))","v":"Beschrijving van de betekenis van de stelselwijziging op individuele posten"},""]
["",{"$f":"INDEX(labels!A152:C152,1,MATCH(PP_Language,labels!A1:C1,0))","v":"Beschrijving van de cijfermatige invloed van een stelselwijziging op één of meer volgende boekjaren"},""]
["",{"$f":"INDEX(labels!A141:C141,1,MATCH(PP_Language,labels!A1:C1,0))","v":"Presentatievolgorde"},""]
[""]
["",null,null,null,null,null,null,null,null,null,null,null,null,null,null,null,null,null,null,null,null,null,null,null,null,{"$f":"\"//notes-general-accounting-principles-change-accounting-policies-specification label {\"&COLUMN(B235)&\"}\"","v":"//notes-general-accounting-principles-change-accounting-policies-specification label {2}"},null,{"$f":"\"//notes-general-accounting-principles-change-accounting-policies-specification \" & INDEX(labels!A56:C56,1,MATCH(PP_Language,labels!A1:C1,0)) & \" \" & INDEX(labels!A146:C146,1,MATCH(PP_Language,labels!A1:C1,0)) & \" \" & BasisOfPreparationAxis & \"  {\"&COLUMN(D235)&\"}\"","v":"//notes-general-accounting-principles-change-accounting-policies-specification Enkelvoudig Stelselwijziging Commercial  {4}"},{"$f":"\"//notes-general-accounting-principles-change-accounting-policies-specification \" & INDEX(labels!A56:C56,1,MATCH(PP_Language,labels!A1:C1,0)) & \" \" & INDEX(labels!A146:C146,1,MATCH(PP_Language,labels!A1:C1,0)) & \" \" & BasisOfPreparationAxis & \"  {\"&COLUMN(E235)&\"}\"","v":"//notes-general-accounting-principles-change-accounting-policies-specification Enkelvoudig Stelselwijziging Commercial  {5}"},{"$f":"\"//notes-general-accounting-principles-change-accounting-policies-specification \" & INDEX(labels!A56:C56,1,MATCH(PP_Language,labels!A1:C1,0)) & \" \" & INDEX(labels!A146:C146,1,MATCH(PP_Language,labels!A1:C1,0)) & \" \" & BasisOfPreparationAxis & \"  {\"&COLUMN(F235)&\"}\"","v":"//notes-general-accounting-principles-change-accounting-policies-specification Enkelvoudig Stelselwijziging Commercial  {6}"},{"$f":"\"//notes-general-accounting-principles-change-accounting-policies-specification \" & INDEX(labels!A56:C56,1,MATCH(PP_Language,labels!A1:C1,0)) & \" \" & INDEX(labels!A146:C146,1,MATCH(PP_Language,labels!A1:C1,0)) & \" \" & BasisOfPreparationAxis & \"  {\"&COLUMN(G235)&\"}\"","v":"//notes-general-accounting-principles-change-accounting-policies-specification Enkelvoudig Stelselwijziging Commercial  {7}"},{"$f":"\"//notes-general-accounting-principles-change-accounting-policies-specification \" & INDEX(labels!A56:C56,1,MATCH(PP_Language,labels!A1:C1,0)) & \" \" & INDEX(labels!A146:C146,1,MATCH(PP_Language,labels!A1:C1,0)) & \" \" & BasisOfPreparationAxis & \"  {\"&COLUMN(H235)&\"}\"","v":"//notes-general-accounting-principles-change-accounting-policies-specification Enkelvoudig Stelselwijziging Commercial  {8}"}]
["",{"$f":"INDEX(labels!A153:C153,1,MATCH(PP_Language,labels!A1:C1,0))","v":"Toelichting op de jaarrekening - Algemene grondslagen voor verslaggeving: Foutherstel"}]
[""]
[""]
["",{"$f":"INDEX(labels!A154:C154,1,MATCH(PP_Language,labels!A1:C1,0))","v":"Informatieverschaffing over foutherstel"},"",null,null,null,null,null,null,null,null,null,null,null,null,null,null,null,null,null,null,null,null,null,null,{"$f":"\"/notes-general-accounting-principles-prior-period-errors label {\"&COLUMN(B239)&\"}\"","v":"/notes-general-accounting-principles-prior-period-errors label {2}"},null,{"$f":"\"/notes-general-accounting-principles-prior-period-errors \" & INDEX(labels!A56:C56,1,MATCH(PP_Language,labels!A1:C1,0)) & \" \" & BasisOfPreparationAxis & \"  {\"&COLUMN(D239)&\"}\"","v":"/notes-general-accounting-principles-prior-period-errors Enkelvoudig Commercial  {4}"}]
[""]
["",null,null,null,null,null,null,null,null,null,null,null,null,null,null,null,null,null,null,null,null,null,null,null,null,{"$f":"\"//notes-general-accounting-principles-prior-period-errors label {\"&COLUMN(B241)&\"}\"","v":"//notes-general-accounting-principles-prior-period-errors label {2}"},null,{"$f":"\"//notes-general-accounting-principles-prior-period-errors \" & INDEX(labels!A56:C56,1,MATCH(PP_Language,labels!A1:C1,0)) & \" \" & BasisOfPreparationAxis & \"  {\"&COLUMN(D241)&\"}\"","v":"//notes-general-accounting-principles-prior-period-errors Enkelvoudig Commercial  {4}"}]
["",{"$f":"INDEX(labels!A155:C155,1,MATCH(PP_Language,labels!A1:C1,0))","v":"Toelichting op de jaarrekening - Algemene grondslagen voor verslaggeving: Foutherstel: Specificatie"}]
["",null,null,{"$f":"INDEX(labels!A55:C55,1,MATCH(PP_Language,labels!A1:C1,0))","v":"Huidig"}]
[""]
["",null,null,{"$f":"\" \"  & INDEX(labels!A56:C56,1,MATCH(PP_Language,labels!A1:C1,0)) &  \"  \"  & INDEX(labels!A156:C156,1,MATCH(PP_Language,labels!A1:C1,0)) &  \" \"","v":" Enkelvoudig  Foutenherstel "},{"$f":"\" \"  & INDEX(labels!A56:C56,1,MATCH(PP_Language,labels!A1:C1,0)) &  \"  \"  & INDEX(labels!A156:C156,1,MATCH(PP_Language,labels!A1:C1,0)) &  \" \"","v":" Enkelvoudig  Foutenherstel "},{"$f":"\" \"  & INDEX(labels!A56:C56,1,MATCH(PP_Language,labels!A1:C1,0)) &  \"  \"  & INDEX(labels!A156:C156,1,MATCH(PP_Language,labels!A1:C1,0)) &  \" \"","v":" Enkelvoudig  Foutenherstel "},{"$f":"\" \"  & INDEX(labels!A56:C56,1,MATCH(PP_Language,labels!A1:C1,0)) &  \"  \"  & INDEX(labels!A156:C156,1,MATCH(PP_Language,labels!A1:C1,0)) &  \" \"","v":" Enkelvoudig  Foutenherstel "},{"$f":"\" \"  & INDEX(labels!A56:C56,1,MATCH(PP_Language,labels!A1:C1,0)) &  \"  \"  & INDEX(labels!A156:C156,1,MATCH(PP_Language,labels!A1:C1,0)) &  \" \"","v":" Enkelvoudig  Foutenherstel "},null,null,null,null,null,null,null,null,null,null,null,null,null,null,null,null,null,{"$f":"\"/notes-general-accounting-principles-prior-period-errors-specification label {\"&COLUMN(B245)&\"}\"","v":"/notes-general-accounting-principles-prior-period-errors-specification label {2}"},null,{"$f":"\"/notes-general-accounting-principles-prior-period-errors-specification \" & INDEX(labels!A56:C56,1,MATCH(PP_Language,labels!A1:C1,0)) & \" \" & INDEX(labels!A156:C156,1,MATCH(PP_Language,labels!A1:C1,0)) & \" \" & BasisOfPreparationAxis & \"  {\"&COLUMN(D245)&\"}\"","v":"/notes-general-accounting-principles-prior-period-errors-specification Enkelvoudig Foutenherstel Commercial  {4}"},{"$f":"\"/notes-general-accounting-principles-prior-period-errors-specification \" & INDEX(labels!A56:C56,1,MATCH(PP_Language,labels!A1:C1,0)) & \" \" & INDEX(labels!A156:C156,1,MATCH(PP_Language,labels!A1:C1,0)) & \" \" & BasisOfPreparationAxis & \"  {\"&COLUMN(E245)&\"}\"","v":"/notes-general-accounting-principles-prior-period-errors-specification Enkelvoudig Foutenherstel Commercial  {5}"},{"$f":"\"/notes-general-accounting-principles-prior-period-errors-specification \" & INDEX(labels!A56:C56,1,MATCH(PP_Language,labels!A1:C1,0)) & \" \" & INDEX(labels!A156:C156,1,MATCH(PP_Language,labels!A1:C1,0)) & \" \" & BasisOfPreparationAxis & \"  {\"&COLUMN(F245)&\"}\"","v":"/notes-general-accounting-principles-prior-period-errors-specification Enkelvoudig Foutenherstel Commercial  {6}"},{"$f":"\"/notes-general-accounting-principles-prior-period-errors-specification \" & INDEX(labels!A56:C56,1,MATCH(PP_Language,labels!A1:C1,0)) & \" \" & INDEX(labels!A156:C156,1,MATCH(PP_Language,labels!A1:C1,0)) & \" \" & BasisOfPreparationAxis & \"  {\"&COLUMN(G245)&\"}\"","v":"/notes-general-accounting-principles-prior-period-errors-specification Enkelvoudig Foutenherstel Commercial  {7}"},{"$f":"\"/notes-general-accounting-principles-prior-period-errors-specification \" & INDEX(labels!A56:C56,1,MATCH(PP_Language,labels!A1:C1,0)) & \" \" & INDEX(labels!A156:C156,1,MATCH(PP_Language,labels!A1:C1,0)) & \" \" & BasisOfPreparationAxis & \"  {\"&COLUMN(H245)&\"}\"","v":"/notes-general-accounting-principles-prior-period-errors-specification Enkelvoudig Foutenherstel Commercial  {8}"}]
["",{"$f":"INDEX(labels!A157:C157,1,MATCH(PP_Language,labels!A1:C1,0))","v":"Omschrijving Foutenherstel"}]
["",{"$f":"INDEX(labels!A158:C158,1,MATCH(PP_Language,labels!A1:C1,0))","v":"Beschrijving van de aard en omvang van de materiële fout"},""]
["",{"$f":"INDEX(labels!A159:C159,1,MATCH(PP_Language,labels!A1:C1,0))","v":"Beschrijving van het effect van het herstel van de materiële fout"},""]
["",{"$f":"INDEX(labels!A141:C141,1,MATCH(PP_Language,labels!A1:C1,0))","v":"Presentatievolgorde"},""]
[""]
["",null,null,null,null,null,null,null,null,null,null,null,null,null,null,null,null,null,null,null,null,null,null,null,null,{"$f":"\"//notes-general-accounting-principles-prior-period-errors-specification label {\"&COLUMN(B251)&\"}\"","v":"//notes-general-accounting-principles-prior-period-errors-specification label {2}"},null,{"$f":"\"//notes-general-accounting-principles-prior-period-errors-specification \" & INDEX(labels!A56:C56,1,MATCH(PP_Language,labels!A1:C1,0)) & \" \" & INDEX(labels!A156:C156,1,MATCH(PP_Language,labels!A1:C1,0)) & \" \" & BasisOfPreparationAxis & \"  {\"&COLUMN(D251)&\"}\"","v":"//notes-general-accounting-principles-prior-period-errors-specification Enkelvoudig Foutenherstel Commercial  {4}"},{"$f":"\"//notes-general-accounting-principles-prior-period-errors-specification \" & INDEX(labels!A56:C56,1,MATCH(PP_Language,labels!A1:C1,0)) & \" \" & INDEX(labels!A156:C156,1,MATCH(PP_Language,labels!A1:C1,0)) & \" \" & BasisOfPreparationAxis & \"  {\"&COLUMN(E251)&\"}\"","v":"//notes-general-accounting-principles-prior-period-errors-specification Enkelvoudig Foutenherstel Commercial  {5}"},{"$f":"\"//notes-general-accounting-principles-prior-period-errors-specification \" & INDEX(labels!A56:C56,1,MATCH(PP_Language,labels!A1:C1,0)) & \" \" & INDEX(labels!A156:C156,1,MATCH(PP_Language,labels!A1:C1,0)) & \" \" & BasisOfPreparationAxis & \"  {\"&COLUMN(F251)&\"}\"","v":"//notes-general-accounting-principles-prior-period-errors-specification Enkelvoudig Foutenherstel Commercial  {6}"},{"$f":"\"//notes-general-accounting-principles-prior-period-errors-specification \" & INDEX(labels!A56:C56,1,MATCH(PP_Language,labels!A1:C1,0)) & \" \" & INDEX(labels!A156:C156,1,MATCH(PP_Language,labels!A1:C1,0)) & \" \" & BasisOfPreparationAxis & \"  {\"&COLUMN(G251)&\"}\"","v":"//notes-general-accounting-principles-prior-period-errors-specification Enkelvoudig Foutenherstel Commercial  {7}"},{"$f":"\"//notes-general-accounting-principles-prior-period-errors-specification \" & INDEX(labels!A56:C56,1,MATCH(PP_Language,labels!A1:C1,0)) & \" \" & INDEX(labels!A156:C156,1,MATCH(PP_Language,labels!A1:C1,0)) & \" \" & BasisOfPreparationAxis & \"  {\"&COLUMN(H251)&\"}\"","v":"//notes-general-accounting-principles-prior-period-errors-specification Enkelvoudig Foutenherstel Commercial  {8}"}]
["",{"$f":"INDEX(labels!A160:C160,1,MATCH(PP_Language,labels!A1:C1,0))","v":"Toelichting op de jaarrekening - Algemene grondslagen voor verslaggeving: Omrekening van vreemde valuta"}]
[""]
[""]
["",{"$f":"INDEX(labels!A161:C161,1,MATCH(PP_Language,labels!A1:C1,0))","v":"Grondslag van omrekening van in vreemde valuta luidende bedragen"},"",null,null,null,null,null,null,null,null,null,null,null,null,null,null,null,null,null,null,null,null,null,null,{"$f":"\"/notes-general-accounting-principles-foreign-currency-translation label {\"&COLUMN(B255)&\"}\"","v":"/notes-general-accounting-principles-foreign-currency-translation label {2}"},null,{"$f":"\"/notes-general-accounting-principles-foreign-currency-translation \" & INDEX(labels!A56:C56,1,MATCH(PP_Language,labels!A1:C1,0)) & \" \" & BasisOfPreparationAxis & \"  {\"&COLUMN(D255)&\"}\"","v":"/notes-general-accounting-principles-foreign-currency-translation Enkelvoudig Commercial  {4}"}]
["",{"$f":"INDEX(labels!A162:C162,1,MATCH(PP_Language,labels!A1:C1,0))","v":"Grondslag van de wijze van omrekening en de verwerking van valutakoersverschillen met betrekking tot transacties in vreemde valuta voor de balans"},""]
["",{"$f":"INDEX(labels!A163:C163,1,MATCH(PP_Language,labels!A1:C1,0))","v":"Grondslag van omrekening inzake hyperinflatie bij bedrijfsuitoefening in het buitenland"},""]
["",{"$f":"INDEX(labels!A164:C164,1,MATCH(PP_Language,labels!A1:C1,0))","v":"Grondslag van de wijze van omrekening en de verwerking van valutakoersverschillen met betrekking tot transacties in vreemde valuta"},""]
["",{"$f":"INDEX(labels!A165:C165,1,MATCH(PP_Language,labels!A1:C1,0))","v":"Grondslag van de wijze van omrekening en de verwerking van valutakoersverschillen met betrekking tot bedrijfsuitoefening in het buitenland"},""]
["",{"$f":"INDEX(labels!A166:C166,1,MATCH(PP_Language,labels!A1:C1,0))","v":"Grondslag van de wijze van omrekening en de verwerking van valutakoersverschillen met betrekking tot bedrijfsuitoefening in het buitenland voor de balans"},""]
["",{"$f":"INDEX(labels!A167:C167,1,MATCH(PP_Language,labels!A1:C1,0))","v":"Grondslag van de wijze van omrekening en de verwerking van valutakoersverschillen met betrekking tot bedrijfsuitoefening in het buitenland voor de winst-en-verliesrekening"},""]
["",{"$f":"INDEX(labels!A168:C168,1,MATCH(PP_Language,labels!A1:C1,0))","v":"Grondslag van de wijze van omrekening en de verwerking van valutakoersverschillen met betrekking tot goodwill en de aanpassing naar reële waarde voor de verwerving van een bedrijfsuitoefening in het buitenland voor de balans"},""]
["",{"$f":"INDEX(labels!A169:C169,1,MATCH(PP_Language,labels!A1:C1,0))","v":"Grondslag van de wijze van omrekening en de verwerking van valutakoersverschillen met betrekking tot goodwill en de aanpassing naar reële waarde voor de verwerving van een bedrijfsuitoefening in het buitenland voor de winst-en-verliesrekening"},""]
["",{"$f":"INDEX(labels!A170:C170,1,MATCH(PP_Language,labels!A1:C1,0))","v":"Grondslag van de wijze van omrekening en de verwerking van valutakoersverschillen met betrekking tot goodwill en de aanpassing naar reële waarde voor de verwerving van een bedrijfsuitoefening in het buitenland"},""]
[""]
["",null,null,null,null,null,null,null,null,null,null,null,null,null,null,null,null,null,null,null,null,null,null,null,null,{"$f":"\"//notes-general-accounting-principles-foreign-currency-translation label {\"&COLUMN(B266)&\"}\"","v":"//notes-general-accounting-principles-foreign-currency-translation label {2}"},null,{"$f":"\"//notes-general-accounting-principles-foreign-currency-translation \" & INDEX(labels!A56:C56,1,MATCH(PP_Language,labels!A1:C1,0)) & \" \" & BasisOfPreparationAxis & \"  {\"&COLUMN(D266)&\"}\"","v":"//notes-general-accounting-principles-foreign-currency-translation Enkelvoudig Commercial  {4}"}]
["",{"$f":"INDEX(labels!A171:C171,1,MATCH(PP_Language,labels!A1:C1,0))","v":"Toelichting op de jaarrekening - Algemene grondslagen voor verslaggeving: Leases"}]
[""]
[""]
["",{"$f":"INDEX(labels!A172:C172,1,MATCH(PP_Language,labels!A1:C1,0))","v":"Grondslag van leases"},"",null,null,null,null,null,null,null,null,null,null,null,null,null,null,null,null,null,null,null,null,null,null,{"$f":"\"/notes-general-accounting-principles-leases label {\"&COLUMN(B270)&\"}\"","v":"/notes-general-accounting-principles-leases label {2}"},null,{"$f":"\"/notes-general-accounting-principles-leases \" & INDEX(labels!A56:C56,1,MATCH(PP_Language,labels!A1:C1,0)) & \" \" & BasisOfPreparationAxis & \"  {\"&COLUMN(D270)&\"}\"","v":"/notes-general-accounting-principles-leases Enkelvoudig Commercial  {4}"}]
["",{"$f":"INDEX(labels!A173:C173,1,MATCH(PP_Language,labels!A1:C1,0))","v":"Grondslag van financiële leases"},""]
["",{"$f":"INDEX(labels!A174:C174,1,MATCH(PP_Language,labels!A1:C1,0))","v":"Grondslag van operationele leases"},""]
[""]
["",null,null,null,null,null,null,null,null,null,null,null,null,null,null,null,null,null,null,null,null,null,null,null,null,{"$f":"\"//notes-general-accounting-principles-leases label {\"&COLUMN(B274)&\"}\"","v":"//notes-general-accounting-principles-leases label {2}"},null,{"$f":"\"//notes-general-accounting-principles-leases \" & INDEX(labels!A56:C56,1,MATCH(PP_Language,labels!A1:C1,0)) & \" \" & BasisOfPreparationAxis & \"  {\"&COLUMN(D274)&\"}\"","v":"//notes-general-accounting-principles-leases Enkelvoudig Commercial  {4}"}]
["",{"$f":"INDEX(labels!A175:C175,1,MATCH(PP_Language,labels!A1:C1,0))","v":"Toelichting op de jaarrekening - Algemene grondslagen voor verslaggeving: Op aandelen gebaseerde betalingen"}]
[""]
[""]
["",{"$f":"INDEX(labels!A176:C176,1,MATCH(PP_Language,labels!A1:C1,0))","v":"Grondslag van op aandelen gebaseerde betalingen"},"",null,null,null,null,null,null,null,null,null,null,null,null,null,null,null,null,null,null,null,null,null,null,{"$f":"\"/notes-general-accounting-principles-share-based-payments label {\"&COLUMN(B278)&\"}\"","v":"/notes-general-accounting-principles-share-based-payments label {2}"},null,{"$f":"\"/notes-general-accounting-principles-share-based-payments \" & INDEX(labels!A56:C56,1,MATCH(PP_Language,labels!A1:C1,0)) & \" \" & BasisOfPreparationAxis & \"  {\"&COLUMN(D278)&\"}\"","v":"/notes-general-accounting-principles-share-based-payments Enkelvoudig Commercial  {4}"}]
[""]
["",null,null,null,null,null,null,null,null,null,null,null,null,null,null,null,null,null,null,null,null,null,null,null,null,{"$f":"\"//notes-general-accounting-principles-share-based-payments label {\"&COLUMN(B280)&\"}\"","v":"//notes-general-accounting-principles-share-based-payments label {2}"},null,{"$f":"\"//notes-general-accounting-principles-share-based-payments \" & INDEX(labels!A56:C56,1,MATCH(PP_Language,labels!A1:C1,0)) & \" \" & BasisOfPreparationAxis & \"  {\"&COLUMN(D280)&\"}\"","v":"//notes-general-accounting-principles-share-based-payments Enkelvoudig Commercial  {4}"}]
["",{"$f":"INDEX(labels!A177:C177,1,MATCH(PP_Language,labels!A1:C1,0))","v":"Toelichting op de jaarrekening - Algemene grondslagen voor verslaggeving: Bijzondere posten"}]
[""]
[""]
["",{"$f":"INDEX(labels!A178:C178,1,MATCH(PP_Language,labels!A1:C1,0))","v":"Grondslag van bijzondere posten"},"",null,null,null,null,null,null,null,null,null,null,null,null,null,null,null,null,null,null,null,null,null,null,{"$f":"\"/notes-general-accounting-principles-exceptional-items label {\"&COLUMN(B284)&\"}\"","v":"/notes-general-accounting-principles-exceptional-items label {2}"},null,{"$f":"\"/notes-general-accounting-principles-exceptional-items \" & INDEX(labels!A56:C56,1,MATCH(PP_Language,labels!A1:C1,0)) & \" \" & BasisOfPreparationAxis & \"  {\"&COLUMN(D284)&\"}\"","v":"/notes-general-accounting-principles-exceptional-items Enkelvoudig Commercial  {4}"}]
[""]
["",null,null,null,null,null,null,null,null,null,null,null,null,null,null,null,null,null,null,null,null,null,null,null,null,{"$f":"\"//notes-general-accounting-principles-exceptional-items label {\"&COLUMN(B286)&\"}\"","v":"//notes-general-accounting-principles-exceptional-items label {2}"},null,{"$f":"\"//notes-general-accounting-principles-exceptional-items \" & INDEX(labels!A56:C56,1,MATCH(PP_Language,labels!A1:C1,0)) & \" \" & BasisOfPreparationAxis & \"  {\"&COLUMN(D286)&\"}\"","v":"//notes-general-accounting-principles-exceptional-items Enkelvoudig Commercial  {4}"}]
["",{"$f":"INDEX(labels!A179:C179,1,MATCH(PP_Language,labels!A1:C1,0))","v":"Toelichting op de jaarrekening - Algemene grondslagen voor verslaggeving: Pensioenregelingen"}]
[""]
[""]
["",{"$f":"INDEX(labels!A180:C180,1,MATCH(PP_Language,labels!A1:C1,0))","v":"Grondslag van pensioenregelingen"},"",null,null,null,null,null,null,null,null,null,null,null,null,null,null,null,null,null,null,null,null,null,null,{"$f":"\"/notes-general-accounting-principles-pension-arrangements label {\"&COLUMN(B290)&\"}\"","v":"/notes-general-accounting-principles-pension-arrangements label {2}"},null,{"$f":"\"/notes-general-accounting-principles-pension-arrangements \" & INDEX(labels!A56:C56,1,MATCH(PP_Language,labels!A1:C1,0)) & \" \" & BasisOfPreparationAxis & \"  {\"&COLUMN(D290)&\"}\"","v":"/notes-general-accounting-principles-pension-arrangements Enkelvoudig Commercial  {4}"}]
[""]
["",null,null,null,null,null,null,null,null,null,null,null,null,null,null,null,null,null,null,null,null,null,null,null,null,{"$f":"\"//notes-general-accounting-principles-pension-arrangements label {\"&COLUMN(B292)&\"}\"","v":"//notes-general-accounting-principles-pension-arrangements label {2}"},null,{"$f":"\"//notes-general-accounting-principles-pension-arrangements \" & INDEX(labels!A56:C56,1,MATCH(PP_Language,labels!A1:C1,0)) & \" \" & BasisOfPreparationAxis & \"  {\"&COLUMN(D292)&\"}\"","v":"//notes-general-accounting-principles-pension-arrangements Enkelvoudig Commercial  {4}"}]
["",{"$f":"INDEX(labels!A181:C181,1,MATCH(PP_Language,labels!A1:C1,0))","v":"Toelichting op de jaarrekening - Algemene grondslagen voor verslaggeving: Financiële instrumenten"}]
[""]
[""]
["",{"$f":"INDEX(labels!A182:C182,1,MATCH(PP_Language,labels!A1:C1,0))","v":"Grondslag van financiële instrumenten"},"",null,null,null,null,null,null,null,null,null,null,null,null,null,null,null,null,null,null,null,null,null,null,{"$f":"\"/notes-general-accounting-principles-financial-instruments label {\"&COLUMN(B296)&\"}\"","v":"/notes-general-accounting-principles-financial-instruments label {2}"},null,{"$f":"\"/notes-general-accounting-principles-financial-instruments \" & INDEX(labels!A56:C56,1,MATCH(PP_Language,labels!A1:C1,0)) & \" \" & BasisOfPreparationAxis & \"  {\"&COLUMN(D296)&\"}\"","v":"/notes-general-accounting-principles-financial-instruments Enkelvoudig Commercial  {4}"}]
["",{"$f":"INDEX(labels!A183:C183,1,MATCH(PP_Language,labels!A1:C1,0))","v":"Grondslag van hedge accounting van financiële instrumenten"},""]
["",{"$f":"INDEX(labels!A184:C184,1,MATCH(PP_Language,labels!A1:C1,0))","v":"Grondslag van actuele waarde van financiële instrumenten"},""]
[""]
["",null,null,null,null,null,null,null,null,null,null,null,null,null,null,null,null,null,null,null,null,null,null,null,null,{"$f":"\"//notes-general-accounting-principles-financial-instruments label {\"&COLUMN(B300)&\"}\"","v":"//notes-general-accounting-principles-financial-instruments label {2}"},null,{"$f":"\"//notes-general-accounting-principles-financial-instruments \" & INDEX(labels!A56:C56,1,MATCH(PP_Language,labels!A1:C1,0)) & \" \" & BasisOfPreparationAxis & \"  {\"&COLUMN(D300)&\"}\"","v":"//notes-general-accounting-principles-financial-instruments Enkelvoudig Commercial  {4}"}]
["",{"$f":"INDEX(labels!A185:C185,1,MATCH(PP_Language,labels!A1:C1,0))","v":"Grondslagen"}]
["",{"$f":"INDEX(labels!A186:C186,1,MATCH(PP_Language,labels!A1:C1,0))","v":"Toelichting op de jaarrekening - Grondslagen voor de waardering van activa en passiva"}]
[""]
[""]
["",{"$f":"INDEX(labels!A187:C187,1,MATCH(PP_Language,labels!A1:C1,0))","v":"Grondslag van immateriële vaste activa"},"",null,null,null,null,null,null,null,null,null,null,null,null,null,null,null,null,null,null,null,null,null,null,{"$f":"\"/notes-accounting-principles-assets-liabilities label {\"&COLUMN(B305)&\"}\"","v":"/notes-accounting-principles-assets-liabilities label {2}"},null,{"$f":"\"/notes-accounting-principles-assets-liabilities \" & INDEX(labels!A56:C56,1,MATCH(PP_Language,labels!A1:C1,0)) & \" \" & BasisOfPreparationAxis & \"  {\"&COLUMN(D305)&\"}\"","v":"/notes-accounting-principles-assets-liabilities Enkelvoudig Commercial  {4}"}]
["",{"$f":"INDEX(labels!A188:C188,1,MATCH(PP_Language,labels!A1:C1,0))","v":"Grondslag van bijzondere waardeverminderingen van immateriële vaste activa"},""]
["",{"$f":"INDEX(labels!A189:C189,1,MATCH(PP_Language,labels!A1:C1,0))","v":"Grondslag van terugneming van bijzondere waardeverminderingen van immateriële vaste activa"},""]
["",{"$f":"INDEX(labels!A190:C190,1,MATCH(PP_Language,labels!A1:C1,0))","v":"Grondslag van kosten die verband houden met de oprichting en met de uitgifte van aandelen"},""]
["",{"$f":"INDEX(labels!A191:C191,1,MATCH(PP_Language,labels!A1:C1,0))","v":"Grondslag van kosten van ontwikkeling"},""]
["",{"$f":"INDEX(labels!A192:C192,1,MATCH(PP_Language,labels!A1:C1,0))","v":"Grondslag van kosten van verwerving ter zake van concessies, vergunningen en rechten van intellectuele eigendom"},""]
["",{"$f":"INDEX(labels!A193:C193,1,MATCH(PP_Language,labels!A1:C1,0))","v":"Grondslag van kosten van goodwill die van derden is verkregen"},""]
["",{"$f":"INDEX(labels!A194:C194,1,MATCH(PP_Language,labels!A1:C1,0))","v":"Grondslag van vooruitbetalingen op immateriële vaste activa"},""]
["",{"$f":"INDEX(labels!A195:C195,1,MATCH(PP_Language,labels!A1:C1,0))","v":"Grondslag van overige immateriële vaste activa"},""]
["",{"$f":"INDEX(labels!A196:C196,1,MATCH(PP_Language,labels!A1:C1,0))","v":"Grondslag van materiële vaste activa"},""]
["",{"$f":"INDEX(labels!A197:C197,1,MATCH(PP_Language,labels!A1:C1,0))","v":"Grondslag van bijzondere waardeverminderingen van materiële vaste activa"},""]
["",{"$f":"INDEX(labels!A198:C198,1,MATCH(PP_Language,labels!A1:C1,0))","v":"Grondslag van terugneming van bijzondere waardeverminderingen van materiële vaste activa"},""]
["",{"$f":"INDEX(labels!A199:C199,1,MATCH(PP_Language,labels!A1:C1,0))","v":"Grondslag van bedrijfsgebouwen en -terreinen"},""]
["",{"$f":"INDEX(labels!A200:C200,1,MATCH(PP_Language,labels!A1:C1,0))","v":"Grondslag van machines en installaties"},""]
["",{"$f":"INDEX(labels!A201:C201,1,MATCH(PP_Language,labels!A1:C1,0))","v":"Grondslag van andere vaste bedrijfsmiddelen"},""]
["",{"$f":"INDEX(labels!A202:C202,1,MATCH(PP_Language,labels!A1:C1,0))","v":"Grondslag van materiële vaste bedrijfsactiva in uitvoering en vooruitbetalingen op materiële vaste activa"},""]
["",{"$f":"INDEX(labels!A203:C203,1,MATCH(PP_Language,labels!A1:C1,0))","v":"Grondslag van niet aan het productieproces dienstbare materiële vaste activa"},""]
["",{"$f":"INDEX(labels!A204:C204,1,MATCH(PP_Language,labels!A1:C1,0))","v":"Grondslag van de verwerking van kosten van herstel en groot onderhoud"},""]
["",{"$f":"INDEX(labels!A205:C205,1,MATCH(PP_Language,labels!A1:C1,0))","v":"Grondslag van vastgoedbeleggingen"},""]
["",{"$f":"INDEX(labels!A206:C206,1,MATCH(PP_Language,labels!A1:C1,0))","v":"Grondslag van bijzondere waardeverminderingen van vastgoedbeleggingen"},""]
["",{"$f":"INDEX(labels!A207:C207,1,MATCH(PP_Language,labels!A1:C1,0))","v":"Grondslag van vastgoedbeleggingen in exploitatie"},""]
["",{"$f":"INDEX(labels!A208:C208,1,MATCH(PP_Language,labels!A1:C1,0))","v":"Grondslag van vastgoedbeleggingen in ontwikkeling"},""]
["",{"$f":"INDEX(labels!A209:C209,1,MATCH(PP_Language,labels!A1:C1,0))","v":"Grondslag van financiële vaste activa"},""]
["",{"$f":"INDEX(labels!A210:C210,1,MATCH(PP_Language,labels!A1:C1,0))","v":"Grondslag van bijzondere waardeverminderingen van financiële vaste activa"},""]
["",{"$f":"INDEX(labels!A211:C211,1,MATCH(PP_Language,labels!A1:C1,0))","v":"Grondslag van terugneming van bijzondere waardeverminderingen van financiële vaste activa"},""]
["",{"$f":"INDEX(labels!A212:C212,1,MATCH(PP_Language,labels!A1:C1,0))","v":"Grondslag van aandelen, certificaten van aandelen en andere vormen van deelneming in groepsmaatschappijen"},""]
["",{"$f":"INDEX(labels!A213:C213,1,MATCH(PP_Language,labels!A1:C1,0))","v":"Grondslag van deelnemingen in overige verbonden maatschappijen"},""]
["",{"$f":"INDEX(labels!A214:C214,1,MATCH(PP_Language,labels!A1:C1,0))","v":"Grondslag van vorderingen op groepsmaatschappijen"},""]
["",{"$f":"INDEX(labels!A215:C215,1,MATCH(PP_Language,labels!A1:C1,0))","v":"Grondslag van vorderingen op overige verbonden maatschappijen"},""]
["",{"$f":"INDEX(labels!A216:C216,1,MATCH(PP_Language,labels!A1:C1,0))","v":"Grondslag van andere deelnemingen"},""]
["",{"$f":"INDEX(labels!A217:C217,1,MATCH(PP_Language,labels!A1:C1,0))","v":"Grondslag van vorderingen op andere rechtspersonen en vennootschappen die een deelneming hebben in de rechtspersoon of waarin de rechtspersoon een deelneming heeft"},""]
["",{"$f":"INDEX(labels!A218:C218,1,MATCH(PP_Language,labels!A1:C1,0))","v":"Grondslag van vorderingen uit hoofde van leningen en voorschotten aan leden of houders van aandelen op naam"},""]
["",{"$f":"INDEX(labels!A219:C219,1,MATCH(PP_Language,labels!A1:C1,0))","v":"Grondslag van overige effecten"},""]
["",{"$f":"INDEX(labels!A220:C220,1,MATCH(PP_Language,labels!A1:C1,0))","v":"Grondslag van overige vorderingen"},""]
["",{"$f":"INDEX(labels!A221:C221,1,MATCH(PP_Language,labels!A1:C1,0))","v":"Grondslag van latente belastingvorderingen"},""]
["",{"$f":"INDEX(labels!A222:C222,1,MATCH(PP_Language,labels!A1:C1,0))","v":"Grondslag van overige financiële vaste activa"},""]
["",{"$f":"INDEX(labels!A223:C223,1,MATCH(PP_Language,labels!A1:C1,0))","v":"Grondslag van vaste activa"},""]
["",{"$f":"INDEX(labels!A224:C224,1,MATCH(PP_Language,labels!A1:C1,0))","v":"Grondslag van bijzondere waardeverminderingen van vaste activa"},""]
["",{"$f":"INDEX(labels!A225:C225,1,MATCH(PP_Language,labels!A1:C1,0))","v":"Grondslag van terugneming van bijzondere waardeverminderingen van vaste activa"},""]
["",{"$f":"INDEX(labels!A226:C226,1,MATCH(PP_Language,labels!A1:C1,0))","v":"Grondslag van waardeveranderingen van de tot de vaste activa behorende effecten en deelnemingen (debet)"},""]
["",{"$f":"INDEX(labels!A227:C227,1,MATCH(PP_Language,labels!A1:C1,0))","v":"Grondslag van voorraden"},""]
["",{"$f":"INDEX(labels!A228:C228,1,MATCH(PP_Language,labels!A1:C1,0))","v":"Grondslag van de opbrengstwaarde van voorraden"},""]
["",{"$f":"INDEX(labels!A229:C229,1,MATCH(PP_Language,labels!A1:C1,0))","v":"Grondslag van grond- en hulpstoffen"},""]
["",{"$f":"INDEX(labels!A230:C230,1,MATCH(PP_Language,labels!A1:C1,0))","v":"Grondslag van onderhanden werk"},""]
["",{"$f":"INDEX(labels!A231:C231,1,MATCH(PP_Language,labels!A1:C1,0))","v":"Grondslag van gereed product en handelsgoederen"},""]
["",{"$f":"INDEX(labels!A232:C232,1,MATCH(PP_Language,labels!A1:C1,0))","v":"Grondslag van vooruitbetalingen op voorraden"},""]
["",{"$f":"INDEX(labels!A233:C233,1,MATCH(PP_Language,labels!A1:C1,0))","v":"Grondslag van de opbrengstwaarde van agrarische voorraden"},""]
["",{"$f":"INDEX(labels!A234:C234,1,MATCH(PP_Language,labels!A1:C1,0))","v":"Grondslag van onderhanden projecten"},""]
["",{"$f":"INDEX(labels!A235:C235,1,MATCH(PP_Language,labels!A1:C1,0))","v":"Grondslag van vorderingen"},""]
["",{"$f":"INDEX(labels!A236:C236,1,MATCH(PP_Language,labels!A1:C1,0))","v":"Grondslag van vorderingen op handelsdebiteuren"},""]
["",{"$f":"INDEX(labels!A237:C237,1,MATCH(PP_Language,labels!A1:C1,0))","v":"Grondslag van opgevraagde stortingen van geplaatst kapitaal"},""]
["",{"$f":"INDEX(labels!A238:C238,1,MATCH(PP_Language,labels!A1:C1,0))","v":"Grondslag van pensioenvordering"},""]
["",{"$f":"INDEX(labels!A239:C239,1,MATCH(PP_Language,labels!A1:C1,0))","v":"Grondslag van belastingvorderingen"},""]
["",{"$f":"INDEX(labels!A240:C240,1,MATCH(PP_Language,labels!A1:C1,0))","v":"Grondslag van vorderingen uit belastingen naar de winst"},""]
["",{"$f":"INDEX(labels!A241:C241,1,MATCH(PP_Language,labels!A1:C1,0))","v":"Grondslag van overlopende activa"},""]
["",{"$f":"INDEX(labels!A242:C242,1,MATCH(PP_Language,labels!A1:C1,0))","v":"Grondslag van kortlopende effecten"},""]
["",{"$f":"INDEX(labels!A243:C243,1,MATCH(PP_Language,labels!A1:C1,0))","v":"Grondslag van liquide middelen"},""]
["",{"$f":"INDEX(labels!A244:C244,1,MATCH(PP_Language,labels!A1:C1,0))","v":"Grondslag van vlottende activa"},""]
["",{"$f":"INDEX(labels!A245:C245,1,MATCH(PP_Language,labels!A1:C1,0))","v":"Grondslag van eigen vermogen"},""]
["",{"$f":"INDEX(labels!A246:C246,1,MATCH(PP_Language,labels!A1:C1,0))","v":"Grondslag van gestort en opgevraagd aandelenkapitaal"},""]
["",{"$f":"INDEX(labels!A247:C247,1,MATCH(PP_Language,labels!A1:C1,0))","v":"Grondslag van agio"},""]
["",{"$f":"INDEX(labels!A248:C248,1,MATCH(PP_Language,labels!A1:C1,0))","v":"Grondslag van herwaarderingsreserves"},""]
["",{"$f":"INDEX(labels!A249:C249,1,MATCH(PP_Language,labels!A1:C1,0))","v":"Grondslag van andere wettelijke reserves, onderscheiden naar hun aard"},""]
["",{"$f":"INDEX(labels!A250:C250,1,MATCH(PP_Language,labels!A1:C1,0))","v":"Grondslag van statutaire reserves"},""]
["",{"$f":"INDEX(labels!A251:C251,1,MATCH(PP_Language,labels!A1:C1,0))","v":"Grondslag van herinvesteringsreserve"},""]
["",{"$f":"INDEX(labels!A252:C252,1,MATCH(PP_Language,labels!A1:C1,0))","v":"Grondslag van overige reserves"},""]
["",{"$f":"INDEX(labels!A253:C253,1,MATCH(PP_Language,labels!A1:C1,0))","v":"Grondslag van overige fiscale reserves"},""]
["",{"$f":"INDEX(labels!A254:C254,1,MATCH(PP_Language,labels!A1:C1,0))","v":"Grondslag van resultaat na belastingen van het boekjaar"},""]
["",{"$f":"INDEX(labels!A255:C255,1,MATCH(PP_Language,labels!A1:C1,0))","v":"Grondslag van niet verdeelde winsten"},""]
["",{"$f":"INDEX(labels!A256:C256,1,MATCH(PP_Language,labels!A1:C1,0))","v":"Grondslag van voorzieningen"},""]
["",{"$f":"INDEX(labels!A257:C257,1,MATCH(PP_Language,labels!A1:C1,0))","v":"Grondslag van voorziening voor herstelkosten"},""]
["",{"$f":"INDEX(labels!A258:C258,1,MATCH(PP_Language,labels!A1:C1,0))","v":"Grondslag van voorzieningen voor belastingverplichtingen"},""]
["",{"$f":"INDEX(labels!A259:C259,1,MATCH(PP_Language,labels!A1:C1,0))","v":"Grondslag van voorzieningen voor pensioenverplichtingen"},""]
["",{"$f":"INDEX(labels!A260:C260,1,MATCH(PP_Language,labels!A1:C1,0))","v":"Grondslag van voorziening uit hoofde van personeelsbeloningen"},""]
["",{"$f":"INDEX(labels!A261:C261,1,MATCH(PP_Language,labels!A1:C1,0))","v":"Grondslag van voorziening voor opruiming van aanwezige milieuvervuiling"},""]
["",{"$f":"INDEX(labels!A262:C262,1,MATCH(PP_Language,labels!A1:C1,0))","v":"Grondslag van voorziening uit hoofde van claims, geschillen en rechtsgedingen"},""]
["",{"$f":"INDEX(labels!A263:C263,1,MATCH(PP_Language,labels!A1:C1,0))","v":"Grondslag van voorziening voor groot onderhoud"},""]
["",{"$f":"INDEX(labels!A264:C264,1,MATCH(PP_Language,labels!A1:C1,0))","v":"Grondslag van voorziening voor verwijderingsverplichtingen"},""]
["",{"$f":"INDEX(labels!A265:C265,1,MATCH(PP_Language,labels!A1:C1,0))","v":"Grondslag van voorziening voor verlieslatende contracten"},""]
["",{"$f":"INDEX(labels!A266:C266,1,MATCH(PP_Language,labels!A1:C1,0))","v":"Grondslag van voorziening in verband met reorganisaties"},""]
["",{"$f":"INDEX(labels!A267:C267,1,MATCH(PP_Language,labels!A1:C1,0))","v":"Grondslag van voorziening in verband met deelnemingen"},""]
["",{"$f":"INDEX(labels!A268:C268,1,MATCH(PP_Language,labels!A1:C1,0))","v":"Grondslag van latente belastingverplichtingen"},""]
["",{"$f":"INDEX(labels!A269:C269,1,MATCH(PP_Language,labels!A1:C1,0))","v":"Grondslag van garantievoorziening"},""]
["",{"$f":"INDEX(labels!A270:C270,1,MATCH(PP_Language,labels!A1:C1,0))","v":"Grondslag van voorziening voor jubileumuitkeringen"},""]
["",{"$f":"INDEX(labels!A271:C271,1,MATCH(PP_Language,labels!A1:C1,0))","v":"Grondslag van voorziening voor verzekering van arbeidsongeschiktheidsrisico's"},""]
["",{"$f":"INDEX(labels!A272:C272,1,MATCH(PP_Language,labels!A1:C1,0))","v":"Grondslag van voorziening voor verplichtingen uit hoofde van ziekte of arbeidsongeschiktheid"},""]
["",{"$f":"INDEX(labels!A273:C273,1,MATCH(PP_Language,labels!A1:C1,0))","v":"Grondslag van voorziening voor verzekering van ziekte of arbeidsongeschiktheid"},""]
["",{"$f":"INDEX(labels!A274:C274,1,MATCH(PP_Language,labels!A1:C1,0))","v":"Grondslag van voorziening uit hoofde van op aandelen gebaseerde betalingen"},""]
["",{"$f":"INDEX(labels!A275:C275,1,MATCH(PP_Language,labels!A1:C1,0))","v":"Grondslag van overige voorzieningen"},""]
["",{"$f":"INDEX(labels!A276:C276,1,MATCH(PP_Language,labels!A1:C1,0))","v":"Grondslag van langlopende schulden"},""]
["",{"$f":"INDEX(labels!A277:C277,1,MATCH(PP_Language,labels!A1:C1,0))","v":"Grondslag van achtergestelde schulden"},""]
["",{"$f":"INDEX(labels!A278:C278,1,MATCH(PP_Language,labels!A1:C1,0))","v":"Grondslag van converteerbare leningen"},""]
["",{"$f":"INDEX(labels!A279:C279,1,MATCH(PP_Language,labels!A1:C1,0))","v":"Grondslag van obligatieleningen, pandbrieven en andere leningen"},""]
["",{"$f":"INDEX(labels!A280:C280,1,MATCH(PP_Language,labels!A1:C1,0))","v":"Grondslag van financiële leaseverplichtingen"},""]
["",{"$f":"INDEX(labels!A281:C281,1,MATCH(PP_Language,labels!A1:C1,0))","v":"Grondslag van schulden aan banken"},""]
["",{"$f":"INDEX(labels!A282:C282,1,MATCH(PP_Language,labels!A1:C1,0))","v":"Grondslag van ontvangen vooruitbetalingen op bestellingen voor zover niet reeds op actiefposten in mindering gebracht"},""]
["",{"$f":"INDEX(labels!A283:C283,1,MATCH(PP_Language,labels!A1:C1,0))","v":"Grondslag van schulden aan leveranciers en handelskredieten"},""]
["",{"$f":"INDEX(labels!A284:C284,1,MATCH(PP_Language,labels!A1:C1,0))","v":"Grondslag van te betalen wissels en cheques"},""]
["",{"$f":"INDEX(labels!A285:C285,1,MATCH(PP_Language,labels!A1:C1,0))","v":"Grondslag van schulden aan groepsmaatschappijen"},""]
["",{"$f":"INDEX(labels!A286:C286,1,MATCH(PP_Language,labels!A1:C1,0))","v":"Grondslag van schulden aan overige verbonden partijen"},""]
["",{"$f":"INDEX(labels!A287:C287,1,MATCH(PP_Language,labels!A1:C1,0))","v":"Grondslag van schulden aan rechtspersonen en vennootschappen die een deelneming hebben in de rechtspersoon of waarin de rechtspersoon een deelneming heeft"},""]
["",{"$f":"INDEX(labels!A288:C288,1,MATCH(PP_Language,labels!A1:C1,0))","v":"Grondslag van schulden ter zake van belastingen en premies van sociale verzekeringen"},""]
["",{"$f":"INDEX(labels!A289:C289,1,MATCH(PP_Language,labels!A1:C1,0))","v":"Grondslag van belastingverplichtingen"},""]
["",{"$f":"INDEX(labels!A290:C290,1,MATCH(PP_Language,labels!A1:C1,0))","v":"Grondslag van schulden ter zake van pensioenen"},""]
["",{"$f":"INDEX(labels!A291:C291,1,MATCH(PP_Language,labels!A1:C1,0))","v":"Grondslag van oudedagsverplichting"},""]
["",{"$f":"INDEX(labels!A292:C292,1,MATCH(PP_Language,labels!A1:C1,0))","v":"Grondslag van negatieve goodwill"},""]
["",{"$f":"INDEX(labels!A293:C293,1,MATCH(PP_Language,labels!A1:C1,0))","v":"Grondslag van overige schulden"},""]
["",{"$f":"INDEX(labels!A294:C294,1,MATCH(PP_Language,labels!A1:C1,0))","v":"Grondslag van overlopende passiva"},""]
["",{"$f":"INDEX(labels!A295:C295,1,MATCH(PP_Language,labels!A1:C1,0))","v":"Grondslag van kortlopende schulden"},""]
["",{"$f":"INDEX(labels!A296:C296,1,MATCH(PP_Language,labels!A1:C1,0))","v":"Grondslag van schulden uit hoofde van belastingen naar de winst"},""]
["",{"$f":"INDEX(labels!A297:C297,1,MATCH(PP_Language,labels!A1:C1,0))","v":"Grondslag van aflossingsverplichtingen van langlopende leningen"},""]
["",{"$f":"INDEX(labels!A298:C298,1,MATCH(PP_Language,labels!A1:C1,0))","v":"Grondslag van voorgestelde bedrag aan dividenduitkeringen aan houders van eigenvermogensinstrumenten"},""]
["",{"$f":"INDEX(labels!A299:C299,1,MATCH(PP_Language,labels!A1:C1,0))","v":"Grondslag van onderhanden projecten (passiva)"},""]
["",{"$f":"INDEX(labels!A300:C300,1,MATCH(PP_Language,labels!A1:C1,0))","v":"Grondslag van schulden uit hoofde van personeelsbeloningen"},""]
["",{"$f":"INDEX(labels!A301:C301,1,MATCH(PP_Language,labels!A1:C1,0))","v":"Grondslag van schulden uit hoofde van vakantiedagen"},""]
["",{"$f":"INDEX(labels!A302:C302,1,MATCH(PP_Language,labels!A1:C1,0))","v":"Grondslag van schulden uit hoofde van vakantiegeld"},""]
["",{"$f":"INDEX(labels!A303:C303,1,MATCH(PP_Language,labels!A1:C1,0))","v":"Grondslag van uit te keren dividend aan houders van preferente aandelen"},""]
[""]
["",null,null,null,null,null,null,null,null,null,null,null,null,null,null,null,null,null,null,null,null,null,null,null,null,{"$f":"\"//notes-accounting-principles-assets-liabilities label {\"&COLUMN(B423)&\"}\"","v":"//notes-accounting-principles-assets-liabilities label {2}"},null,{"$f":"\"//notes-accounting-principles-assets-liabilities \" & INDEX(labels!A56:C56,1,MATCH(PP_Language,labels!A1:C1,0)) & \" \" & BasisOfPreparationAxis & \"  {\"&COLUMN(D423)&\"}\"","v":"//notes-accounting-principles-assets-liabilities Enkelvoudig Commercial  {4}"}]
["",{"$f":"INDEX(labels!A304:C304,1,MATCH(PP_Language,labels!A1:C1,0))","v":"Toelichting op de jaarrekening - Grondslagen voor de bepaling van het resultaat"}]
[""]
[""]
["",{"$f":"INDEX(labels!A305:C305,1,MATCH(PP_Language,labels!A1:C1,0))","v":"Grondslagen voor de bepaling van het resultaat"},"",null,null,null,null,null,null,null,null,null,null,null,null,null,null,null,null,null,null,null,null,null,null,{"$f":"\"/notes-accounting-principles-result label {\"&COLUMN(B427)&\"}\"","v":"/notes-accounting-principles-result label {2}"},null,{"$f":"\"/notes-accounting-principles-result \" & INDEX(labels!A56:C56,1,MATCH(PP_Language,labels!A1:C1,0)) & \" \" & BasisOfPreparationAxis & \"  {\"&COLUMN(D427)&\"}\"","v":"/notes-accounting-principles-result Enkelvoudig Commercial  {4}"}]
["",{"$f":"INDEX(labels!A306:C306,1,MATCH(PP_Language,labels!A1:C1,0))","v":"Grondslag van omzetverantwoording"},""]
["",{"$f":"INDEX(labels!A307:C307,1,MATCH(PP_Language,labels!A1:C1,0))","v":"Grondslag van bruto-bedrijfsresultaat"},""]
["",{"$f":"INDEX(labels!A308:C308,1,MATCH(PP_Language,labels!A1:C1,0))","v":"Grondslag van verkoopkosten"},""]
["",{"$f":"INDEX(labels!A309:C309,1,MATCH(PP_Language,labels!A1:C1,0))","v":"Grondslag van algemene beheerskosten"},""]
["",{"$f":"INDEX(labels!A310:C310,1,MATCH(PP_Language,labels!A1:C1,0))","v":"Grondslag van overheidssubsidies"},""]
["",{"$f":"INDEX(labels!A311:C311,1,MATCH(PP_Language,labels!A1:C1,0))","v":"Grondslag van lasten uit hoofde van personeelsbeloningen"},""]
["",{"$f":"INDEX(labels!A312:C312,1,MATCH(PP_Language,labels!A1:C1,0))","v":"Grondslag van lonen"},""]
["",{"$f":"INDEX(labels!A313:C313,1,MATCH(PP_Language,labels!A1:C1,0))","v":"Grondslag van sociale lasten"},""]
["",{"$f":"INDEX(labels!A314:C314,1,MATCH(PP_Language,labels!A1:C1,0))","v":"Grondslag van pensioenlasten"},""]
["",{"$f":"INDEX(labels!A315:C315,1,MATCH(PP_Language,labels!A1:C1,0))","v":"Grondslag van overige lasten uit hoofde van personeelsbeloningen"},""]
["",{"$f":"INDEX(labels!A316:C316,1,MATCH(PP_Language,labels!A1:C1,0))","v":"Grondslag van verwerking van de ontvangen tegemoetkoming uit hoofde van de NOW-regeling"},""]
["",{"$f":"INDEX(labels!A317:C317,1,MATCH(PP_Language,labels!A1:C1,0))","v":"Grondslag van afschrijvingen op immateriële en materiële vaste activa"},""]
["",{"$f":"INDEX(labels!A318:C318,1,MATCH(PP_Language,labels!A1:C1,0))","v":"Grondslag van afschrijvingen op immateriële vaste activa"},""]
["",{"$f":"INDEX(labels!A319:C319,1,MATCH(PP_Language,labels!A1:C1,0))","v":"Grondslag van afschrijvingen op materiële vaste activa"},""]
["",{"$f":"INDEX(labels!A320:C320,1,MATCH(PP_Language,labels!A1:C1,0))","v":"Grondslag van waardeveranderingen van immateriële en materiële vaste activa"},""]
["",{"$f":"INDEX(labels!A321:C321,1,MATCH(PP_Language,labels!A1:C1,0))","v":"Grondslag van waardeveranderingen van immateriële vaste activa"},""]
["",{"$f":"INDEX(labels!A322:C322,1,MATCH(PP_Language,labels!A1:C1,0))","v":"Grondslag van wijziging in de reële waarde van vastgoedbeleggingen"},""]
["",{"$f":"INDEX(labels!A323:C323,1,MATCH(PP_Language,labels!A1:C1,0))","v":"Grondslag van wijzigingen in de waarde van de financiële vaste activa en van de effecten die tot de vlottende activa behoren"},""]
["",{"$f":"INDEX(labels!A324:C324,1,MATCH(PP_Language,labels!A1:C1,0))","v":"Grondslag van waardeverminderingen van vlottende activa"},""]
["",{"$f":"INDEX(labels!A325:C325,1,MATCH(PP_Language,labels!A1:C1,0))","v":"Grondslag van overige bedrijfskosten"},""]
["",{"$f":"INDEX(labels!A326:C326,1,MATCH(PP_Language,labels!A1:C1,0))","v":"Grondslag van uit herwaarderingsreserve vrijgevallen bedragen"},""]
["",{"$f":"INDEX(labels!A327:C327,1,MATCH(PP_Language,labels!A1:C1,0))","v":"Grondslag van financiële baten en lasten"},""]
["",{"$f":"INDEX(labels!A328:C328,1,MATCH(PP_Language,labels!A1:C1,0))","v":"Grondslag van opbrengsten van andere effecten en vorderingen, die tot de vaste activa behoren"},""]
["",{"$f":"INDEX(labels!A329:C329,1,MATCH(PP_Language,labels!A1:C1,0))","v":"Grondslag van overige rentebaten en soortgelijke opbrengsten"},""]
["",{"$f":"INDEX(labels!A330:C330,1,MATCH(PP_Language,labels!A1:C1,0))","v":"Grondslag van rentelasten en soortgelijke kosten"},""]
["",{"$f":"INDEX(labels!A331:C331,1,MATCH(PP_Language,labels!A1:C1,0))","v":"Grondslag van belastingen over de winst of het verlies"},""]
["",{"$f":"INDEX(labels!A332:C332,1,MATCH(PP_Language,labels!A1:C1,0))","v":"Grondslag van overige belastingen"},""]
["",{"$f":"INDEX(labels!A333:C333,1,MATCH(PP_Language,labels!A1:C1,0))","v":"Grondslag van aandeel in resultaat van ondernemingen waarin wordt deelgenomen"},""]
[""]
["",null,null,null,null,null,null,null,null,null,null,null,null,null,null,null,null,null,null,null,null,null,null,null,null,{"$f":"\"//notes-accounting-principles-result label {\"&COLUMN(B457)&\"}\"","v":"//notes-accounting-principles-result label {2}"},null,{"$f":"\"//notes-accounting-principles-result \" & INDEX(labels!A56:C56,1,MATCH(PP_Language,labels!A1:C1,0)) & \" \" & BasisOfPreparationAxis & \"  {\"&COLUMN(D457)&\"}\"","v":"//notes-accounting-principles-result Enkelvoudig Commercial  {4}"}]
["",{"$f":"INDEX(labels!A54:C54,1,MATCH(PP_Language,labels!A1:C1,0))","v":"Balans"}]
["",{"$f":"INDEX(labels!A59:C59,1,MATCH(PP_Language,labels!A1:C1,0))","v":"Immateriële vaste activa"}]
["",{"$f":"INDEX(labels!A334:C334,1,MATCH(PP_Language,labels!A1:C1,0))","v":"Toelichting op de jaarrekening - Immateriële vaste activa: Uitsplitsing"}]
["",null,null,{"$f":"INDEX(labels!A55:C55,1,MATCH(PP_Language,labels!A1:C1,0))","v":"Huidig"},null,{"$f":"INDEX(labels!A57:C57,1,MATCH(PP_Language,labels!A1:C1,0))","v":"Voorgaand"}]
[""]
["",{"$f":"INDEX(labels!A335:C335,1,MATCH(PP_Language,labels!A1:C1,0))","v":"Kosten die verband houden met de oprichting en met de uitgifte van aandelen"},"-",null,null,null,null,null,null,null,null,null,null,null,null,null,null,null,null,null,null,null,null,null,null,{"$f":"\"/notes-intangible-assets-breakdown label {\"&COLUMN(B463)&\"}\"","v":"/notes-intangible-assets-breakdown label {2}"},null,{"$f":"\"/notes-intangible-assets-breakdown \" & INDEX(labels!A56:C56,1,MATCH(PP_Language,labels!A1:C1,0)) & \" \" & BasisOfPreparationAxis & \" \" & INDEX(labels!A55:C55,1,MATCH(PP_Language,labels!A1:C1,0)) &  \"  {\"&COLUMN(D463)&\"}\"","v":"/notes-intangible-assets-breakdown Enkelvoudig Commercial Huidig  {4}"},null,{"$f":"\"/notes-intangible-assets-breakdown \" & INDEX(labels!A56:C56,1,MATCH(PP_Language,labels!A1:C1,0)) & \" \" & BasisOfPreparationAxis & \" \" & INDEX(labels!A57:C57,1,MATCH(PP_Language,labels!A1:C1,0)) &  \"  {\"&COLUMN(F463)&\"}\"","v":"/notes-intangible-assets-breakdown Enkelvoudig Commercial Voorgaand  {6}"}]
["",{"$f":"INDEX(labels!A336:C336,1,MATCH(PP_Language,labels!A1:C1,0))","v":"Overige immateriële vaste activa"},"-"]
[""]
["",{"$f":"INDEX(labels!A337:C337,1,MATCH(PP_Language,labels!A1:C1,0))","v":"Totaal van immateriële vaste activa"},"-",{"$f":"IF(OR(NOT(0=0),NOT(AND(Stamdata!D465=\"\",Stamdata!D466=\"\"))), + SUM(Stamdata!D465,Stamdata!D466),\"\")","v":""},null,{"$f":"IF(OR(NOT(0=0),NOT(AND(Stamdata!F465=\"\",Stamdata!F466=\"\"))), + SUM(Stamdata!F465,Stamdata!F466),\"\")","v":""}]
[""]
["",null,null,null,null,null,null,null,null,null,null,null,null,null,null,null,null,null,null,null,null,null,null,null,null,{"$f":"\"//notes-intangible-assets-breakdown label {\"&COLUMN(B468)&\"}\"","v":"//notes-intangible-assets-breakdown label {2}"},null,{"$f":"\"//notes-intangible-assets-breakdown \" & INDEX(labels!A56:C56,1,MATCH(PP_Language,labels!A1:C1,0)) & \" \" & BasisOfPreparationAxis & \" \" & INDEX(labels!A55:C55,1,MATCH(PP_Language,labels!A1:C1,0)) &  \"  {\"&COLUMN(D468)&\"}\"","v":"//notes-intangible-assets-breakdown Enkelvoudig Commercial Huidig  {4}"},null,{"$f":"\"//notes-intangible-assets-breakdown \" & INDEX(labels!A56:C56,1,MATCH(PP_Language,labels!A1:C1,0)) & \" \" & BasisOfPreparationAxis & \" \" & INDEX(labels!A57:C57,1,MATCH(PP_Language,labels!A1:C1,0)) &  \"  {\"&COLUMN(F468)&\"}\"","v":"//notes-intangible-assets-breakdown Enkelvoudig Commercial Voorgaand  {6}"}]
["",{"$f":"INDEX(labels!A338:C338,1,MATCH(PP_Language,labels!A1:C1,0))","v":"Toelichting op de jaarrekening - Immateriële vaste activa"}]
[""]
[""]
["",{"$f":"INDEX(labels!A339:C339,1,MATCH(PP_Language,labels!A1:C1,0))","v":"Informatieverschaffing over immateriële vaste activa"},"",null,null,null,null,null,null,null,null,null,null,null,null,null,null,null,null,null,null,null,null,null,null,{"$f":"\"/notes-intangible-assets label {\"&COLUMN(B472)&\"}\"","v":"/notes-intangible-assets label {2}"},null,{"$f":"\"/notes-intangible-assets \" & INDEX(labels!A56:C56,1,MATCH(PP_Language,labels!A1:C1,0)) & \" \" & BasisOfPreparationAxis & \"  {\"&COLUMN(D472)&\"}\"","v":"/notes-intangible-assets Enkelvoudig Commercial  {4}"}]
["",{"$f":"INDEX(labels!A340:C340,1,MATCH(PP_Language,labels!A1:C1,0))","v":"Informatieverschaffing over de actuele waarde van immateriële vaste activa"},""]
["",{"$f":"INDEX(labels!A341:C341,1,MATCH(PP_Language,labels!A1:C1,0))","v":"Beschrijving van immateriële vaste activa met beperkte eigendomsrechten"},""]
["",{"$f":"INDEX(labels!A342:C342,1,MATCH(PP_Language,labels!A1:C1,0))","v":"Beschrijving van immateriële vaste activa ter zekerheid gesteld voor schulden"},""]
["",{"$f":"INDEX(labels!A343:C343,1,MATCH(PP_Language,labels!A1:C1,0))","v":"Beschrijving van bijzondere waardeverminderingen van immateriële vaste activa"},""]
["",{"$f":"INDEX(labels!A344:C344,1,MATCH(PP_Language,labels!A1:C1,0))","v":"Informatieverschaffing over kosten van goodwill die van derden is verkregen"},""]
["",{"$f":"INDEX(labels!A345:C345,1,MATCH(PP_Language,labels!A1:C1,0))","v":"Beschrijving van verplichtingen uit hoofde van verwerving van immateriële vaste activa"},""]
["",{"$f":"INDEX(labels!A346:C346,1,MATCH(PP_Language,labels!A1:C1,0))","v":"Beschrijving van de geactiveerde rente op immateriële vaste activa gedurende de verslagperiode"},""]
["",{"$f":"INDEX(labels!A347:C347,1,MATCH(PP_Language,labels!A1:C1,0))","v":"Beschrijving van de reden en factoren die een significante rol hebben gespeeld bij de bepaling dat de afschrijvingstermijn van immateriële vaste activa langer dan twintig jaar bedraagt"},""]
["",{"$f":"INDEX(labels!A348:C348,1,MATCH(PP_Language,labels!A1:C1,0))","v":"Beschrijving van een individueel immaterieel vast actief dat van groot belang is voor de rechtspersoon"},""]
[""]
["",null,null,null,null,null,null,null,null,null,null,null,null,null,null,null,null,null,null,null,null,null,null,null,null,{"$f":"\"//notes-intangible-assets label {\"&COLUMN(B483)&\"}\"","v":"//notes-intangible-assets label {2}"},null,{"$f":"\"//notes-intangible-assets \" & INDEX(labels!A56:C56,1,MATCH(PP_Language,labels!A1:C1,0)) & \" \" & BasisOfPreparationAxis & \"  {\"&COLUMN(D483)&\"}\"","v":"//notes-intangible-assets Enkelvoudig Commercial  {4}"}]
["",{"$f":"INDEX(labels!A349:C349,1,MATCH(PP_Language,labels!A1:C1,0))","v":"Toelichting op de jaarrekening - Immateriële vaste activa: Overige bedragen: Uitsplitsing"}]
["",null,null,{"$f":"INDEX(labels!A55:C55,1,MATCH(PP_Language,labels!A1:C1,0))","v":"Huidig"},null,{"$f":"INDEX(labels!A57:C57,1,MATCH(PP_Language,labels!A1:C1,0))","v":"Voorgaand"}]
[""]
["",{"$f":"INDEX(labels!A350:C350,1,MATCH(PP_Language,labels!A1:C1,0))","v":"Immateriële vaste activa met beperkte eigendomsrechten"},"-",null,null,null,null,null,null,null,null,null,null,null,null,null,null,null,null,null,null,null,null,null,null,{"$f":"\"/notes-intangible-assets-other-amounts-breakdown label {\"&COLUMN(B487)&\"}\"","v":"/notes-intangible-assets-other-amounts-breakdown label {2}"},null,{"$f":"\"/notes-intangible-assets-other-amounts-breakdown \" & INDEX(labels!A56:C56,1,MATCH(PP_Language,labels!A1:C1,0)) & \" \" & BasisOfPreparationAxis & \" \" & INDEX(labels!A55:C55,1,MATCH(PP_Language,labels!A1:C1,0)) &  \"  {\"&COLUMN(D487)&\"}\"","v":"/notes-intangible-assets-other-amounts-breakdown Enkelvoudig Commercial Huidig  {4}"},null,{"$f":"\"/notes-intangible-assets-other-amounts-breakdown \" & INDEX(labels!A56:C56,1,MATCH(PP_Language,labels!A1:C1,0)) & \" \" & BasisOfPreparationAxis & \" \" & INDEX(labels!A57:C57,1,MATCH(PP_Language,labels!A1:C1,0)) &  \"  {\"&COLUMN(F487)&\"}\"","v":"/notes-intangible-assets-other-amounts-breakdown Enkelvoudig Commercial Voorgaand  {6}"}]
["",{"$f":"INDEX(labels!A351:C351,1,MATCH(PP_Language,labels!A1:C1,0))","v":"Immateriële vaste activa ter zekerheid gesteld voor schulden"},"-"]
[""]
["",null,null,null,null,null,null,null,null,null,null,null,null,null,null,null,null,null,null,null,null,null,null,null,null,{"$f":"\"//notes-intangible-assets-other-amounts-breakdown label {\"&COLUMN(B490)&\"}\"","v":"//notes-intangible-assets-other-amounts-breakdown label {2}"},null,{"$f":"\"//notes-intangible-assets-other-amounts-breakdown \" & INDEX(labels!A56:C56,1,MATCH(PP_Language,labels!A1:C1,0)) & \" \" & BasisOfPreparationAxis & \" \" & INDEX(labels!A55:C55,1,MATCH(PP_Language,labels!A1:C1,0)) &  \"  {\"&COLUMN(D490)&\"}\"","v":"//notes-intangible-assets-other-amounts-breakdown Enkelvoudig Commercial Huidig  {4}"},null,{"$f":"\"//notes-intangible-assets-other-amounts-breakdown \" & INDEX(labels!A56:C56,1,MATCH(PP_Language,labels!A1:C1,0)) & \" \" & BasisOfPreparationAxis & \" \" & INDEX(labels!A57:C57,1,MATCH(PP_Language,labels!A1:C1,0)) &  \"  {\"&COLUMN(F490)&\"}\"","v":"//notes-intangible-assets-other-amounts-breakdown Enkelvoudig Commercial Voorgaand  {6}"}]
["",{"$f":"INDEX(labels!A352:C352,1,MATCH(PP_Language,labels!A1:C1,0))","v":"Toelichting op de jaarrekening - Immateriële vaste activa: Cumulatieve herwaarderingen"}]
["",null,null,{"$f":"INDEX(labels!A55:C55,1,MATCH(PP_Language,labels!A1:C1,0))","v":"Huidig"}]
[""]
["",null,null,{"$f":"\" \"  & INDEX(labels!A335:C335,1,MATCH(PP_Language,labels!A1:C1,0)) &  \"  \"  & INDEX(labels!A56:C56,1,MATCH(PP_Language,labels!A1:C1,0)) &  \" \"","v":" Kosten die verband houden met de oprichting en met de uitgifte van aandelen  Enkelvoudig "},{"$f":"\" \"  & INDEX(labels!A336:C336,1,MATCH(PP_Language,labels!A1:C1,0)) &  \"  \"  & INDEX(labels!A56:C56,1,MATCH(PP_Language,labels!A1:C1,0)) &  \" \"","v":" Overige immateriële vaste activa  Enkelvoudig "},{"$f":"\" \"  & INDEX(labels!A337:C337,1,MATCH(PP_Language,labels!A1:C1,0)) &  \"  \"  & INDEX(labels!A56:C56,1,MATCH(PP_Language,labels!A1:C1,0)) &  \" \"","v":" Totaal van immateriële vaste activa  Enkelvoudig "},null,null,null,null,null,null,null,null,null,null,null,null,null,null,null,null,null,null,null,{"$f":"\"/notes-intangible-assets-accumulated-revaluations label {\"&COLUMN(B494)&\"}\"","v":"/notes-intangible-assets-accumulated-revaluations label {2}"},null,{"$f":"\"/notes-intangible-assets-accumulated-revaluations \" & INDEX(labels!A335:C335,1,MATCH(PP_Language,labels!A1:C1,0)) & \" \" & INDEX(labels!A56:C56,1,MATCH(PP_Language,labels!A1:C1,0)) & \" \" & BasisOfPreparationAxis & \"  {\"&COLUMN(D494)&\"}\"","v":"/notes-intangible-assets-accumulated-revaluations Kosten die verband houden met de oprichting en met de uitgifte van aandelen Enkelvoudig Commercial  {4}"},{"$f":"\"/notes-intangible-assets-accumulated-revaluations \" & INDEX(labels!A336:C336,1,MATCH(PP_Language,labels!A1:C1,0)) & \" \" & INDEX(labels!A56:C56,1,MATCH(PP_Language,labels!A1:C1,0)) & \" \" & BasisOfPreparationAxis & \"  {\"&COLUMN(E494)&\"}\"","v":"/notes-intangible-assets-accumulated-revaluations Overige immateriële vaste activa Enkelvoudig Commercial  {5}"},{"$f":"\"/notes-intangible-assets-accumulated-revaluations \" & INDEX(labels!A337:C337,1,MATCH(PP_Language,labels!A1:C1,0)) & \" \" & INDEX(labels!A56:C56,1,MATCH(PP_Language,labels!A1:C1,0)) & \" \" & BasisOfPreparationAxis & \"  {\"&COLUMN(F494)&\"}\"","v":"/notes-intangible-assets-accumulated-revaluations Totaal van immateriële vaste activa Enkelvoudig Commercial  {6}"}]
["",{"$f":"INDEX(labels!A353:C353,1,MATCH(PP_Language,labels!A1:C1,0))","v":"Som der herwaarderingen die betrekking hebben op de immateriële vaste activa"},"-"]
[""]
["",null,null,null,null,null,null,null,null,null,null,null,null,null,null,null,null,null,null,null,null,null,null,null,null,{"$f":"\"//notes-intangible-assets-accumulated-revaluations label {\"&COLUMN(B497)&\"}\"","v":"//notes-intangible-assets-accumulated-revaluations label {2}"},null,{"$f":"\"//notes-intangible-assets-accumulated-revaluations \" & INDEX(labels!A335:C335,1,MATCH(PP_Language,labels!A1:C1,0)) & \" \" & INDEX(labels!A56:C56,1,MATCH(PP_Language,labels!A1:C1,0)) & \" \" & BasisOfPreparationAxis & \"  {\"&COLUMN(D497)&\"}\"","v":"//notes-intangible-assets-accumulated-revaluations Kosten die verband houden met de oprichting en met de uitgifte van aandelen Enkelvoudig Commercial  {4}"},{"$f":"\"//notes-intangible-assets-accumulated-revaluations \" & INDEX(labels!A336:C336,1,MATCH(PP_Language,labels!A1:C1,0)) & \" \" & INDEX(labels!A56:C56,1,MATCH(PP_Language,labels!A1:C1,0)) & \" \" & BasisOfPreparationAxis & \"  {\"&COLUMN(E497)&\"}\"","v":"//notes-intangible-assets-accumulated-revaluations Overige immateriële vaste activa Enkelvoudig Commercial  {5}"},{"$f":"\"//notes-intangible-assets-accumulated-revaluations \" & INDEX(labels!A337:C337,1,MATCH(PP_Language,labels!A1:C1,0)) & \" \" & INDEX(labels!A56:C56,1,MATCH(PP_Language,labels!A1:C1,0)) & \" \" & BasisOfPreparationAxis & \"  {\"&COLUMN(F497)&\"}\"","v":"//notes-intangible-assets-accumulated-revaluations Totaal van immateriële vaste activa Enkelvoudig Commercial  {6}"}]
["",{"$f":"INDEX(labels!A354:C354,1,MATCH(PP_Language,labels!A1:C1,0))","v":"Toelichting op de jaarrekening - Immateriële vaste activa, voorgaande periode: Cumulatieve herwaarderingen"}]
["",null,null,{"$f":"INDEX(labels!A57:C57,1,MATCH(PP_Language,labels!A1:C1,0))","v":"Voorgaand"}]
[""]
["",null,null,{"$f":"\" \"  & INDEX(labels!A335:C335,1,MATCH(PP_Language,labels!A1:C1,0)) &  \"  \"  & INDEX(labels!A56:C56,1,MATCH(PP_Language,labels!A1:C1,0)) &  \" \"","v":" Kosten die verband houden met de oprichting en met de uitgifte van aandelen  Enkelvoudig "},{"$f":"\" \"  & INDEX(labels!A336:C336,1,MATCH(PP_Language,labels!A1:C1,0)) &  \"  \"  & INDEX(labels!A56:C56,1,MATCH(PP_Language,labels!A1:C1,0)) &  \" \"","v":" Overige immateriële vaste activa  Enkelvoudig "},{"$f":"\" \"  & INDEX(labels!A337:C337,1,MATCH(PP_Language,labels!A1:C1,0)) &  \"  \"  & INDEX(labels!A56:C56,1,MATCH(PP_Language,labels!A1:C1,0)) &  \" \"","v":" Totaal van immateriële vaste activa  Enkelvoudig "},null,null,null,null,null,null,null,null,null,null,null,null,null,null,null,null,null,null,null,{"$f":"\"/notes-intangible-assets-accumulated-revaluations-previous label {\"&COLUMN(B501)&\"}\"","v":"/notes-intangible-assets-accumulated-revaluations-previous label {2}"},null,{"$f":"\"/notes-intangible-assets-accumulated-revaluations-previous \" & INDEX(labels!A335:C335,1,MATCH(PP_Language,labels!A1:C1,0)) & \" \" & INDEX(labels!A56:C56,1,MATCH(PP_Language,labels!A1:C1,0)) & \" \" & BasisOfPreparationAxis & \"  {\"&COLUMN(D501)&\"}\"","v":"/notes-intangible-assets-accumulated-revaluations-previous Kosten die verband houden met de oprichting en met de uitgifte van aandelen Enkelvoudig Commercial  {4}"},{"$f":"\"/notes-intangible-assets-accumulated-revaluations-previous \" & INDEX(labels!A336:C336,1,MATCH(PP_Language,labels!A1:C1,0)) & \" \" & INDEX(labels!A56:C56,1,MATCH(PP_Language,labels!A1:C1,0)) & \" \" & BasisOfPreparationAxis & \"  {\"&COLUMN(E501)&\"}\"","v":"/notes-intangible-assets-accumulated-revaluations-previous Overige immateriële vaste activa Enkelvoudig Commercial  {5}"},{"$f":"\"/notes-intangible-assets-accumulated-revaluations-previous \" & INDEX(labels!A337:C337,1,MATCH(PP_Language,labels!A1:C1,0)) & \" \" & INDEX(labels!A56:C56,1,MATCH(PP_Language,labels!A1:C1,0)) & \" \" & BasisOfPreparationAxis & \"  {\"&COLUMN(F501)&\"}\"","v":"/notes-intangible-assets-accumulated-revaluations-previous Totaal van immateriële vaste activa Enkelvoudig Commercial  {6}"}]
["",{"$f":"INDEX(labels!A353:C353,1,MATCH(PP_Language,labels!A1:C1,0))","v":"Som der herwaarderingen die betrekking hebben op de immateriële vaste activa"},"-"]
[""]
["",null,null,null,null,null,null,null,null,null,null,null,null,null,null,null,null,null,null,null,null,null,null,null,null,{"$f":"\"//notes-intangible-assets-accumulated-revaluations-previous label {\"&COLUMN(B504)&\"}\"","v":"//notes-intangible-assets-accumulated-revaluations-previous label {2}"},null,{"$f":"\"//notes-intangible-assets-accumulated-revaluations-previous \" & INDEX(labels!A335:C335,1,MATCH(PP_Language,labels!A1:C1,0)) & \" \" & INDEX(labels!A56:C56,1,MATCH(PP_Language,labels!A1:C1,0)) & \" \" & BasisOfPreparationAxis & \"  {\"&COLUMN(D504)&\"}\"","v":"//notes-intangible-assets-accumulated-revaluations-previous Kosten die verband houden met de oprichting en met de uitgifte van aandelen Enkelvoudig Commercial  {4}"},{"$f":"\"//notes-intangible-assets-accumulated-revaluations-previous \" & INDEX(labels!A336:C336,1,MATCH(PP_Language,labels!A1:C1,0)) & \" \" & INDEX(labels!A56:C56,1,MATCH(PP_Language,labels!A1:C1,0)) & \" \" & BasisOfPreparationAxis & \"  {\"&COLUMN(E504)&\"}\"","v":"//notes-intangible-assets-accumulated-revaluations-previous Overige immateriële vaste activa Enkelvoudig Commercial  {5}"},{"$f":"\"//notes-intangible-assets-accumulated-revaluations-previous \" & INDEX(labels!A337:C337,1,MATCH(PP_Language,labels!A1:C1,0)) & \" \" & INDEX(labels!A56:C56,1,MATCH(PP_Language,labels!A1:C1,0)) & \" \" & BasisOfPreparationAxis & \"  {\"&COLUMN(F504)&\"}\"","v":"//notes-intangible-assets-accumulated-revaluations-previous Totaal van immateriële vaste activa Enkelvoudig Commercial  {6}"}]
["",{"$f":"INDEX(labels!A60:C60,1,MATCH(PP_Language,labels!A1:C1,0))","v":"Materiële vaste activa"}]
["",{"$f":"INDEX(labels!A355:C355,1,MATCH(PP_Language,labels!A1:C1,0))","v":"Toelichting op de jaarrekening - Materiële vaste activa"}]
[""]
[""]
["",{"$f":"INDEX(labels!A356:C356,1,MATCH(PP_Language,labels!A1:C1,0))","v":"Informatieverschaffing over materiële vaste activa"},"",null,null,null,null,null,null,null,null,null,null,null,null,null,null,null,null,null,null,null,null,null,null,{"$f":"\"/notes-property-plant-equipment label {\"&COLUMN(B509)&\"}\"","v":"/notes-property-plant-equipment label {2}"},null,{"$f":"\"/notes-property-plant-equipment \" & INDEX(labels!A56:C56,1,MATCH(PP_Language,labels!A1:C1,0)) & \" \" & BasisOfPreparationAxis & \"  {\"&COLUMN(D509)&\"}\"","v":"/notes-property-plant-equipment Enkelvoudig Commercial  {4}"}]
["",{"$f":"INDEX(labels!A357:C357,1,MATCH(PP_Language,labels!A1:C1,0))","v":"Informatieverschaffing over de actuele waarde van materiële vaste activa"},""]
["",{"$f":"INDEX(labels!A358:C358,1,MATCH(PP_Language,labels!A1:C1,0))","v":"Beschrijving van materiële vaste activa waarvan de rechtspersoon niet de juridische eigendom bezit"},""]
["",{"$f":"INDEX(labels!A359:C359,1,MATCH(PP_Language,labels!A1:C1,0))","v":"Beschrijving van materiële vaste activa die als zekerheid dienen voor verplichtingen"},""]
["",{"$f":"INDEX(labels!A360:C360,1,MATCH(PP_Language,labels!A1:C1,0))","v":"Beschrijving van bijzondere waardeverminderingen van materiële vaste activa"},""]
["",{"$f":"INDEX(labels!A361:C361,1,MATCH(PP_Language,labels!A1:C1,0))","v":"Beschrijving van de geactiveerde rente op materiële vaste activa gedurende de verslagperiode"},""]
["",{"$f":"INDEX(labels!A362:C362,1,MATCH(PP_Language,labels!A1:C1,0))","v":"Informatieverschaffing over de financiële lease van materiële vaste activa"},""]
["",{"$f":"INDEX(labels!A363:C363,1,MATCH(PP_Language,labels!A1:C1,0))","v":"Beschrijving van de aard en omvang van overige mutaties van de materiële vaste activa die van belang zijn"},""]
["",{"$f":"INDEX(labels!A364:C364,1,MATCH(PP_Language,labels!A1:C1,0))","v":"Informatieverschaffing over materiële vaste activa van de fiscale herinvesteringsreserve in mindering gebracht op de aanschaffings- of voortbrengingskosten van een bedrijfsmiddel"},""]
["",{"$f":"INDEX(labels!A365:C365,1,MATCH(PP_Language,labels!A1:C1,0))","v":"Beschrijving van de toepassing van de overgangsbepaling m.b.t. de stelselwijziging van waardering tegen actuele waarde naar historische kostprijs"},""]
["",{"$f":"INDEX(labels!A366:C366,1,MATCH(PP_Language,labels!A1:C1,0))","v":"Beschrijving van de omvang van de nog niet gerealiseerde herwaardering m.b.t. de stelselwijziging van waardering tegen actuele waarde naar historische kostprijs"},""]
[""]
["",null,null,null,null,null,null,null,null,null,null,null,null,null,null,null,null,null,null,null,null,null,null,null,null,{"$f":"\"//notes-property-plant-equipment label {\"&COLUMN(B521)&\"}\"","v":"//notes-property-plant-equipment label {2}"},null,{"$f":"\"//notes-property-plant-equipment \" & INDEX(labels!A56:C56,1,MATCH(PP_Language,labels!A1:C1,0)) & \" \" & BasisOfPreparationAxis & \"  {\"&COLUMN(D521)&\"}\"","v":"//notes-property-plant-equipment Enkelvoudig Commercial  {4}"}]
["",{"$f":"INDEX(labels!A367:C367,1,MATCH(PP_Language,labels!A1:C1,0))","v":"Toelichting op de jaarrekening - Materiële vaste activa: Cumulatieve herwaarderingen"}]
["",null,null,{"$f":"INDEX(labels!A55:C55,1,MATCH(PP_Language,labels!A1:C1,0))","v":"Huidig"},null,{"$f":"INDEX(labels!A57:C57,1,MATCH(PP_Language,labels!A1:C1,0))","v":"Voorgaand"}]
[""]
["",{"$f":"INDEX(labels!A368:C368,1,MATCH(PP_Language,labels!A1:C1,0))","v":"Som der herwaarderingen die betrekking hebben op de materiële vaste activa"},"-",null,null,null,null,null,null,null,null,null,null,null,null,null,null,null,null,null,null,null,null,null,null,{"$f":"\"/notes-property-plant-equipment-accumulated-revaluations label {\"&COLUMN(B525)&\"}\"","v":"/notes-property-plant-equipment-accumulated-revaluations label {2}"},null,{"$f":"\"/notes-property-plant-equipment-accumulated-revaluations \" & INDEX(labels!A56:C56,1,MATCH(PP_Language,labels!A1:C1,0)) & \" \" & BasisOfPreparationAxis & \" \" & INDEX(labels!A55:C55,1,MATCH(PP_Language,labels!A1:C1,0)) &  \"  {\"&COLUMN(D525)&\"}\"","v":"/notes-property-plant-equipment-accumulated-revaluations Enkelvoudig Commercial Huidig  {4}"},null,{"$f":"\"/notes-property-plant-equipment-accumulated-revaluations \" & INDEX(labels!A56:C56,1,MATCH(PP_Language,labels!A1:C1,0)) & \" \" & BasisOfPreparationAxis & \" \" & INDEX(labels!A57:C57,1,MATCH(PP_Language,labels!A1:C1,0)) &  \"  {\"&COLUMN(F525)&\"}\"","v":"/notes-property-plant-equipment-accumulated-revaluations Enkelvoudig Commercial Voorgaand  {6}"}]
[""]
["",null,null,null,null,null,null,null,null,null,null,null,null,null,null,null,null,null,null,null,null,null,null,null,null,{"$f":"\"//notes-property-plant-equipment-accumulated-revaluations label {\"&COLUMN(B527)&\"}\"","v":"//notes-property-plant-equipment-accumulated-revaluations label {2}"},null,{"$f":"\"//notes-property-plant-equipment-accumulated-revaluations \" & INDEX(labels!A56:C56,1,MATCH(PP_Language,labels!A1:C1,0)) & \" \" & BasisOfPreparationAxis & \" \" & INDEX(labels!A55:C55,1,MATCH(PP_Language,labels!A1:C1,0)) &  \"  {\"&COLUMN(D527)&\"}\"","v":"//notes-property-plant-equipment-accumulated-revaluations Enkelvoudig Commercial Huidig  {4}"},null,{"$f":"\"//notes-property-plant-equipment-accumulated-revaluations \" & INDEX(labels!A56:C56,1,MATCH(PP_Language,labels!A1:C1,0)) & \" \" & BasisOfPreparationAxis & \" \" & INDEX(labels!A57:C57,1,MATCH(PP_Language,labels!A1:C1,0)) &  \"  {\"&COLUMN(F527)&\"}\"","v":"//notes-property-plant-equipment-accumulated-revaluations Enkelvoudig Commercial Voorgaand  {6}"}]
["",{"$f":"INDEX(labels!A61:C61,1,MATCH(PP_Language,labels!A1:C1,0))","v":"Vastgoedbeleggingen"}]
["",{"$f":"INDEX(labels!A369:C369,1,MATCH(PP_Language,labels!A1:C1,0))","v":"Toelichting op de jaarrekening - Vastgoedbeleggingen"}]
[""]
[""]
["",{"$f":"INDEX(labels!A370:C370,1,MATCH(PP_Language,labels!A1:C1,0))","v":"Informatieverschaffing over vastgoedbeleggingen"},"",null,null,null,null,null,null,null,null,null,null,null,null,null,null,null,null,null,null,null,null,null,null,{"$f":"\"/notes-investment-properties label {\"&COLUMN(B532)&\"}\"","v":"/notes-investment-properties label {2}"},null,{"$f":"\"/notes-investment-properties \" & INDEX(labels!A56:C56,1,MATCH(PP_Language,labels!A1:C1,0)) & \" \" & BasisOfPreparationAxis & \"  {\"&COLUMN(D532)&\"}\"","v":"/notes-investment-properties Enkelvoudig Commercial  {4}"}]
["",{"$f":"INDEX(labels!A371:C371,1,MATCH(PP_Language,labels!A1:C1,0))","v":"Informatieverschaffing over de reële waarde van vastgoedbeleggingen"},""]
["",{"$f":"INDEX(labels!A372:C372,1,MATCH(PP_Language,labels!A1:C1,0))","v":"Beschrijving van beperkingen met betrekking tot de aanwendbaarheid van vastgoedbeleggingen, alsmede de omvang van deze beperking"},""]
["",{"$f":"INDEX(labels!A373:C373,1,MATCH(PP_Language,labels!A1:C1,0))","v":"Beschrijving van beperkingen met betrekking tot de inbaarheid van opbrengsten, alsmede de omvang van deze beperking"},""]
["",{"$f":"INDEX(labels!A374:C374,1,MATCH(PP_Language,labels!A1:C1,0))","v":"Beschrijving van bijzondere waardeverminderingen van vastgoedbeleggingen"},""]
["",{"$f":"INDEX(labels!A375:C375,1,MATCH(PP_Language,labels!A1:C1,0))","v":"Beschrijving van contractuele verplichtingen tot aankoop, bouw of ontwikkeling van vastgoedbeleggingen of voor reparatie, onderhoud of verbeteringen van vastgoedbeleggingen"},""]
[""]
["",null,null,null,null,null,null,null,null,null,null,null,null,null,null,null,null,null,null,null,null,null,null,null,null,{"$f":"\"//notes-investment-properties label {\"&COLUMN(B539)&\"}\"","v":"//notes-investment-properties label {2}"},null,{"$f":"\"//notes-investment-properties \" & INDEX(labels!A56:C56,1,MATCH(PP_Language,labels!A1:C1,0)) & \" \" & BasisOfPreparationAxis & \"  {\"&COLUMN(D539)&\"}\"","v":"//notes-investment-properties Enkelvoudig Commercial  {4}"}]
["",{"$f":"INDEX(labels!A62:C62,1,MATCH(PP_Language,labels!A1:C1,0))","v":"Financiële vaste activa"}]
["",{"$f":"INDEX(labels!A376:C376,1,MATCH(PP_Language,labels!A1:C1,0))","v":"Toelichting op de jaarrekening - Financiële vaste activa"}]
[""]
[""]
["",{"$f":"INDEX(labels!A377:C377,1,MATCH(PP_Language,labels!A1:C1,0))","v":"Informatieverschaffing over financiële vaste activa"},"",null,null,null,null,null,null,null,null,null,null,null,null,null,null,null,null,null,null,null,null,null,null,{"$f":"\"/notes-financial-assets label {\"&COLUMN(B544)&\"}\"","v":"/notes-financial-assets label {2}"},null,{"$f":"\"/notes-financial-assets \" & INDEX(labels!A56:C56,1,MATCH(PP_Language,labels!A1:C1,0)) & \" \" & BasisOfPreparationAxis & \"  {\"&COLUMN(D544)&\"}\"","v":"/notes-financial-assets Enkelvoudig Commercial  {4}"}]
["",{"$f":"INDEX(labels!A378:C378,1,MATCH(PP_Language,labels!A1:C1,0))","v":"Beschrijving van de aannames waarop de contante waarde van de verwachte toekomstige kasstromen zijn gebaseerd voor activa gewaardeerd tegen actuele waarde die opbrengsten kunnen opleveren als belegging"},""]
["",{"$f":"INDEX(labels!A379:C379,1,MATCH(PP_Language,labels!A1:C1,0))","v":"Beschrijving van toegepaste benaderingsmethode voor activa gewaardeerd tegen actuele waarde die opbrengsten kunnen opleveren als belegging"},""]
["",{"$f":"INDEX(labels!A380:C380,1,MATCH(PP_Language,labels!A1:C1,0))","v":"Beschrijving van bijzondere waardeverminderingen van financiële vaste activa"},""]
["",{"$f":"INDEX(labels!A381:C381,1,MATCH(PP_Language,labels!A1:C1,0))","v":"Informatieverschaffing over latente belastingvorderingen"},""]
["",{"$f":"INDEX(labels!A382:C382,1,MATCH(PP_Language,labels!A1:C1,0))","v":"Beschrijving van gegronde redenen waarom deelneming niet volgens de netto-vermogenswaardemethode gewaardeerd is"},""]
[""]
["",null,null,null,null,null,null,null,null,null,null,null,null,null,null,null,null,null,null,null,null,null,null,null,null,{"$f":"\"//notes-financial-assets label {\"&COLUMN(B551)&\"}\"","v":"//notes-financial-assets label {2}"},null,{"$f":"\"//notes-financial-assets \" & INDEX(labels!A56:C56,1,MATCH(PP_Language,labels!A1:C1,0)) & \" \" & BasisOfPreparationAxis & \"  {\"&COLUMN(D551)&\"}\"","v":"//notes-financial-assets Enkelvoudig Commercial  {4}"}]
["",{"$f":"INDEX(labels!A383:C383,1,MATCH(PP_Language,labels!A1:C1,0))","v":"Toelichting op de jaarrekening - Financiële vaste activa: Cumulatieve herwaarderingen"}]
["",null,null,{"$f":"INDEX(labels!A55:C55,1,MATCH(PP_Language,labels!A1:C1,0))","v":"Huidig"}]
[""]
["",{"$f":"INDEX(labels!A384:C384,1,MATCH(PP_Language,labels!A1:C1,0))","v":"Som der herwaarderingen die betrekking hebben op de financiële vaste activa"},"-",null,null,null,null,null,null,null,null,null,null,null,null,null,null,null,null,null,null,null,null,null,null,{"$f":"\"/notes-financial-assets-accumulated-revaluations label {\"&COLUMN(B555)&\"}\"","v":"/notes-financial-assets-accumulated-revaluations label {2}"},null,{"$f":"\"/notes-financial-assets-accumulated-revaluations \" & INDEX(labels!A62:C62,1,MATCH(PP_Language,labels!A1:C1,0)) & \" \" & INDEX(labels!A56:C56,1,MATCH(PP_Language,labels!A1:C1,0)) & \" \" & BasisOfPreparationAxis & \"  {\"&COLUMN(D555)&\"}\"","v":"/notes-financial-assets-accumulated-revaluations Financiële vaste activa Enkelvoudig Commercial  {4}"}]
[""]
["",null,null,null,null,null,null,null,null,null,null,null,null,null,null,null,null,null,null,null,null,null,null,null,null,{"$f":"\"//notes-financial-assets-accumulated-revaluations label {\"&COLUMN(B557)&\"}\"","v":"//notes-financial-assets-accumulated-revaluations label {2}"},null,{"$f":"\"//notes-financial-assets-accumulated-revaluations \" & INDEX(labels!A62:C62,1,MATCH(PP_Language,labels!A1:C1,0)) & \" \" & INDEX(labels!A56:C56,1,MATCH(PP_Language,labels!A1:C1,0)) & \" \" & BasisOfPreparationAxis & \"  {\"&COLUMN(D557)&\"}\"","v":"//notes-financial-assets-accumulated-revaluations Financiële vaste activa Enkelvoudig Commercial  {4}"}]
["",{"$f":"INDEX(labels!A385:C385,1,MATCH(PP_Language,labels!A1:C1,0))","v":"Toelichting op de jaarrekening - Financiële vaste activa, voorgaande periode: Cumulatieve herwaarderingen"}]
["",null,null,{"$f":"INDEX(labels!A57:C57,1,MATCH(PP_Language,labels!A1:C1,0))","v":"Voorgaand"}]
[""]
["",{"$f":"INDEX(labels!A384:C384,1,MATCH(PP_Language,labels!A1:C1,0))","v":"Som der herwaarderingen die betrekking hebben op de financiële vaste activa"},"-",null,null,null,null,null,null,null,null,null,null,null,null,null,null,null,null,null,null,null,null,null,null,{"$f":"\"/notes-financial-assets-accumulated-revaluations-previous label {\"&COLUMN(B561)&\"}\"","v":"/notes-financial-assets-accumulated-revaluations-previous label {2}"},null,{"$f":"\"/notes-financial-assets-accumulated-revaluations-previous \" & INDEX(labels!A62:C62,1,MATCH(PP_Language,labels!A1:C1,0)) & \" \" & INDEX(labels!A56:C56,1,MATCH(PP_Language,labels!A1:C1,0)) & \" \" & BasisOfPreparationAxis & \"  {\"&COLUMN(D561)&\"}\"","v":"/notes-financial-assets-accumulated-revaluations-previous Financiële vaste activa Enkelvoudig Commercial  {4}"}]
[""]
["",null,null,null,null,null,null,null,null,null,null,null,null,null,null,null,null,null,null,null,null,null,null,null,null,{"$f":"\"//notes-financial-assets-accumulated-revaluations-previous label {\"&COLUMN(B563)&\"}\"","v":"//notes-financial-assets-accumulated-revaluations-previous label {2}"},null,{"$f":"\"//notes-financial-assets-accumulated-revaluations-previous \" & INDEX(labels!A62:C62,1,MATCH(PP_Language,labels!A1:C1,0)) & \" \" & INDEX(labels!A56:C56,1,MATCH(PP_Language,labels!A1:C1,0)) & \" \" & BasisOfPreparationAxis & \"  {\"&COLUMN(D563)&\"}\"","v":"//notes-financial-assets-accumulated-revaluations-previous Financiële vaste activa Enkelvoudig Commercial  {4}"}]
["",{"$f":"INDEX(labels!A64:C64,1,MATCH(PP_Language,labels!A1:C1,0))","v":"Voorraden"}]
["",{"$f":"INDEX(labels!A386:C386,1,MATCH(PP_Language,labels!A1:C1,0))","v":"Toelichting op de jaarrekening - Voorraden"}]
[""]
[""]
["",{"$f":"INDEX(labels!A387:C387,1,MATCH(PP_Language,labels!A1:C1,0))","v":"Informatieverschaffing over voorraden"},"",null,null,null,null,null,null,null,null,null,null,null,null,null,null,null,null,null,null,null,null,null,null,{"$f":"\"/notes-inventories label {\"&COLUMN(B568)&\"}\"","v":"/notes-inventories label {2}"},null,{"$f":"\"/notes-inventories \" & INDEX(labels!A56:C56,1,MATCH(PP_Language,labels!A1:C1,0)) & \" \" & BasisOfPreparationAxis & \"  {\"&COLUMN(D568)&\"}\"","v":"/notes-inventories Enkelvoudig Commercial  {4}"}]
["",{"$f":"INDEX(labels!A388:C388,1,MATCH(PP_Language,labels!A1:C1,0))","v":"Beschrijving van de geactiveerde rente op voorraden gedurende de verslagperiode"},""]
["",{"$f":"INDEX(labels!A389:C389,1,MATCH(PP_Language,labels!A1:C1,0))","v":"Beschrijving van voorraden waarvan de rechtspersoon niet de juridische eigendom bezit"},""]
["",{"$f":"INDEX(labels!A390:C390,1,MATCH(PP_Language,labels!A1:C1,0))","v":"Beschrijving van verplichtingen tot aan- of verkoop van voorraden"},""]
["",{"$f":"INDEX(labels!A391:C391,1,MATCH(PP_Language,labels!A1:C1,0))","v":"Beschrijving van kostprijsmethode van voorraden"},""]
["",{"$f":"INDEX(labels!A392:C392,1,MATCH(PP_Language,labels!A1:C1,0))","v":"Informatieverschaffing over de actuele waarde van agrarische voorraden"},""]
["",{"$f":"INDEX(labels!A393:C393,1,MATCH(PP_Language,labels!A1:C1,0))","v":"Informatieverschaffing over herwaarderingen van agrarische voorraden gewaardeerd tegen actuele waarde"},""]
["",{"$f":"INDEX(labels!A394:C394,1,MATCH(PP_Language,labels!A1:C1,0))","v":"Beschrijving van in hoeverre rekening is gehouden met de invloed van belastingen bij de waardering van agrarische voorraden tegen actuele waarde"},""]
["",{"$f":"INDEX(labels!A395:C395,1,MATCH(PP_Language,labels!A1:C1,0))","v":"Beschrijving van de boekwaarde van voorraden die worden gewaardeerd tegen lagere opbrengstwaarde"},""]
[""]
["",null,null,null,null,null,null,null,null,null,null,null,null,null,null,null,null,null,null,null,null,null,null,null,null,{"$f":"\"//notes-inventories label {\"&COLUMN(B578)&\"}\"","v":"//notes-inventories label {2}"},null,{"$f":"\"//notes-inventories \" & INDEX(labels!A56:C56,1,MATCH(PP_Language,labels!A1:C1,0)) & \" \" & BasisOfPreparationAxis & \"  {\"&COLUMN(D578)&\"}\"","v":"//notes-inventories Enkelvoudig Commercial  {4}"}]
["",{"$f":"INDEX(labels!A396:C396,1,MATCH(PP_Language,labels!A1:C1,0))","v":"Toelichting op de jaarrekening - Voorraden: Actuele waarde: Uitsplitsing"}]
["",null,null,{"$f":"INDEX(labels!A55:C55,1,MATCH(PP_Language,labels!A1:C1,0))","v":"Huidig"},null,{"$f":"INDEX(labels!A57:C57,1,MATCH(PP_Language,labels!A1:C1,0))","v":"Voorgaand"}]
[""]
["",{"$f":"INDEX(labels!A397:C397,1,MATCH(PP_Language,labels!A1:C1,0))","v":"Bedrag van waardeveranderingen van agrarische voorraden gewaardeerd tegen actuele waarde onmiddellijk verwerkt in de winst-en-verliesrekening"},"+",null,null,null,null,null,null,null,null,null,null,null,null,null,null,null,null,null,null,null,null,null,null,{"$f":"\"/notes-inventories-current-value-breakdown label {\"&COLUMN(B582)&\"}\"","v":"/notes-inventories-current-value-breakdown label {2}"},null,{"$f":"\"/notes-inventories-current-value-breakdown \" & INDEX(labels!A56:C56,1,MATCH(PP_Language,labels!A1:C1,0)) & \" \" & BasisOfPreparationAxis & \" \" & INDEX(labels!A55:C55,1,MATCH(PP_Language,labels!A1:C1,0)) &  \"  {\"&COLUMN(D582)&\"}\"","v":"/notes-inventories-current-value-breakdown Enkelvoudig Commercial Huidig  {4}"},null,{"$f":"\"/notes-inventories-current-value-breakdown \" & INDEX(labels!A56:C56,1,MATCH(PP_Language,labels!A1:C1,0)) & \" \" & BasisOfPreparationAxis & \" \" & INDEX(labels!A57:C57,1,MATCH(PP_Language,labels!A1:C1,0)) &  \"  {\"&COLUMN(F582)&\"}\"","v":"/notes-inventories-current-value-breakdown Enkelvoudig Commercial Voorgaand  {6}"}]
[""]
["",{"$f":"INDEX(labels!A398:C398,1,MATCH(PP_Language,labels!A1:C1,0))","v":"Actuele waarde van agrarische voorraden"},"-"]
["",{"$f":"INDEX(labels!A399:C399,1,MATCH(PP_Language,labels!A1:C1,0))","v":"Herwaardering van agrarische voorraden"},"-"]
["",{"$f":"INDEX(labels!A400:C400,1,MATCH(PP_Language,labels!A1:C1,0))","v":"Boekwaarde van voorraden die worden gewaardeerd tegen lagere opbrengstwaarde"},"-"]
[""]
[""]
["",null,null,null,null,null,null,null,null,null,null,null,null,null,null,null,null,null,null,null,null,null,null,null,null,{"$f":"\"//notes-inventories-current-value-breakdown label {\"&COLUMN(B589)&\"}\"","v":"//notes-inventories-current-value-breakdown label {2}"},null,{"$f":"\"//notes-inventories-current-value-breakdown \" & INDEX(labels!A56:C56,1,MATCH(PP_Language,labels!A1:C1,0)) & \" \" & BasisOfPreparationAxis & \" \" & INDEX(labels!A55:C55,1,MATCH(PP_Language,labels!A1:C1,0)) &  \"  {\"&COLUMN(D589)&\"}\"","v":"//notes-inventories-current-value-breakdown Enkelvoudig Commercial Huidig  {4}"},null,{"$f":"\"//notes-inventories-current-value-breakdown \" & INDEX(labels!A56:C56,1,MATCH(PP_Language,labels!A1:C1,0)) & \" \" & BasisOfPreparationAxis & \" \" & INDEX(labels!A57:C57,1,MATCH(PP_Language,labels!A1:C1,0)) &  \"  {\"&COLUMN(F589)&\"}\"","v":"//notes-inventories-current-value-breakdown Enkelvoudig Commercial Voorgaand  {6}"}]
["",{"$f":"INDEX(labels!A65:C65,1,MATCH(PP_Language,labels!A1:C1,0))","v":"Onderhanden projecten"}]
["",{"$f":"INDEX(labels!A401:C401,1,MATCH(PP_Language,labels!A1:C1,0))","v":"Toelichting op de jaarrekening - Onderhanden projecten"}]
[""]
[""]
["",{"$f":"INDEX(labels!A402:C402,1,MATCH(PP_Language,labels!A1:C1,0))","v":"Informatieverschaffing over onderhanden projecten"},"",null,null,null,null,null,null,null,null,null,null,null,null,null,null,null,null,null,null,null,null,null,null,{"$f":"\"/notes-construction-contracts label {\"&COLUMN(B594)&\"}\"","v":"/notes-construction-contracts label {2}"},null,{"$f":"\"/notes-construction-contracts \" & INDEX(labels!A56:C56,1,MATCH(PP_Language,labels!A1:C1,0)) & \" \" & BasisOfPreparationAxis & \"  {\"&COLUMN(D594)&\"}\"","v":"/notes-construction-contracts Enkelvoudig Commercial  {4}"}]
[""]
["",null,null,null,null,null,null,null,null,null,null,null,null,null,null,null,null,null,null,null,null,null,null,null,null,{"$f":"\"//notes-construction-contracts label {\"&COLUMN(B596)&\"}\"","v":"//notes-construction-contracts label {2}"},null,{"$f":"\"//notes-construction-contracts \" & INDEX(labels!A56:C56,1,MATCH(PP_Language,labels!A1:C1,0)) & \" \" & BasisOfPreparationAxis & \"  {\"&COLUMN(D596)&\"}\"","v":"//notes-construction-contracts Enkelvoudig Commercial  {4}"}]
["",{"$f":"INDEX(labels!A66:C66,1,MATCH(PP_Language,labels!A1:C1,0))","v":"Vorderingen"}]
["",{"$f":"INDEX(labels!A403:C403,1,MATCH(PP_Language,labels!A1:C1,0))","v":"Toelichting op de jaarrekening - Vorderingen: Uitsplitsing"}]
["",null,null,{"$f":"INDEX(labels!A55:C55,1,MATCH(PP_Language,labels!A1:C1,0))","v":"Huidig"},null,{"$f":"INDEX(labels!A57:C57,1,MATCH(PP_Language,labels!A1:C1,0))","v":"Voorgaand"}]
[""]
["",{"$f":"INDEX(labels!A404:C404,1,MATCH(PP_Language,labels!A1:C1,0))","v":"Opgevraagde stortingen van geplaatst kapitaal"},"-",null,null,null,null,null,null,null,null,null,null,null,null,null,null,null,null,null,null,null,null,null,null,{"$f":"\"/notes-receivables-breakdown label {\"&COLUMN(B601)&\"}\"","v":"/notes-receivables-breakdown label {2}"},null,{"$f":"\"/notes-receivables-breakdown \" & INDEX(labels!A56:C56,1,MATCH(PP_Language,labels!A1:C1,0)) & \" \" & BasisOfPreparationAxis & \" \" & INDEX(labels!A55:C55,1,MATCH(PP_Language,labels!A1:C1,0)) &  \"  {\"&COLUMN(D601)&\"}\"","v":"/notes-receivables-breakdown Enkelvoudig Commercial Huidig  {4}"},null,{"$f":"\"/notes-receivables-breakdown \" & INDEX(labels!A56:C56,1,MATCH(PP_Language,labels!A1:C1,0)) & \" \" & BasisOfPreparationAxis & \" \" & INDEX(labels!A57:C57,1,MATCH(PP_Language,labels!A1:C1,0)) &  \"  {\"&COLUMN(F601)&\"}\"","v":"/notes-receivables-breakdown Enkelvoudig Commercial Voorgaand  {6}"}]
["",{"$f":"INDEX(labels!A405:C405,1,MATCH(PP_Language,labels!A1:C1,0))","v":"Overige vorderingen"},"-",{"$f":"IF(OR(NOT(0=0),NOT(0=0)), + 0,\"\")","v":""},null,{"$f":"IF(OR(NOT(0=0),NOT(0=0)), + 0,\"\")","v":""}]
[""]
["",{"$f":"INDEX(labels!A406:C406,1,MATCH(PP_Language,labels!A1:C1,0))","v":"Totaal van vorderingen"},"-",{"$f":"IF(OR(NOT(0=0),NOT(AND(Stamdata!D603=\"\",Stamdata!D604=\"\"))), + SUM(Stamdata!D603,Stamdata!D604),\"\")","v":""},null,{"$f":"IF(OR(NOT(0=0),NOT(AND(Stamdata!F603=\"\",Stamdata!F604=\"\"))), + SUM(Stamdata!F603,Stamdata!F604),\"\")","v":""}]
[""]
["",null,null,null,null,null,null,null,null,null,null,null,null,null,null,null,null,null,null,null,null,null,null,null,null,{"$f":"\"//notes-receivables-breakdown label {\"&COLUMN(B606)&\"}\"","v":"//notes-receivables-breakdown label {2}"},null,{"$f":"\"//notes-receivables-breakdown \" & INDEX(labels!A56:C56,1,MATCH(PP_Language,labels!A1:C1,0)) & \" \" & BasisOfPreparationAxis & \" \" & INDEX(labels!A55:C55,1,MATCH(PP_Language,labels!A1:C1,0)) &  \"  {\"&COLUMN(D606)&\"}\"","v":"//notes-receivables-breakdown Enkelvoudig Commercial Huidig  {4}"},null,{"$f":"\"//notes-receivables-breakdown \" & INDEX(labels!A56:C56,1,MATCH(PP_Language,labels!A1:C1,0)) & \" \" & BasisOfPreparationAxis & \" \" & INDEX(labels!A57:C57,1,MATCH(PP_Language,labels!A1:C1,0)) &  \"  {\"&COLUMN(F606)&\"}\"","v":"//notes-receivables-breakdown Enkelvoudig Commercial Voorgaand  {6}"}]
["",{"$f":"INDEX(labels!A407:C407,1,MATCH(PP_Language,labels!A1:C1,0))","v":"Toelichting op de jaarrekening - Vorderingen"}]
[""]
[""]
["",{"$f":"INDEX(labels!A408:C408,1,MATCH(PP_Language,labels!A1:C1,0))","v":"Informatieverschaffing over vorderingen"},"",null,null,null,null,null,null,null,null,null,null,null,null,null,null,null,null,null,null,null,null,null,null,{"$f":"\"/notes-receivables label {\"&COLUMN(B610)&\"}\"","v":"/notes-receivables label {2}"},null,{"$f":"\"/notes-receivables \" & INDEX(labels!A56:C56,1,MATCH(PP_Language,labels!A1:C1,0)) & \" \" & BasisOfPreparationAxis & \"  {\"&COLUMN(D610)&\"}\"","v":"/notes-receivables Enkelvoudig Commercial  {4}"}]
["",{"$f":"INDEX(labels!A381:C381,1,MATCH(PP_Language,labels!A1:C1,0))","v":"Informatieverschaffing over latente belastingvorderingen"},""]
["",{"$f":"INDEX(labels!A409:C409,1,MATCH(PP_Language,labels!A1:C1,0))","v":"Informatieverschaffing over overlopende activa"},""]
["",{"$f":"INDEX(labels!A410:C410,1,MATCH(PP_Language,labels!A1:C1,0))","v":"Beschrijving van vorderingen waarvan de rechtspersoon niet de juridische eigendom bezit"},""]
["",{"$f":"INDEX(labels!A411:C411,1,MATCH(PP_Language,labels!A1:C1,0))","v":"Informatieverschaffing over vorderingen met een looptijd langer dan een jaar"},""]
[""]
["",null,null,null,null,null,null,null,null,null,null,null,null,null,null,null,null,null,null,null,null,null,null,null,null,{"$f":"\"//notes-receivables label {\"&COLUMN(B616)&\"}\"","v":"//notes-receivables label {2}"},null,{"$f":"\"//notes-receivables \" & INDEX(labels!A56:C56,1,MATCH(PP_Language,labels!A1:C1,0)) & \" \" & BasisOfPreparationAxis & \"  {\"&COLUMN(D616)&\"}\"","v":"//notes-receivables Enkelvoudig Commercial  {4}"}]
["",{"$f":"INDEX(labels!A412:C412,1,MATCH(PP_Language,labels!A1:C1,0))","v":"Toelichting op de jaarrekening - Vorderingen: Uitsplitsing looptijd"}]
[""]
[""]
["",{"$f":"INDEX(labels!A404:C404,1,MATCH(PP_Language,labels!A1:C1,0))","v":"Opgevraagde stortingen van geplaatst kapitaal"},"-"]
["",{"$f":"INDEX(labels!A405:C405,1,MATCH(PP_Language,labels!A1:C1,0))","v":"Overige vorderingen"},"-"]
[""]
["",{"$f":"INDEX(labels!A406:C406,1,MATCH(PP_Language,labels!A1:C1,0))","v":"Totaal van vorderingen"},"-"]
[""]
[""]
["",{"$f":"INDEX(labels!A67:C67,1,MATCH(PP_Language,labels!A1:C1,0))","v":"Effecten"}]
["",{"$f":"INDEX(labels!A413:C413,1,MATCH(PP_Language,labels!A1:C1,0))","v":"Toelichting op de jaarrekening - Effecten"}]
[""]
[""]
["",{"$f":"INDEX(labels!A414:C414,1,MATCH(PP_Language,labels!A1:C1,0))","v":"Informatieverschaffing over effecten"},"",null,null,null,null,null,null,null,null,null,null,null,null,null,null,null,null,null,null,null,null,null,null,{"$f":"\"/notes-securities label {\"&COLUMN(B630)&\"}\"","v":"/notes-securities label {2}"},null,{"$f":"\"/notes-securities \" & INDEX(labels!A56:C56,1,MATCH(PP_Language,labels!A1:C1,0)) & \" \" & BasisOfPreparationAxis & \"  {\"&COLUMN(D630)&\"}\"","v":"/notes-securities Enkelvoudig Commercial  {4}"}]
["",{"$f":"INDEX(labels!A415:C415,1,MATCH(PP_Language,labels!A1:C1,0))","v":"Informatieverschaffing over de reële waarde van effecten"},""]
[""]
["",null,null,null,null,null,null,null,null,null,null,null,null,null,null,null,null,null,null,null,null,null,null,null,null,{"$f":"\"//notes-securities label {\"&COLUMN(B633)&\"}\"","v":"//notes-securities label {2}"},null,{"$f":"\"//notes-securities \" & INDEX(labels!A56:C56,1,MATCH(PP_Language,labels!A1:C1,0)) & \" \" & BasisOfPreparationAxis & \"  {\"&COLUMN(D633)&\"}\"","v":"//notes-securities Enkelvoudig Commercial  {4}"}]
["",{"$f":"INDEX(labels!A68:C68,1,MATCH(PP_Language,labels!A1:C1,0))","v":"Liquide middelen"}]
["",{"$f":"INDEX(labels!A416:C416,1,MATCH(PP_Language,labels!A1:C1,0))","v":"Toelichting op de jaarrekening - Liquide middelen"}]
[""]
[""]
["",{"$f":"INDEX(labels!A417:C417,1,MATCH(PP_Language,labels!A1:C1,0))","v":"Informatieverschaffing over liquide middelen"},"",null,null,null,null,null,null,null,null,null,null,null,null,null,null,null,null,null,null,null,null,null,null,{"$f":"\"/notes-cash-and-cash-equivalents label {\"&COLUMN(B638)&\"}\"","v":"/notes-cash-and-cash-equivalents label {2}"},null,{"$f":"\"/notes-cash-and-cash-equivalents \" & INDEX(labels!A56:C56,1,MATCH(PP_Language,labels!A1:C1,0)) & \" \" & BasisOfPreparationAxis & \"  {\"&COLUMN(D638)&\"}\"","v":"/notes-cash-and-cash-equivalents Enkelvoudig Commercial  {4}"}]
["",{"$f":"INDEX(labels!A418:C418,1,MATCH(PP_Language,labels!A1:C1,0))","v":"Informatieverschaffing over wissels en cheques"},""]
[""]
["",null,null,null,null,null,null,null,null,null,null,null,null,null,null,null,null,null,null,null,null,null,null,null,null,{"$f":"\"//notes-cash-and-cash-equivalents label {\"&COLUMN(B641)&\"}\"","v":"//notes-cash-and-cash-equivalents label {2}"},null,{"$f":"\"//notes-cash-and-cash-equivalents \" & INDEX(labels!A56:C56,1,MATCH(PP_Language,labels!A1:C1,0)) & \" \" & BasisOfPreparationAxis & \"  {\"&COLUMN(D641)&\"}\"","v":"//notes-cash-and-cash-equivalents Enkelvoudig Commercial  {4}"}]
["",{"$f":"INDEX(labels!A419:C419,1,MATCH(PP_Language,labels!A1:C1,0))","v":"Eigen vermogen"}]
["",{"$f":"INDEX(labels!A420:C420,1,MATCH(PP_Language,labels!A1:C1,0))","v":"Toelichting op de jaarrekening - Eigen vermogen"}]
[""]
[""]
["",{"$f":"INDEX(labels!A421:C421,1,MATCH(PP_Language,labels!A1:C1,0))","v":"Informatieverschaffing over eigen vermogen"},"",null,null,null,null,null,null,null,null,null,null,null,null,null,null,null,null,null,null,null,null,null,null,{"$f":"\"/notes-equity label {\"&COLUMN(B646)&\"}\"","v":"/notes-equity label {2}"},null,{"$f":"\"/notes-equity \" & INDEX(labels!A56:C56,1,MATCH(PP_Language,labels!A1:C1,0)) & \" \" & BasisOfPreparationAxis & \"  {\"&COLUMN(D646)&\"}\"","v":"/notes-equity Enkelvoudig Commercial  {4}"}]
["",{"$f":"INDEX(labels!A422:C422,1,MATCH(PP_Language,labels!A1:C1,0))","v":"Informatieverschaffing over de continuïteit met effect op het eigen vermogen"},""]
["",{"$f":"INDEX(labels!A423:C423,1,MATCH(PP_Language,labels!A1:C1,0))","v":"Informatieverschaffing over belangrijke mutaties na balansdatum met effect op het eigen vermogen"},""]
["",{"$f":"INDEX(labels!A424:C424,1,MATCH(PP_Language,labels!A1:C1,0))","v":"Informatieverschaffing over garantievermogen"},""]
["",{"$f":"INDEX(labels!A425:C425,1,MATCH(PP_Language,labels!A1:C1,0))","v":"Beschrijving van het ingehouden deel van de jaarwinst binnen het eigen vermogen"},""]
[""]
["",null,null,null,null,null,null,null,null,null,null,null,null,null,null,null,null,null,null,null,null,null,null,null,null,{"$f":"\"//notes-equity label {\"&COLUMN(B652)&\"}\"","v":"//notes-equity label {2}"},null,{"$f":"\"//notes-equity \" & INDEX(labels!A56:C56,1,MATCH(PP_Language,labels!A1:C1,0)) & \" \" & BasisOfPreparationAxis & \"  {\"&COLUMN(D652)&\"}\"","v":"//notes-equity Enkelvoudig Commercial  {4}"}]
["",{"$f":"INDEX(labels!A426:C426,1,MATCH(PP_Language,labels!A1:C1,0))","v":"Aandelenkapitaal"}]
["",{"$f":"INDEX(labels!A427:C427,1,MATCH(PP_Language,labels!A1:C1,0))","v":"Toelichting op de jaarrekening - Aandelenkapitaal: Mutatieoverzicht in aantal aandelen: Specificatie"}]
[""]
[""]
["",null,null,{"$f":"\" \"  & INDEX(labels!A56:C56,1,MATCH(PP_Language,labels!A1:C1,0)) &  \"  \"  & INDEX(labels!A428:C428,1,MATCH(PP_Language,labels!A1:C1,0)) &  \" \"","v":" Enkelvoudig  Aandelenkapitaal (aantal aandelen) "},{"$f":"\" \"  & INDEX(labels!A56:C56,1,MATCH(PP_Language,labels!A1:C1,0)) &  \"  \"  & INDEX(labels!A428:C428,1,MATCH(PP_Language,labels!A1:C1,0)) &  \" \"","v":" Enkelvoudig  Aandelenkapitaal (aantal aandelen) "},{"$f":"\" \"  & INDEX(labels!A56:C56,1,MATCH(PP_Language,labels!A1:C1,0)) &  \"  \"  & INDEX(labels!A428:C428,1,MATCH(PP_Language,labels!A1:C1,0)) &  \" \"","v":" Enkelvoudig  Aandelenkapitaal (aantal aandelen) "},{"$f":"\" \"  & INDEX(labels!A56:C56,1,MATCH(PP_Language,labels!A1:C1,0)) &  \"  \"  & INDEX(labels!A428:C428,1,MATCH(PP_Language,labels!A1:C1,0)) &  \" \"","v":" Enkelvoudig  Aandelenkapitaal (aantal aandelen) "},{"$f":"\" \"  & INDEX(labels!A56:C56,1,MATCH(PP_Language,labels!A1:C1,0)) &  \"  \"  & INDEX(labels!A428:C428,1,MATCH(PP_Language,labels!A1:C1,0)) &  \" \"","v":" Enkelvoudig  Aandelenkapitaal (aantal aandelen) "},null,null,null,null,null,null,null,null,null,null,null,null,null,null,null,null,null,{"$f":"\"/notes-share-capital-statement-of-changes-numberof-shares-specification label {\"&COLUMN(B657)&\"}\"","v":"/notes-share-capital-statement-of-changes-numberof-shares-specification label {2}"},null,{"$f":"\"/notes-share-capital-statement-of-changes-numberof-shares-specification \" & INDEX(labels!A56:C56,1,MATCH(PP_Language,labels!A1:C1,0)) & \" \" & INDEX(labels!A428:C428,1,MATCH(PP_Language,labels!A1:C1,0)) & \" \" & BasisOfPreparationAxis & \"  {\"&COLUMN(D657)&\"}\"","v":"/notes-share-capital-statement-of-changes-numberof-shares-specification Enkelvoudig Aandelenkapitaal (aantal aandelen) Commercial  {4}"},{"$f":"\"/notes-share-capital-statement-of-changes-numberof-shares-specification \" & INDEX(labels!A56:C56,1,MATCH(PP_Language,labels!A1:C1,0)) & \" \" & INDEX(labels!A428:C428,1,MATCH(PP_Language,labels!A1:C1,0)) & \" \" & BasisOfPreparationAxis & \"  {\"&COLUMN(E657)&\"}\"","v":"/notes-share-capital-statement-of-changes-numberof-shares-specification Enkelvoudig Aandelenkapitaal (aantal aandelen) Commercial  {5}"},{"$f":"\"/notes-share-capital-statement-of-changes-numberof-shares-specification \" & INDEX(labels!A56:C56,1,MATCH(PP_Language,labels!A1:C1,0)) & \" \" & INDEX(labels!A428:C428,1,MATCH(PP_Language,labels!A1:C1,0)) & \" \" & BasisOfPreparationAxis & \"  {\"&COLUMN(F657)&\"}\"","v":"/notes-share-capital-statement-of-changes-numberof-shares-specification Enkelvoudig Aandelenkapitaal (aantal aandelen) Commercial  {6}"},{"$f":"\"/notes-share-capital-statement-of-changes-numberof-shares-specification \" & INDEX(labels!A56:C56,1,MATCH(PP_Language,labels!A1:C1,0)) & \" \" & INDEX(labels!A428:C428,1,MATCH(PP_Language,labels!A1:C1,0)) & \" \" & BasisOfPreparationAxis & \"  {\"&COLUMN(G657)&\"}\"","v":"/notes-share-capital-statement-of-changes-numberof-shares-specification Enkelvoudig Aandelenkapitaal (aantal aandelen) Commercial  {7}"},{"$f":"\"/notes-share-capital-statement-of-changes-numberof-shares-specification \" & INDEX(labels!A56:C56,1,MATCH(PP_Language,labels!A1:C1,0)) & \" \" & INDEX(labels!A428:C428,1,MATCH(PP_Language,labels!A1:C1,0)) & \" \" & BasisOfPreparationAxis & \"  {\"&COLUMN(H657)&\"}\"","v":"/notes-share-capital-statement-of-changes-numberof-shares-specification Enkelvoudig Aandelenkapitaal (aantal aandelen) Commercial  {8}"}]
["",{"$f":"INDEX(labels!A429:C429,1,MATCH(PP_Language,labels!A1:C1,0))","v":"Omschrijving Aandelenkapitaal (aantal aandelen)"}]
["",{"$f":"INDEX(labels!A430:C430,1,MATCH(PP_Language,labels!A1:C1,0))","v":"Aantal aandelen aan het begin van de periode"},""]
[""]
["",{"$f":"INDEX(labels!A431:C431,1,MATCH(PP_Language,labels!A1:C1,0))","v":"Aandelen uitgegeven"},""]
["",{"$f":"INDEX(labels!A432:C432,1,MATCH(PP_Language,labels!A1:C1,0))","v":"Aandelen ingekocht"},""]
["",{"$f":"INDEX(labels!A433:C433,1,MATCH(PP_Language,labels!A1:C1,0))","v":"Aandelen toegekend"},""]
["",{"$f":"INDEX(labels!A434:C434,1,MATCH(PP_Language,labels!A1:C1,0))","v":"Aandelen verkocht"},""]
["",{"$f":"INDEX(labels!A435:C435,1,MATCH(PP_Language,labels!A1:C1,0))","v":"Aandelen ingetrokken"},""]
["",{"$f":"INDEX(labels!A436:C436,1,MATCH(PP_Language,labels!A1:C1,0))","v":"Aandelen verstrekt als dividend"},""]
["",{"$f":"INDEX(labels!A437:C437,1,MATCH(PP_Language,labels!A1:C1,0))","v":"Overige mutaties"},""]
[""]
["",{"$f":"INDEX(labels!A438:C438,1,MATCH(PP_Language,labels!A1:C1,0))","v":"Totaal van mutaties gedurende de periode"},""]
[""]
["",{"$f":"INDEX(labels!A439:C439,1,MATCH(PP_Language,labels!A1:C1,0))","v":"Aantal aandelen aan het einde van de periode"},""]
[""]
["",{"$f":"INDEX(labels!A141:C141,1,MATCH(PP_Language,labels!A1:C1,0))","v":"Presentatievolgorde"},""]
[""]
[""]
["",null,null,null,null,null,null,null,null,null,null,null,null,null,null,null,null,null,null,null,null,null,null,null,null,{"$f":"\"//notes-share-capital-statement-of-changes-numberof-shares-specification label {\"&COLUMN(B676)&\"}\"","v":"//notes-share-capital-statement-of-changes-numberof-shares-specification label {2}"},null,{"$f":"\"//notes-share-capital-statement-of-changes-numberof-shares-specification \" & INDEX(labels!A56:C56,1,MATCH(PP_Language,labels!A1:C1,0)) & \" \" & INDEX(labels!A428:C428,1,MATCH(PP_Language,labels!A1:C1,0)) & \" \" & BasisOfPreparationAxis & \"  {\"&COLUMN(D676)&\"}\"","v":"//notes-share-capital-statement-of-changes-numberof-shares-specification Enkelvoudig Aandelenkapitaal (aantal aandelen) Commercial  {4}"},{"$f":"\"//notes-share-capital-statement-of-changes-numberof-shares-specification \" & INDEX(labels!A56:C56,1,MATCH(PP_Language,labels!A1:C1,0)) & \" \" & INDEX(labels!A428:C428,1,MATCH(PP_Language,labels!A1:C1,0)) & \" \" & BasisOfPreparationAxis & \"  {\"&COLUMN(E676)&\"}\"","v":"//notes-share-capital-statement-of-changes-numberof-shares-specification Enkelvoudig Aandelenkapitaal (aantal aandelen) Commercial  {5}"},{"$f":"\"//notes-share-capital-statement-of-changes-numberof-shares-specification \" & INDEX(labels!A56:C56,1,MATCH(PP_Language,labels!A1:C1,0)) & \" \" & INDEX(labels!A428:C428,1,MATCH(PP_Language,labels!A1:C1,0)) & \" \" & BasisOfPreparationAxis & \"  {\"&COLUMN(F676)&\"}\"","v":"//notes-share-capital-statement-of-changes-numberof-shares-specification Enkelvoudig Aandelenkapitaal (aantal aandelen) Commercial  {6}"},{"$f":"\"//notes-share-capital-statement-of-changes-numberof-shares-specification \" & INDEX(labels!A56:C56,1,MATCH(PP_Language,labels!A1:C1,0)) & \" \" & INDEX(labels!A428:C428,1,MATCH(PP_Language,labels!A1:C1,0)) & \" \" & BasisOfPreparationAxis & \"  {\"&COLUMN(G676)&\"}\"","v":"//notes-share-capital-statement-of-changes-numberof-shares-specification Enkelvoudig Aandelenkapitaal (aantal aandelen) Commercial  {7}"},{"$f":"\"//notes-share-capital-statement-of-changes-numberof-shares-specification \" & INDEX(labels!A56:C56,1,MATCH(PP_Language,labels!A1:C1,0)) & \" \" & INDEX(labels!A428:C428,1,MATCH(PP_Language,labels!A1:C1,0)) & \" \" & BasisOfPreparationAxis & \"  {\"&COLUMN(H676)&\"}\"","v":"//notes-share-capital-statement-of-changes-numberof-shares-specification Enkelvoudig Aandelenkapitaal (aantal aandelen) Commercial  {8}"}]
["",{"$f":"INDEX(labels!A440:C440,1,MATCH(PP_Language,labels!A1:C1,0))","v":"Toelichting op de jaarrekening - Aandelenkapitaal, voorgaande periode: Mutatieoverzicht in aantal aandelen: Specificatie"}]
[""]
[""]
["",null,null,{"$f":"\" \"  & INDEX(labels!A56:C56,1,MATCH(PP_Language,labels!A1:C1,0)) &  \"  \"  & INDEX(labels!A428:C428,1,MATCH(PP_Language,labels!A1:C1,0)) &  \" \"","v":" Enkelvoudig  Aandelenkapitaal (aantal aandelen) "},{"$f":"\" \"  & INDEX(labels!A56:C56,1,MATCH(PP_Language,labels!A1:C1,0)) &  \"  \"  & INDEX(labels!A428:C428,1,MATCH(PP_Language,labels!A1:C1,0)) &  \" \"","v":" Enkelvoudig  Aandelenkapitaal (aantal aandelen) "},{"$f":"\" \"  & INDEX(labels!A56:C56,1,MATCH(PP_Language,labels!A1:C1,0)) &  \"  \"  & INDEX(labels!A428:C428,1,MATCH(PP_Language,labels!A1:C1,0)) &  \" \"","v":" Enkelvoudig  Aandelenkapitaal (aantal aandelen) "},{"$f":"\" \"  & INDEX(labels!A56:C56,1,MATCH(PP_Language,labels!A1:C1,0)) &  \"  \"  & INDEX(labels!A428:C428,1,MATCH(PP_Language,labels!A1:C1,0)) &  \" \"","v":" Enkelvoudig  Aandelenkapitaal (aantal aandelen) "},{"$f":"\" \"  & INDEX(labels!A56:C56,1,MATCH(PP_Language,labels!A1:C1,0)) &  \"  \"  & INDEX(labels!A428:C428,1,MATCH(PP_Language,labels!A1:C1,0)) &  \" \"","v":" Enkelvoudig  Aandelenkapitaal (aantal aandelen) "},null,null,null,null,null,null,null,null,null,null,null,null,null,null,null,null,null,{"$f":"\"/notes-share-capital-statement-of-changes-numberof-shares-previous-specification label {\"&COLUMN(B680)&\"}\"","v":"/notes-share-capital-statement-of-changes-numberof-shares-previous-specification label {2}"},null,{"$f":"\"/notes-share-capital-statement-of-changes-numberof-shares-previous-specification \" & INDEX(labels!A56:C56,1,MATCH(PP_Language,labels!A1:C1,0)) & \" \" & INDEX(labels!A428:C428,1,MATCH(PP_Language,labels!A1:C1,0)) & \" \" & BasisOfPreparationAxis & \"  {\"&COLUMN(D680)&\"}\"","v":"/notes-share-capital-statement-of-changes-numberof-shares-previous-specification Enkelvoudig Aandelenkapitaal (aantal aandelen) Commercial  {4}"},{"$f":"\"/notes-share-capital-statement-of-changes-numberof-shares-previous-specification \" & INDEX(labels!A56:C56,1,MATCH(PP_Language,labels!A1:C1,0)) & \" \" & INDEX(labels!A428:C428,1,MATCH(PP_Language,labels!A1:C1,0)) & \" \" & BasisOfPreparationAxis & \"  {\"&COLUMN(E680)&\"}\"","v":"/notes-share-capital-statement-of-changes-numberof-shares-previous-specification Enkelvoudig Aandelenkapitaal (aantal aandelen) Commercial  {5}"},{"$f":"\"/notes-share-capital-statement-of-changes-numberof-shares-previous-specification \" & INDEX(labels!A56:C56,1,MATCH(PP_Language,labels!A1:C1,0)) & \" \" & INDEX(labels!A428:C428,1,MATCH(PP_Language,labels!A1:C1,0)) & \" \" & BasisOfPreparationAxis & \"  {\"&COLUMN(F680)&\"}\"","v":"/notes-share-capital-statement-of-changes-numberof-shares-previous-specification Enkelvoudig Aandelenkapitaal (aantal aandelen) Commercial  {6}"},{"$f":"\"/notes-share-capital-statement-of-changes-numberof-shares-previous-specification \" & INDEX(labels!A56:C56,1,MATCH(PP_Language,labels!A1:C1,0)) & \" \" & INDEX(labels!A428:C428,1,MATCH(PP_Language,labels!A1:C1,0)) & \" \" & BasisOfPreparationAxis & \"  {\"&COLUMN(G680)&\"}\"","v":"/notes-share-capital-statement-of-changes-numberof-shares-previous-specification Enkelvoudig Aandelenkapitaal (aantal aandelen) Commercial  {7}"},{"$f":"\"/notes-share-capital-statement-of-changes-numberof-shares-previous-specification \" & INDEX(labels!A56:C56,1,MATCH(PP_Language,labels!A1:C1,0)) & \" \" & INDEX(labels!A428:C428,1,MATCH(PP_Language,labels!A1:C1,0)) & \" \" & BasisOfPreparationAxis & \"  {\"&COLUMN(H680)&\"}\"","v":"/notes-share-capital-statement-of-changes-numberof-shares-previous-specification Enkelvoudig Aandelenkapitaal (aantal aandelen) Commercial  {8}"}]
["",{"$f":"INDEX(labels!A441:C441,1,MATCH(PP_Language,labels!A1:C1,0))","v":"Omschrijving Aandelenkapitaal (aantal aandelen)"}]
["",{"$f":"INDEX(labels!A430:C430,1,MATCH(PP_Language,labels!A1:C1,0))","v":"Aantal aandelen aan het begin van de periode"},""]
[""]
["",{"$f":"INDEX(labels!A431:C431,1,MATCH(PP_Language,labels!A1:C1,0))","v":"Aandelen uitgegeven"},""]
["",{"$f":"INDEX(labels!A432:C432,1,MATCH(PP_Language,labels!A1:C1,0))","v":"Aandelen ingekocht"},""]
["",{"$f":"INDEX(labels!A433:C433,1,MATCH(PP_Language,labels!A1:C1,0))","v":"Aandelen toegekend"},""]
["",{"$f":"INDEX(labels!A434:C434,1,MATCH(PP_Language,labels!A1:C1,0))","v":"Aandelen verkocht"},""]
["",{"$f":"INDEX(labels!A435:C435,1,MATCH(PP_Language,labels!A1:C1,0))","v":"Aandelen ingetrokken"},""]
["",{"$f":"INDEX(labels!A436:C436,1,MATCH(PP_Language,labels!A1:C1,0))","v":"Aandelen verstrekt als dividend"},""]
["",{"$f":"INDEX(labels!A437:C437,1,MATCH(PP_Language,labels!A1:C1,0))","v":"Overige mutaties"},""]
[""]
["",{"$f":"INDEX(labels!A438:C438,1,MATCH(PP_Language,labels!A1:C1,0))","v":"Totaal van mutaties gedurende de periode"},""]
[""]
["",{"$f":"INDEX(labels!A439:C439,1,MATCH(PP_Language,labels!A1:C1,0))","v":"Aantal aandelen aan het einde van de periode"},""]
[""]
["",{"$f":"INDEX(labels!A141:C141,1,MATCH(PP_Language,labels!A1:C1,0))","v":"Presentatievolgorde"},""]
[""]
[""]
["",null,null,null,null,null,null,null,null,null,null,null,null,null,null,null,null,null,null,null,null,null,null,null,null,{"$f":"\"//notes-share-capital-statement-of-changes-numberof-shares-previous-specification label {\"&COLUMN(B699)&\"}\"","v":"//notes-share-capital-statement-of-changes-numberof-shares-previous-specification label {2}"},null,{"$f":"\"//notes-share-capital-statement-of-changes-numberof-shares-previous-specification \" & INDEX(labels!A56:C56,1,MATCH(PP_Language,labels!A1:C1,0)) & \" \" & INDEX(labels!A428:C428,1,MATCH(PP_Language,labels!A1:C1,0)) & \" \" & BasisOfPreparationAxis & \"  {\"&COLUMN(D699)&\"}\"","v":"//notes-share-capital-statement-of-changes-numberof-shares-previous-specification Enkelvoudig Aandelenkapitaal (aantal aandelen) Commercial  {4}"},{"$f":"\"//notes-share-capital-statement-of-changes-numberof-shares-previous-specification \" & INDEX(labels!A56:C56,1,MATCH(PP_Language,labels!A1:C1,0)) & \" \" & INDEX(labels!A428:C428,1,MATCH(PP_Language,labels!A1:C1,0)) & \" \" & BasisOfPreparationAxis & \"  {\"&COLUMN(E699)&\"}\"","v":"//notes-share-capital-statement-of-changes-numberof-shares-previous-specification Enkelvoudig Aandelenkapitaal (aantal aandelen) Commercial  {5}"},{"$f":"\"//notes-share-capital-statement-of-changes-numberof-shares-previous-specification \" & INDEX(labels!A56:C56,1,MATCH(PP_Language,labels!A1:C1,0)) & \" \" & INDEX(labels!A428:C428,1,MATCH(PP_Language,labels!A1:C1,0)) & \" \" & BasisOfPreparationAxis & \"  {\"&COLUMN(F699)&\"}\"","v":"//notes-share-capital-statement-of-changes-numberof-shares-previous-specification Enkelvoudig Aandelenkapitaal (aantal aandelen) Commercial  {6}"},{"$f":"\"//notes-share-capital-statement-of-changes-numberof-shares-previous-specification \" & INDEX(labels!A56:C56,1,MATCH(PP_Language,labels!A1:C1,0)) & \" \" & INDEX(labels!A428:C428,1,MATCH(PP_Language,labels!A1:C1,0)) & \" \" & BasisOfPreparationAxis & \"  {\"&COLUMN(G699)&\"}\"","v":"//notes-share-capital-statement-of-changes-numberof-shares-previous-specification Enkelvoudig Aandelenkapitaal (aantal aandelen) Commercial  {7}"},{"$f":"\"//notes-share-capital-statement-of-changes-numberof-shares-previous-specification \" & INDEX(labels!A56:C56,1,MATCH(PP_Language,labels!A1:C1,0)) & \" \" & INDEX(labels!A428:C428,1,MATCH(PP_Language,labels!A1:C1,0)) & \" \" & BasisOfPreparationAxis & \"  {\"&COLUMN(H699)&\"}\"","v":"//notes-share-capital-statement-of-changes-numberof-shares-previous-specification Enkelvoudig Aandelenkapitaal (aantal aandelen) Commercial  {8}"}]
["",{"$f":"INDEX(labels!A442:C442,1,MATCH(PP_Language,labels!A1:C1,0))","v":"Toelichting op de jaarrekening - Aandelenkapitaal"}]
[""]
[""]
["",{"$f":"INDEX(labels!A443:C443,1,MATCH(PP_Language,labels!A1:C1,0))","v":"Informatieverschaffing over gestort en opgevraagd aandelenkapitaal"},"",null,null,null,null,null,null,null,null,null,null,null,null,null,null,null,null,null,null,null,null,null,null,{"$f":"\"/notes-share-capital label {\"&COLUMN(B703)&\"}\"","v":"/notes-share-capital label {2}"},null,{"$f":"\"/notes-share-capital \" & INDEX(labels!A56:C56,1,MATCH(PP_Language,labels!A1:C1,0)) & \" \" & BasisOfPreparationAxis & \"  {\"&COLUMN(D703)&\"}\"","v":"/notes-share-capital Enkelvoudig Commercial  {4}"}]
["",{"$f":"INDEX(labels!A444:C444,1,MATCH(PP_Language,labels!A1:C1,0))","v":"Informatieverschaffing over eigen aandelen"},""]
["",{"$f":"INDEX(labels!A445:C445,1,MATCH(PP_Language,labels!A1:C1,0))","v":"Beschrijving van de verwerving en vervreemding van eigen aandelen en certificaten daarvan"},""]
["",{"$f":"INDEX(labels!A446:C446,1,MATCH(PP_Language,labels!A1:C1,0))","v":"Beschrijving van de opgave van de wijze waarop stortingen op aandelen zijn verricht die in het boekjaar opeisbaar werden of vrijwillig zijn verricht"},""]
[""]
["",null,null,null,null,null,null,null,null,null,null,null,null,null,null,null,null,null,null,null,null,null,null,null,null,{"$f":"\"//notes-share-capital label {\"&COLUMN(B708)&\"}\"","v":"//notes-share-capital label {2}"},null,{"$f":"\"//notes-share-capital \" & INDEX(labels!A56:C56,1,MATCH(PP_Language,labels!A1:C1,0)) & \" \" & BasisOfPreparationAxis & \"  {\"&COLUMN(D708)&\"}\"","v":"//notes-share-capital Enkelvoudig Commercial  {4}"}]
["",{"$f":"INDEX(labels!A447:C447,1,MATCH(PP_Language,labels!A1:C1,0))","v":"Toelichting op de jaarrekening - Aandelenkapitaal: Overige bedragen: Uitsplitsing"}]
["",null,null,{"$f":"INDEX(labels!A55:C55,1,MATCH(PP_Language,labels!A1:C1,0))","v":"Huidig"},null,{"$f":"INDEX(labels!A57:C57,1,MATCH(PP_Language,labels!A1:C1,0))","v":"Voorgaand"}]
[""]
["",{"$f":"INDEX(labels!A448:C448,1,MATCH(PP_Language,labels!A1:C1,0))","v":"Geplaatst aandelenkapitaal"},"+",null,null,null,null,null,null,null,null,null,null,null,null,null,null,null,null,null,null,null,null,null,null,{"$f":"\"/notes-share-capital-other-amounts-breakdown label {\"&COLUMN(B712)&\"}\"","v":"/notes-share-capital-other-amounts-breakdown label {2}"},null,{"$f":"\"/notes-share-capital-other-amounts-breakdown \" & INDEX(labels!A56:C56,1,MATCH(PP_Language,labels!A1:C1,0)) & \" \" & BasisOfPreparationAxis & \" \" & INDEX(labels!A55:C55,1,MATCH(PP_Language,labels!A1:C1,0)) &  \"  {\"&COLUMN(D712)&\"}\"","v":"/notes-share-capital-other-amounts-breakdown Enkelvoudig Commercial Huidig  {4}"},null,{"$f":"\"/notes-share-capital-other-amounts-breakdown \" & INDEX(labels!A56:C56,1,MATCH(PP_Language,labels!A1:C1,0)) & \" \" & BasisOfPreparationAxis & \" \" & INDEX(labels!A57:C57,1,MATCH(PP_Language,labels!A1:C1,0)) &  \"  {\"&COLUMN(F712)&\"}\"","v":"/notes-share-capital-other-amounts-breakdown Enkelvoudig Commercial Voorgaand  {6}"}]
["",{"$f":"INDEX(labels!A449:C449,1,MATCH(PP_Language,labels!A1:C1,0))","v":"Gestort aandelenkapitaal"},"+"]
["",{"$f":"INDEX(labels!A450:C450,1,MATCH(PP_Language,labels!A1:C1,0))","v":"Maatschappelijk kapitaal"},"+"]
[""]
["",null,null,null,null,null,null,null,null,null,null,null,null,null,null,null,null,null,null,null,null,null,null,null,null,{"$f":"\"//notes-share-capital-other-amounts-breakdown label {\"&COLUMN(B716)&\"}\"","v":"//notes-share-capital-other-amounts-breakdown label {2}"},null,{"$f":"\"//notes-share-capital-other-amounts-breakdown \" & INDEX(labels!A56:C56,1,MATCH(PP_Language,labels!A1:C1,0)) & \" \" & BasisOfPreparationAxis & \" \" & INDEX(labels!A55:C55,1,MATCH(PP_Language,labels!A1:C1,0)) &  \"  {\"&COLUMN(D716)&\"}\"","v":"//notes-share-capital-other-amounts-breakdown Enkelvoudig Commercial Huidig  {4}"},null,{"$f":"\"//notes-share-capital-other-amounts-breakdown \" & INDEX(labels!A56:C56,1,MATCH(PP_Language,labels!A1:C1,0)) & \" \" & BasisOfPreparationAxis & \" \" & INDEX(labels!A57:C57,1,MATCH(PP_Language,labels!A1:C1,0)) &  \"  {\"&COLUMN(F716)&\"}\"","v":"//notes-share-capital-other-amounts-breakdown Enkelvoudig Commercial Voorgaand  {6}"}]
["",{"$f":"INDEX(labels!A451:C451,1,MATCH(PP_Language,labels!A1:C1,0))","v":"Toelichting op de jaarrekening - Aandelenkapitaal: Specificatie"}]
["",null,null,{"$f":"INDEX(labels!A55:C55,1,MATCH(PP_Language,labels!A1:C1,0))","v":"Huidig"}]
[""]
["",null,null,{"$f":"\" \"  & INDEX(labels!A56:C56,1,MATCH(PP_Language,labels!A1:C1,0)) &  \"  \"  & INDEX(labels!A426:C426,1,MATCH(PP_Language,labels!A1:C1,0)) &  \" \"","v":" Enkelvoudig  Aandelenkapitaal "},{"$f":"\" \"  & INDEX(labels!A56:C56,1,MATCH(PP_Language,labels!A1:C1,0)) &  \"  \"  & INDEX(labels!A426:C426,1,MATCH(PP_Language,labels!A1:C1,0)) &  \" \"","v":" Enkelvoudig  Aandelenkapitaal "},{"$f":"\" \"  & INDEX(labels!A56:C56,1,MATCH(PP_Language,labels!A1:C1,0)) &  \"  \"  & INDEX(labels!A426:C426,1,MATCH(PP_Language,labels!A1:C1,0)) &  \" \"","v":" Enkelvoudig  Aandelenkapitaal "},{"$f":"\" \"  & INDEX(labels!A56:C56,1,MATCH(PP_Language,labels!A1:C1,0)) &  \"  \"  & INDEX(labels!A426:C426,1,MATCH(PP_Language,labels!A1:C1,0)) &  \" \"","v":" Enkelvoudig  Aandelenkapitaal "},{"$f":"\" \"  & INDEX(labels!A56:C56,1,MATCH(PP_Language,labels!A1:C1,0)) &  \"  \"  & INDEX(labels!A426:C426,1,MATCH(PP_Language,labels!A1:C1,0)) &  \" \"","v":" Enkelvoudig  Aandelenkapitaal "},null,null,null,null,null,null,null,null,null,null,null,null,null,null,null,null,null,{"$f":"\"/notes-share-capital-specification label {\"&COLUMN(B720)&\"}\"","v":"/notes-share-capital-specification label {2}"},null,{"$f":"\"/notes-share-capital-specification \" & INDEX(labels!A56:C56,1,MATCH(PP_Language,labels!A1:C1,0)) & \" \" & INDEX(labels!A426:C426,1,MATCH(PP_Language,labels!A1:C1,0)) & \" \" & BasisOfPreparationAxis & \"  {\"&COLUMN(D720)&\"}\"","v":"/notes-share-capital-specification Enkelvoudig Aandelenkapitaal Commercial  {4}"},{"$f":"\"/notes-share-capital-specification \" & INDEX(labels!A56:C56,1,MATCH(PP_Language,labels!A1:C1,0)) & \" \" & INDEX(labels!A426:C426,1,MATCH(PP_Language,labels!A1:C1,0)) & \" \" & BasisOfPreparationAxis & \"  {\"&COLUMN(E720)&\"}\"","v":"/notes-share-capital-specification Enkelvoudig Aandelenkapitaal Commercial  {5}"},{"$f":"\"/notes-share-capital-specification \" & INDEX(labels!A56:C56,1,MATCH(PP_Language,labels!A1:C1,0)) & \" \" & INDEX(labels!A426:C426,1,MATCH(PP_Language,labels!A1:C1,0)) & \" \" & BasisOfPreparationAxis & \"  {\"&COLUMN(F720)&\"}\"","v":"/notes-share-capital-specification Enkelvoudig Aandelenkapitaal Commercial  {6}"},{"$f":"\"/notes-share-capital-specification \" & INDEX(labels!A56:C56,1,MATCH(PP_Language,labels!A1:C1,0)) & \" \" & INDEX(labels!A426:C426,1,MATCH(PP_Language,labels!A1:C1,0)) & \" \" & BasisOfPreparationAxis & \"  {\"&COLUMN(G720)&\"}\"","v":"/notes-share-capital-specification Enkelvoudig Aandelenkapitaal Commercial  {7}"},{"$f":"\"/notes-share-capital-specification \" & INDEX(labels!A56:C56,1,MATCH(PP_Language,labels!A1:C1,0)) & \" \" & INDEX(labels!A426:C426,1,MATCH(PP_Language,labels!A1:C1,0)) & \" \" & BasisOfPreparationAxis & \"  {\"&COLUMN(H720)&\"}\"","v":"/notes-share-capital-specification Enkelvoudig Aandelenkapitaal Commercial  {8}"}]
["",{"$f":"INDEX(labels!A452:C452,1,MATCH(PP_Language,labels!A1:C1,0))","v":"Omschrijving Aandelenkapitaal"}]
["",{"$f":"INDEX(labels!A443:C443,1,MATCH(PP_Language,labels!A1:C1,0))","v":"Informatieverschaffing over gestort en opgevraagd aandelenkapitaal"},""]
["",{"$f":"INDEX(labels!A141:C141,1,MATCH(PP_Language,labels!A1:C1,0))","v":"Presentatievolgorde"},""]
[""]
["",null,null,null,null,null,null,null,null,null,null,null,null,null,null,null,null,null,null,null,null,null,null,null,null,{"$f":"\"//notes-share-capital-specification label {\"&COLUMN(B725)&\"}\"","v":"//notes-share-capital-specification label {2}"},null,{"$f":"\"//notes-share-capital-specification \" & INDEX(labels!A56:C56,1,MATCH(PP_Language,labels!A1:C1,0)) & \" \" & INDEX(labels!A426:C426,1,MATCH(PP_Language,labels!A1:C1,0)) & \" \" & BasisOfPreparationAxis & \"  {\"&COLUMN(D725)&\"}\"","v":"//notes-share-capital-specification Enkelvoudig Aandelenkapitaal Commercial  {4}"},{"$f":"\"//notes-share-capital-specification \" & INDEX(labels!A56:C56,1,MATCH(PP_Language,labels!A1:C1,0)) & \" \" & INDEX(labels!A426:C426,1,MATCH(PP_Language,labels!A1:C1,0)) & \" \" & BasisOfPreparationAxis & \"  {\"&COLUMN(E725)&\"}\"","v":"//notes-share-capital-specification Enkelvoudig Aandelenkapitaal Commercial  {5}"},{"$f":"\"//notes-share-capital-specification \" & INDEX(labels!A56:C56,1,MATCH(PP_Language,labels!A1:C1,0)) & \" \" & INDEX(labels!A426:C426,1,MATCH(PP_Language,labels!A1:C1,0)) & \" \" & BasisOfPreparationAxis & \"  {\"&COLUMN(F725)&\"}\"","v":"//notes-share-capital-specification Enkelvoudig Aandelenkapitaal Commercial  {6}"},{"$f":"\"//notes-share-capital-specification \" & INDEX(labels!A56:C56,1,MATCH(PP_Language,labels!A1:C1,0)) & \" \" & INDEX(labels!A426:C426,1,MATCH(PP_Language,labels!A1:C1,0)) & \" \" & BasisOfPreparationAxis & \"  {\"&COLUMN(G725)&\"}\"","v":"//notes-share-capital-specification Enkelvoudig Aandelenkapitaal Commercial  {7}"},{"$f":"\"//notes-share-capital-specification \" & INDEX(labels!A56:C56,1,MATCH(PP_Language,labels!A1:C1,0)) & \" \" & INDEX(labels!A426:C426,1,MATCH(PP_Language,labels!A1:C1,0)) & \" \" & BasisOfPreparationAxis & \"  {\"&COLUMN(H725)&\"}\"","v":"//notes-share-capital-specification Enkelvoudig Aandelenkapitaal Commercial  {8}"}]
["",{"$f":"INDEX(labels!A72:C72,1,MATCH(PP_Language,labels!A1:C1,0))","v":"Agio"}]
["",{"$f":"INDEX(labels!A453:C453,1,MATCH(PP_Language,labels!A1:C1,0))","v":"Toelichting op de jaarrekening - Agio"}]
[""]
[""]
["",{"$f":"INDEX(labels!A454:C454,1,MATCH(PP_Language,labels!A1:C1,0))","v":"Informatieverschaffing over agio"},"",null,null,null,null,null,null,null,null,null,null,null,null,null,null,null,null,null,null,null,null,null,null,{"$f":"\"/notes-share-premium label {\"&COLUMN(B730)&\"}\"","v":"/notes-share-premium label {2}"},null,{"$f":"\"/notes-share-premium \" & INDEX(labels!A56:C56,1,MATCH(PP_Language,labels!A1:C1,0)) & \" \" & BasisOfPreparationAxis & \"  {\"&COLUMN(D730)&\"}\"","v":"/notes-share-premium Enkelvoudig Commercial  {4}"}]
[""]
["",null,null,null,null,null,null,null,null,null,null,null,null,null,null,null,null,null,null,null,null,null,null,null,null,{"$f":"\"//notes-share-premium label {\"&COLUMN(B732)&\"}\"","v":"//notes-share-premium label {2}"},null,{"$f":"\"//notes-share-premium \" & INDEX(labels!A56:C56,1,MATCH(PP_Language,labels!A1:C1,0)) & \" \" & BasisOfPreparationAxis & \"  {\"&COLUMN(D732)&\"}\"","v":"//notes-share-premium Enkelvoudig Commercial  {4}"}]
["",{"$f":"INDEX(labels!A455:C455,1,MATCH(PP_Language,labels!A1:C1,0))","v":"Herwaarderingsreserve"}]
["",{"$f":"INDEX(labels!A456:C456,1,MATCH(PP_Language,labels!A1:C1,0))","v":"Toelichting op de jaarrekening - Herwaarderingsreserve: Mutatieoverzicht"}]
[""]
[""]
["",null,null,{"$f":"\" \"  & INDEX(labels!A56:C56,1,MATCH(PP_Language,labels!A1:C1,0)) &  \"  \"  & INDEX(labels!A457:C457,1,MATCH(PP_Language,labels!A1:C1,0)) &  \" \"","v":" Enkelvoudig  Waardeveranderingen voor activa, niet zijnde financiële instrumenten, rechtstreeks in eigen vermogen "},{"$f":"\" \"  & INDEX(labels!A56:C56,1,MATCH(PP_Language,labels!A1:C1,0)) &  \"  \"  & INDEX(labels!A458:C458,1,MATCH(PP_Language,labels!A1:C1,0)) &  \" \"","v":" Enkelvoudig  Waardeveranderingen voor financiële instrumenten rechtstreeks in eigen vermogen "},{"$f":"\" \"  & INDEX(labels!A56:C56,1,MATCH(PP_Language,labels!A1:C1,0)) &  \"  \"  & INDEX(labels!A459:C459,1,MATCH(PP_Language,labels!A1:C1,0)) &  \" \"","v":" Enkelvoudig  Totaal van rechtstreeks in eigen vermogen "},{"$f":"\" \"  & INDEX(labels!A56:C56,1,MATCH(PP_Language,labels!A1:C1,0)) &  \"  \"  & INDEX(labels!A460:C460,1,MATCH(PP_Language,labels!A1:C1,0)) &  \" \"","v":" Enkelvoudig  Afgedekt "},{"$f":"\" \"  & INDEX(labels!A56:C56,1,MATCH(PP_Language,labels!A1:C1,0)) &  \"  \"  & INDEX(labels!A461:C461,1,MATCH(PP_Language,labels!A1:C1,0)) &  \" \"","v":" Enkelvoudig  Geen frequente marktnotering "},{"$f":"\" \"  & INDEX(labels!A56:C56,1,MATCH(PP_Language,labels!A1:C1,0)) &  \"  \"  & INDEX(labels!A462:C462,1,MATCH(PP_Language,labels!A1:C1,0)) &  \" \"","v":" Enkelvoudig  Totaal van herwaarderingsreserves "},null,null,null,null,null,null,null,null,null,null,null,null,null,null,null,null,{"$f":"\"/notes-revaluation-reserve-statement-of-changes label {\"&COLUMN(B737)&\"}\"","v":"/notes-revaluation-reserve-statement-of-changes label {2}"},null,{"$f":"\"/notes-revaluation-reserve-statement-of-changes \" & INDEX(labels!A56:C56,1,MATCH(PP_Language,labels!A1:C1,0)) & \" \" & INDEX(labels!A457:C457,1,MATCH(PP_Language,labels!A1:C1,0)) & \" \" & BasisOfPreparationAxis & \"  {\"&COLUMN(D737)&\"}\"","v":"/notes-revaluation-reserve-statement-of-changes Enkelvoudig Waardeveranderingen voor activa, niet zijnde financiële instrumenten, rechtstreeks in eigen vermogen Commercial  {4}"},{"$f":"\"/notes-revaluation-reserve-statement-of-changes \" & INDEX(labels!A56:C56,1,MATCH(PP_Language,labels!A1:C1,0)) & \" \" & INDEX(labels!A458:C458,1,MATCH(PP_Language,labels!A1:C1,0)) & \" \" & BasisOfPreparationAxis & \"  {\"&COLUMN(E737)&\"}\"","v":"/notes-revaluation-reserve-statement-of-changes Enkelvoudig Waardeveranderingen voor financiële instrumenten rechtstreeks in eigen vermogen Commercial  {5}"},{"$f":"\"/notes-revaluation-reserve-statement-of-changes \" & INDEX(labels!A56:C56,1,MATCH(PP_Language,labels!A1:C1,0)) & \" \" & INDEX(labels!A459:C459,1,MATCH(PP_Language,labels!A1:C1,0)) & \" \" & BasisOfPreparationAxis & \"  {\"&COLUMN(F737)&\"}\"","v":"/notes-revaluation-reserve-statement-of-changes Enkelvoudig Totaal van rechtstreeks in eigen vermogen Commercial  {6}"},{"$f":"\"/notes-revaluation-reserve-statement-of-changes \" & INDEX(labels!A56:C56,1,MATCH(PP_Language,labels!A1:C1,0)) & \" \" & INDEX(labels!A460:C460,1,MATCH(PP_Language,labels!A1:C1,0)) & \" \" & BasisOfPreparationAxis & \"  {\"&COLUMN(G737)&\"}\"","v":"/notes-revaluation-reserve-statement-of-changes Enkelvoudig Afgedekt Commercial  {7}"},{"$f":"\"/notes-revaluation-reserve-statement-of-changes \" & INDEX(labels!A56:C56,1,MATCH(PP_Language,labels!A1:C1,0)) & \" \" & INDEX(labels!A461:C461,1,MATCH(PP_Language,labels!A1:C1,0)) & \" \" & BasisOfPreparationAxis & \"  {\"&COLUMN(H737)&\"}\"","v":"/notes-revaluation-reserve-statement-of-changes Enkelvoudig Geen frequente marktnotering Commercial  {8}"},{"$f":"\"/notes-revaluation-reserve-statement-of-changes \" & INDEX(labels!A56:C56,1,MATCH(PP_Language,labels!A1:C1,0)) & \" \" & INDEX(labels!A462:C462,1,MATCH(PP_Language,labels!A1:C1,0)) & \" \" & BasisOfPreparationAxis & \"  {\"&COLUMN(I737)&\"}\"","v":"/notes-revaluation-reserve-statement-of-changes Enkelvoudig Totaal van herwaarderingsreserves Commercial  {9}"}]
["",{"$f":"INDEX(labels!A463:C463,1,MATCH(PP_Language,labels!A1:C1,0))","v":"Herwaarderingsreserve aan het begin van de periode"},"+"]
["",{"$f":"INDEX(labels!A464:C464,1,MATCH(PP_Language,labels!A1:C1,0))","v":"Mutatie in herwaarderingsreserve als gevolg van stelselwijzigingen"},"+"]
["",{"$f":"INDEX(labels!A465:C465,1,MATCH(PP_Language,labels!A1:C1,0))","v":"Mutatie in herwaarderingsreserve als gevolg van belastingeffect van stelselwijzigingen"},"-"]
["",{"$f":"INDEX(labels!A466:C466,1,MATCH(PP_Language,labels!A1:C1,0))","v":"Aangepaste herwaarderingsreserve na herrekening als gevolg van stelselwijziging"},"+"]
[""]
["",{"$f":"INDEX(labels!A467:C467,1,MATCH(PP_Language,labels!A1:C1,0))","v":"Gerealiseerde herwaarderingen via winst-en-verliesrekening"},"-"]
["",{"$f":"INDEX(labels!A468:C468,1,MATCH(PP_Language,labels!A1:C1,0))","v":"Gerealiseerde herwaarderingen via overige reserves"},"-"]
["",{"$f":"INDEX(labels!A469:C469,1,MATCH(PP_Language,labels!A1:C1,0))","v":"Gerealiseerde herwaarderingen via afgedekte activa of passiva"},"-"]
["",{"$f":"INDEX(labels!A470:C470,1,MATCH(PP_Language,labels!A1:C1,0))","v":"Belastingeffecten op gerealiseerde herwaarderingen"},"+"]
["",{"$f":"INDEX(labels!A471:C471,1,MATCH(PP_Language,labels!A1:C1,0))","v":"Gevormde herwaarderingen via winst-en-verliesrekening"},"+"]
["",{"$f":"INDEX(labels!A472:C472,1,MATCH(PP_Language,labels!A1:C1,0))","v":"Gevormde herwaarderingen via overige reserves"},"+"]
["",{"$f":"INDEX(labels!A473:C473,1,MATCH(PP_Language,labels!A1:C1,0))","v":"Gevormde herwaarderingen via afgedekt activa of passiva"},"+"]
["",{"$f":"INDEX(labels!A474:C474,1,MATCH(PP_Language,labels!A1:C1,0))","v":"Belastingeffecten op gevormde herwaarderingen"},"-"]
[""]
["",{"$f":"INDEX(labels!A438:C438,1,MATCH(PP_Language,labels!A1:C1,0))","v":"Totaal van mutaties gedurende de periode"},"+",{"$f":"IF(OR(NOT(AND(Stamdata!D748=\"\",Stamdata!D749=\"\",Stamdata!D750=\"\",Stamdata!D751=\"\")),NOT(AND(Stamdata!D745=\"\",Stamdata!D746=\"\",Stamdata!D747=\"\",Stamdata!D752=\"\"))), SUM(Stamdata!D748,Stamdata!D749,Stamdata!D750,Stamdata!D751)- SUM(Stamdata!D745,Stamdata!D746,Stamdata!D747,Stamdata!D752),\"\")","v":""},{"$f":"IF(OR(NOT(AND(Stamdata!E748=\"\",Stamdata!E749=\"\",Stamdata!E750=\"\",Stamdata!E751=\"\")),NOT(AND(Stamdata!E745=\"\",Stamdata!E746=\"\",Stamdata!E747=\"\",Stamdata!E752=\"\"))), SUM(Stamdata!E748,Stamdata!E749,Stamdata!E750,Stamdata!E751)- SUM(Stamdata!E745,Stamdata!E746,Stamdata!E747,Stamdata!E752),\"\")","v":""},{"$f":"IF(OR(NOT(AND(Stamdata!F748=\"\",Stamdata!F749=\"\",Stamdata!F750=\"\",Stamdata!F751=\"\")),NOT(AND(Stamdata!F745=\"\",Stamdata!F746=\"\",Stamdata!F747=\"\",Stamdata!F752=\"\"))), SUM(Stamdata!F748,Stamdata!F749,Stamdata!F750,Stamdata!F751)- SUM(Stamdata!F745,Stamdata!F746,Stamdata!F747,Stamdata!F752),\"\")","v":""},{"$f":"IF(OR(NOT(AND(Stamdata!G748=\"\",Stamdata!G749=\"\",Stamdata!G750=\"\",Stamdata!G751=\"\")),NOT(AND(Stamdata!G745=\"\",Stamdata!G746=\"\",Stamdata!G747=\"\",Stamdata!G752=\"\"))), SUM(Stamdata!G748,Stamdata!G749,Stamdata!G750,Stamdata!G751)- SUM(Stamdata!G745,Stamdata!G746,Stamdata!G747,Stamdata!G752),\"\")","v":""},{"$f":"IF(OR(NOT(AND(Stamdata!H748=\"\",Stamdata!H749=\"\",Stamdata!H750=\"\",Stamdata!H751=\"\")),NOT(AND(Stamdata!H745=\"\",Stamdata!H746=\"\",Stamdata!H747=\"\",Stamdata!H752=\"\"))), SUM(Stamdata!H748,Stamdata!H749,Stamdata!H750,Stamdata!H751)- SUM(Stamdata!H745,Stamdata!H746,Stamdata!H747,Stamdata!H752),\"\")","v":""},{"$f":"IF(OR(NOT(AND(Stamdata!I748=\"\",Stamdata!I749=\"\",Stamdata!I750=\"\",Stamdata!I751=\"\")),NOT(AND(Stamdata!I745=\"\",Stamdata!I746=\"\",Stamdata!I747=\"\",Stamdata!I752=\"\"))), SUM(Stamdata!I748,Stamdata!I749,Stamdata!I750,Stamdata!I751)- SUM(Stamdata!I745,Stamdata!I746,Stamdata!I747,Stamdata!I752),\"\")","v":""}]
[""]
["",{"$f":"INDEX(labels!A475:C475,1,MATCH(PP_Language,labels!A1:C1,0))","v":"Herwaarderingsreserve aan het einde van de periode"},"+"]
[""]
[""]
["",null,null,null,null,null,null,null,null,null,null,null,null,null,null,null,null,null,null,null,null,null,null,null,null,{"$f":"\"//notes-revaluation-reserve-statement-of-changes label {\"&COLUMN(B757)&\"}\"","v":"//notes-revaluation-reserve-statement-of-changes label {2}"},null,{"$f":"\"//notes-revaluation-reserve-statement-of-changes \" & INDEX(labels!A56:C56,1,MATCH(PP_Language,labels!A1:C1,0)) & \" \" & INDEX(labels!A457:C457,1,MATCH(PP_Language,labels!A1:C1,0)) & \" \" & BasisOfPreparationAxis & \"  {\"&COLUMN(D757)&\"}\"","v":"//notes-revaluation-reserve-statement-of-changes Enkelvoudig Waardeveranderingen voor activa, niet zijnde financiële instrumenten, rechtstreeks in eigen vermogen Commercial  {4}"},{"$f":"\"//notes-revaluation-reserve-statement-of-changes \" & INDEX(labels!A56:C56,1,MATCH(PP_Language,labels!A1:C1,0)) & \" \" & INDEX(labels!A458:C458,1,MATCH(PP_Language,labels!A1:C1,0)) & \" \" & BasisOfPreparationAxis & \"  {\"&COLUMN(E757)&\"}\"","v":"//notes-revaluation-reserve-statement-of-changes Enkelvoudig Waardeveranderingen voor financiële instrumenten rechtstreeks in eigen vermogen Commercial  {5}"},{"$f":"\"//notes-revaluation-reserve-statement-of-changes \" & INDEX(labels!A56:C56,1,MATCH(PP_Language,labels!A1:C1,0)) & \" \" & INDEX(labels!A459:C459,1,MATCH(PP_Language,labels!A1:C1,0)) & \" \" & BasisOfPreparationAxis & \"  {\"&COLUMN(F757)&\"}\"","v":"//notes-revaluation-reserve-statement-of-changes Enkelvoudig Totaal van rechtstreeks in eigen vermogen Commercial  {6}"},{"$f":"\"//notes-revaluation-reserve-statement-of-changes \" & INDEX(labels!A56:C56,1,MATCH(PP_Language,labels!A1:C1,0)) & \" \" & INDEX(labels!A460:C460,1,MATCH(PP_Language,labels!A1:C1,0)) & \" \" & BasisOfPreparationAxis & \"  {\"&COLUMN(G757)&\"}\"","v":"//notes-revaluation-reserve-statement-of-changes Enkelvoudig Afgedekt Commercial  {7}"},{"$f":"\"//notes-revaluation-reserve-statement-of-changes \" & INDEX(labels!A56:C56,1,MATCH(PP_Language,labels!A1:C1,0)) & \" \" & INDEX(labels!A461:C461,1,MATCH(PP_Language,labels!A1:C1,0)) & \" \" & BasisOfPreparationAxis & \"  {\"&COLUMN(H757)&\"}\"","v":"//notes-revaluation-reserve-statement-of-changes Enkelvoudig Geen frequente marktnotering Commercial  {8}"},{"$f":"\"//notes-revaluation-reserve-statement-of-changes \" & INDEX(labels!A56:C56,1,MATCH(PP_Language,labels!A1:C1,0)) & \" \" & INDEX(labels!A462:C462,1,MATCH(PP_Language,labels!A1:C1,0)) & \" \" & BasisOfPreparationAxis & \"  {\"&COLUMN(I757)&\"}\"","v":"//notes-revaluation-reserve-statement-of-changes Enkelvoudig Totaal van herwaarderingsreserves Commercial  {9}"}]
["",{"$f":"INDEX(labels!A476:C476,1,MATCH(PP_Language,labels!A1:C1,0))","v":"Toelichting op de jaarrekening - Herwaarderingsreserve, voorgaande periode: Mutatieoverzicht"}]
[""]
[""]
["",null,null,{"$f":"\" \"  & INDEX(labels!A56:C56,1,MATCH(PP_Language,labels!A1:C1,0)) &  \"  \"  & INDEX(labels!A457:C457,1,MATCH(PP_Language,labels!A1:C1,0)) &  \" \"","v":" Enkelvoudig  Waardeveranderingen voor activa, niet zijnde financiële instrumenten, rechtstreeks in eigen vermogen "},{"$f":"\" \"  & INDEX(labels!A56:C56,1,MATCH(PP_Language,labels!A1:C1,0)) &  \"  \"  & INDEX(labels!A458:C458,1,MATCH(PP_Language,labels!A1:C1,0)) &  \" \"","v":" Enkelvoudig  Waardeveranderingen voor financiële instrumenten rechtstreeks in eigen vermogen "},{"$f":"\" \"  & INDEX(labels!A56:C56,1,MATCH(PP_Language,labels!A1:C1,0)) &  \"  \"  & INDEX(labels!A459:C459,1,MATCH(PP_Language,labels!A1:C1,0)) &  \" \"","v":" Enkelvoudig  Totaal van rechtstreeks in eigen vermogen "},{"$f":"\" \"  & INDEX(labels!A56:C56,1,MATCH(PP_Language,labels!A1:C1,0)) &  \"  \"  & INDEX(labels!A460:C460,1,MATCH(PP_Language,labels!A1:C1,0)) &  \" \"","v":" Enkelvoudig  Afgedekt "},{"$f":"\" \"  & INDEX(labels!A56:C56,1,MATCH(PP_Language,labels!A1:C1,0)) &  \"  \"  & INDEX(labels!A461:C461,1,MATCH(PP_Language,labels!A1:C1,0)) &  \" \"","v":" Enkelvoudig  Geen frequente marktnotering "},{"$f":"\" \"  & INDEX(labels!A56:C56,1,MATCH(PP_Language,labels!A1:C1,0)) &  \"  \"  & INDEX(labels!A462:C462,1,MATCH(PP_Language,labels!A1:C1,0)) &  \" \"","v":" Enkelvoudig  Totaal van herwaarderingsreserves "},null,null,null,null,null,null,null,null,null,null,null,null,null,null,null,null,{"$f":"\"/notes-revaluation-reserve-statement-of-changes-previous label {\"&COLUMN(B761)&\"}\"","v":"/notes-revaluation-reserve-statement-of-changes-previous label {2}"},null,{"$f":"\"/notes-revaluation-reserve-statement-of-changes-previous \" & INDEX(labels!A56:C56,1,MATCH(PP_Language,labels!A1:C1,0)) & \" \" & INDEX(labels!A457:C457,1,MATCH(PP_Language,labels!A1:C1,0)) & \" \" & BasisOfPreparationAxis & \"  {\"&COLUMN(D761)&\"}\"","v":"/notes-revaluation-reserve-statement-of-changes-previous Enkelvoudig Waardeveranderingen voor activa, niet zijnde financiële instrumenten, rechtstreeks in eigen vermogen Commercial  {4}"},{"$f":"\"/notes-revaluation-reserve-statement-of-changes-previous \" & INDEX(labels!A56:C56,1,MATCH(PP_Language,labels!A1:C1,0)) & \" \" & INDEX(labels!A458:C458,1,MATCH(PP_Language,labels!A1:C1,0)) & \" \" & BasisOfPreparationAxis & \"  {\"&COLUMN(E761)&\"}\"","v":"/notes-revaluation-reserve-statement-of-changes-previous Enkelvoudig Waardeveranderingen voor financiële instrumenten rechtstreeks in eigen vermogen Commercial  {5}"},{"$f":"\"/notes-revaluation-reserve-statement-of-changes-previous \" & INDEX(labels!A56:C56,1,MATCH(PP_Language,labels!A1:C1,0)) & \" \" & INDEX(labels!A459:C459,1,MATCH(PP_Language,labels!A1:C1,0)) & \" \" & BasisOfPreparationAxis & \"  {\"&COLUMN(F761)&\"}\"","v":"/notes-revaluation-reserve-statement-of-changes-previous Enkelvoudig Totaal van rechtstreeks in eigen vermogen Commercial  {6}"},{"$f":"\"/notes-revaluation-reserve-statement-of-changes-previous \" & INDEX(labels!A56:C56,1,MATCH(PP_Language,labels!A1:C1,0)) & \" \" & INDEX(labels!A460:C460,1,MATCH(PP_Language,labels!A1:C1,0)) & \" \" & BasisOfPreparationAxis & \"  {\"&COLUMN(G761)&\"}\"","v":"/notes-revaluation-reserve-statement-of-changes-previous Enkelvoudig Afgedekt Commercial  {7}"},{"$f":"\"/notes-revaluation-reserve-statement-of-changes-previous \" & INDEX(labels!A56:C56,1,MATCH(PP_Language,labels!A1:C1,0)) & \" \" & INDEX(labels!A461:C461,1,MATCH(PP_Language,labels!A1:C1,0)) & \" \" & BasisOfPreparationAxis & \"  {\"&COLUMN(H761)&\"}\"","v":"/notes-revaluation-reserve-statement-of-changes-previous Enkelvoudig Geen frequente marktnotering Commercial  {8}"},{"$f":"\"/notes-revaluation-reserve-statement-of-changes-previous \" & INDEX(labels!A56:C56,1,MATCH(PP_Language,labels!A1:C1,0)) & \" \" & INDEX(labels!A462:C462,1,MATCH(PP_Language,labels!A1:C1,0)) & \" \" & BasisOfPreparationAxis & \"  {\"&COLUMN(I761)&\"}\"","v":"/notes-revaluation-reserve-statement-of-changes-previous Enkelvoudig Totaal van herwaarderingsreserves Commercial  {9}"}]
["",{"$f":"INDEX(labels!A463:C463,1,MATCH(PP_Language,labels!A1:C1,0))","v":"Herwaarderingsreserve aan het begin van de periode"},"+"]
["",{"$f":"INDEX(labels!A464:C464,1,MATCH(PP_Language,labels!A1:C1,0))","v":"Mutatie in herwaarderingsreserve als gevolg van stelselwijzigingen"},"+"]
["",{"$f":"INDEX(labels!A465:C465,1,MATCH(PP_Language,labels!A1:C1,0))","v":"Mutatie in herwaarderingsreserve als gevolg van belastingeffect van stelselwijzigingen"},"-"]
["",{"$f":"INDEX(labels!A466:C466,1,MATCH(PP_Language,labels!A1:C1,0))","v":"Aangepaste herwaarderingsreserve na herrekening als gevolg van stelselwijziging"},"+"]
[""]
["",{"$f":"INDEX(labels!A467:C467,1,MATCH(PP_Language,labels!A1:C1,0))","v":"Gerealiseerde herwaarderingen via winst-en-verliesrekening"},"-"]
["",{"$f":"INDEX(labels!A468:C468,1,MATCH(PP_Language,labels!A1:C1,0))","v":"Gerealiseerde herwaarderingen via overige reserves"},"-"]
["",{"$f":"INDEX(labels!A469:C469,1,MATCH(PP_Language,labels!A1:C1,0))","v":"Gerealiseerde herwaarderingen via afgedekte activa of passiva"},"-"]
["",{"$f":"INDEX(labels!A470:C470,1,MATCH(PP_Language,labels!A1:C1,0))","v":"Belastingeffecten op gerealiseerde herwaarderingen"},"+"]
["",{"$f":"INDEX(labels!A471:C471,1,MATCH(PP_Language,labels!A1:C1,0))","v":"Gevormde herwaarderingen via winst-en-verliesrekening"},"+"]
["",{"$f":"INDEX(labels!A472:C472,1,MATCH(PP_Language,labels!A1:C1,0))","v":"Gevormde herwaarderingen via overige reserves"},"+"]
["",{"$f":"INDEX(labels!A473:C473,1,MATCH(PP_Language,labels!A1:C1,0))","v":"Gevormde herwaarderingen via afgedekt activa of passiva"},"+"]
["",{"$f":"INDEX(labels!A474:C474,1,MATCH(PP_Language,labels!A1:C1,0))","v":"Belastingeffecten op gevormde herwaarderingen"},"-"]
[""]
["",{"$f":"INDEX(labels!A438:C438,1,MATCH(PP_Language,labels!A1:C1,0))","v":"Totaal van mutaties gedurende de periode"},"+",{"$f":"IF(OR(NOT(AND(Stamdata!D772=\"\",Stamdata!D773=\"\",Stamdata!D774=\"\",Stamdata!D775=\"\")),NOT(AND(Stamdata!D769=\"\",Stamdata!D770=\"\",Stamdata!D771=\"\",Stamdata!D776=\"\"))), SUM(Stamdata!D772,Stamdata!D773,Stamdata!D774,Stamdata!D775)- SUM(Stamdata!D769,Stamdata!D770,Stamdata!D771,Stamdata!D776),\"\")","v":""},{"$f":"IF(OR(NOT(AND(Stamdata!E772=\"\",Stamdata!E773=\"\",Stamdata!E774=\"\",Stamdata!E775=\"\")),NOT(AND(Stamdata!E769=\"\",Stamdata!E770=\"\",Stamdata!E771=\"\",Stamdata!E776=\"\"))), SUM(Stamdata!E772,Stamdata!E773,Stamdata!E774,Stamdata!E775)- SUM(Stamdata!E769,Stamdata!E770,Stamdata!E771,Stamdata!E776),\"\")","v":""},{"$f":"IF(OR(NOT(AND(Stamdata!F772=\"\",Stamdata!F773=\"\",Stamdata!F774=\"\",Stamdata!F775=\"\")),NOT(AND(Stamdata!F769=\"\",Stamdata!F770=\"\",Stamdata!F771=\"\",Stamdata!F776=\"\"))), SUM(Stamdata!F772,Stamdata!F773,Stamdata!F774,Stamdata!F775)- SUM(Stamdata!F769,Stamdata!F770,Stamdata!F771,Stamdata!F776),\"\")","v":""},{"$f":"IF(OR(NOT(AND(Stamdata!G772=\"\",Stamdata!G773=\"\",Stamdata!G774=\"\",Stamdata!G775=\"\")),NOT(AND(Stamdata!G769=\"\",Stamdata!G770=\"\",Stamdata!G771=\"\",Stamdata!G776=\"\"))), SUM(Stamdata!G772,Stamdata!G773,Stamdata!G774,Stamdata!G775)- SUM(Stamdata!G769,Stamdata!G770,Stamdata!G771,Stamdata!G776),\"\")","v":""},{"$f":"IF(OR(NOT(AND(Stamdata!H772=\"\",Stamdata!H773=\"\",Stamdata!H774=\"\",Stamdata!H775=\"\")),NOT(AND(Stamdata!H769=\"\",Stamdata!H770=\"\",Stamdata!H771=\"\",Stamdata!H776=\"\"))), SUM(Stamdata!H772,Stamdata!H773,Stamdata!H774,Stamdata!H775)- SUM(Stamdata!H769,Stamdata!H770,Stamdata!H771,Stamdata!H776),\"\")","v":""},{"$f":"IF(OR(NOT(AND(Stamdata!I772=\"\",Stamdata!I773=\"\",Stamdata!I774=\"\",Stamdata!I775=\"\")),NOT(AND(Stamdata!I769=\"\",Stamdata!I770=\"\",Stamdata!I771=\"\",Stamdata!I776=\"\"))), SUM(Stamdata!I772,Stamdata!I773,Stamdata!I774,Stamdata!I775)- SUM(Stamdata!I769,Stamdata!I770,Stamdata!I771,Stamdata!I776),\"\")","v":""}]
[""]
["",{"$f":"INDEX(labels!A475:C475,1,MATCH(PP_Language,labels!A1:C1,0))","v":"Herwaarderingsreserve aan het einde van de periode"},"+"]
[""]
[""]
["",null,null,null,null,null,null,null,null,null,null,null,null,null,null,null,null,null,null,null,null,null,null,null,null,{"$f":"\"//notes-revaluation-reserve-statement-of-changes-previous label {\"&COLUMN(B781)&\"}\"","v":"//notes-revaluation-reserve-statement-of-changes-previous label {2}"},null,{"$f":"\"//notes-revaluation-reserve-statement-of-changes-previous \" & INDEX(labels!A56:C56,1,MATCH(PP_Language,labels!A1:C1,0)) & \" \" & INDEX(labels!A457:C457,1,MATCH(PP_Language,labels!A1:C1,0)) & \" \" & BasisOfPreparationAxis & \"  {\"&COLUMN(D781)&\"}\"","v":"//notes-revaluation-reserve-statement-of-changes-previous Enkelvoudig Waardeveranderingen voor activa, niet zijnde financiële instrumenten, rechtstreeks in eigen vermogen Commercial  {4}"},{"$f":"\"//notes-revaluation-reserve-statement-of-changes-previous \" & INDEX(labels!A56:C56,1,MATCH(PP_Language,labels!A1:C1,0)) & \" \" & INDEX(labels!A458:C458,1,MATCH(PP_Language,labels!A1:C1,0)) & \" \" & BasisOfPreparationAxis & \"  {\"&COLUMN(E781)&\"}\"","v":"//notes-revaluation-reserve-statement-of-changes-previous Enkelvoudig Waardeveranderingen voor financiële instrumenten rechtstreeks in eigen vermogen Commercial  {5}"},{"$f":"\"//notes-revaluation-reserve-statement-of-changes-previous \" & INDEX(labels!A56:C56,1,MATCH(PP_Language,labels!A1:C1,0)) & \" \" & INDEX(labels!A459:C459,1,MATCH(PP_Language,labels!A1:C1,0)) & \" \" & BasisOfPreparationAxis & \"  {\"&COLUMN(F781)&\"}\"","v":"//notes-revaluation-reserve-statement-of-changes-previous Enkelvoudig Totaal van rechtstreeks in eigen vermogen Commercial  {6}"},{"$f":"\"//notes-revaluation-reserve-statement-of-changes-previous \" & INDEX(labels!A56:C56,1,MATCH(PP_Language,labels!A1:C1,0)) & \" \" & INDEX(labels!A460:C460,1,MATCH(PP_Language,labels!A1:C1,0)) & \" \" & BasisOfPreparationAxis & \"  {\"&COLUMN(G781)&\"}\"","v":"//notes-revaluation-reserve-statement-of-changes-previous Enkelvoudig Afgedekt Commercial  {7}"},{"$f":"\"//notes-revaluation-reserve-statement-of-changes-previous \" & INDEX(labels!A56:C56,1,MATCH(PP_Language,labels!A1:C1,0)) & \" \" & INDEX(labels!A461:C461,1,MATCH(PP_Language,labels!A1:C1,0)) & \" \" & BasisOfPreparationAxis & \"  {\"&COLUMN(H781)&\"}\"","v":"//notes-revaluation-reserve-statement-of-changes-previous Enkelvoudig Geen frequente marktnotering Commercial  {8}"},{"$f":"\"//notes-revaluation-reserve-statement-of-changes-previous \" & INDEX(labels!A56:C56,1,MATCH(PP_Language,labels!A1:C1,0)) & \" \" & INDEX(labels!A462:C462,1,MATCH(PP_Language,labels!A1:C1,0)) & \" \" & BasisOfPreparationAxis & \"  {\"&COLUMN(I781)&\"}\"","v":"//notes-revaluation-reserve-statement-of-changes-previous Enkelvoudig Totaal van herwaarderingsreserves Commercial  {9}"}]
["",{"$f":"INDEX(labels!A477:C477,1,MATCH(PP_Language,labels!A1:C1,0))","v":"Toelichting op de jaarrekening - Herwaarderingsreserve"}]
[""]
[""]
["",{"$f":"INDEX(labels!A478:C478,1,MATCH(PP_Language,labels!A1:C1,0))","v":"Informatieverschaffing over herwaarderingsreserve"},"",null,null,null,null,null,null,null,null,null,null,null,null,null,null,null,null,null,null,null,null,null,null,{"$f":"\"/notes-revaluation-reserve label {\"&COLUMN(B785)&\"}\"","v":"/notes-revaluation-reserve label {2}"},null,{"$f":"\"/notes-revaluation-reserve \" & INDEX(labels!A56:C56,1,MATCH(PP_Language,labels!A1:C1,0)) & \" \" & BasisOfPreparationAxis & \"  {\"&COLUMN(D785)&\"}\"","v":"/notes-revaluation-reserve Enkelvoudig Commercial  {4}"}]
["",{"$f":"INDEX(labels!A479:C479,1,MATCH(PP_Language,labels!A1:C1,0))","v":"Beschrijving van op welke wijze in samenhang met de herwaardering rekening wordt gehouden met de invloed van belastingen op vermogen en resultaat"},""]
[""]
["",null,null,null,null,null,null,null,null,null,null,null,null,null,null,null,null,null,null,null,null,null,null,null,null,{"$f":"\"//notes-revaluation-reserve label {\"&COLUMN(B788)&\"}\"","v":"//notes-revaluation-reserve label {2}"},null,{"$f":"\"//notes-revaluation-reserve \" & INDEX(labels!A56:C56,1,MATCH(PP_Language,labels!A1:C1,0)) & \" \" & BasisOfPreparationAxis & \"  {\"&COLUMN(D788)&\"}\"","v":"//notes-revaluation-reserve Enkelvoudig Commercial  {4}"}]
["",{"$f":"INDEX(labels!A74:C74,1,MATCH(PP_Language,labels!A1:C1,0))","v":"Andere wettelijke reserves"}]
["",{"$f":"INDEX(labels!A480:C480,1,MATCH(PP_Language,labels!A1:C1,0))","v":"Toelichting op de jaarrekening - Andere wettelijke reserves: Uitsplitsing"}]
["",null,null,{"$f":"INDEX(labels!A55:C55,1,MATCH(PP_Language,labels!A1:C1,0))","v":"Huidig"},null,{"$f":"INDEX(labels!A57:C57,1,MATCH(PP_Language,labels!A1:C1,0))","v":"Voorgaand"}]
[""]
["",{"$f":"INDEX(labels!A481:C481,1,MATCH(PP_Language,labels!A1:C1,0))","v":"Negatieve bijschrijvingsreserve als gevolg van de omrekening van het aandelenkapitaal van een naamloze vennootschap naar de euro"},"+",null,null,null,null,null,null,null,null,null,null,null,null,null,null,null,null,null,null,null,null,null,null,{"$f":"\"/notes-legal-reserves-breakdown label {\"&COLUMN(B793)&\"}\"","v":"/notes-legal-reserves-breakdown label {2}"},null,{"$f":"\"/notes-legal-reserves-breakdown \" & INDEX(labels!A56:C56,1,MATCH(PP_Language,labels!A1:C1,0)) & \" \" & BasisOfPreparationAxis & \" \" & INDEX(labels!A55:C55,1,MATCH(PP_Language,labels!A1:C1,0)) &  \"  {\"&COLUMN(D793)&\"}\"","v":"/notes-legal-reserves-breakdown Enkelvoudig Commercial Huidig  {4}"},null,{"$f":"\"/notes-legal-reserves-breakdown \" & INDEX(labels!A56:C56,1,MATCH(PP_Language,labels!A1:C1,0)) & \" \" & BasisOfPreparationAxis & \" \" & INDEX(labels!A57:C57,1,MATCH(PP_Language,labels!A1:C1,0)) &  \"  {\"&COLUMN(F793)&\"}\"","v":"/notes-legal-reserves-breakdown Enkelvoudig Commercial Voorgaand  {6}"}]
["",{"$f":"INDEX(labels!A482:C482,1,MATCH(PP_Language,labels!A1:C1,0))","v":"Niet-uitkeerbare reserve als gevolg van de omrekening van het aandelenkapitaal van een naamloze vennootschap naar de euro"},"+"]
["",{"$f":"INDEX(labels!A483:C483,1,MATCH(PP_Language,labels!A1:C1,0))","v":"Reserve voor inbreng op aandelen anders dan in geld"},"+"]
["",{"$f":"INDEX(labels!A484:C484,1,MATCH(PP_Language,labels!A1:C1,0))","v":"Niet-uitkeerbare reserve voor verstrekte lening ter verkrijging door anderen van aandelen in het kapitaal van de vennootschap of van certificaten daarvan"},"+"]
["",{"$f":"INDEX(labels!A485:C485,1,MATCH(PP_Language,labels!A1:C1,0))","v":"Wettelijke reserve voor kosten die verband houden met de oprichting en met de uitgifte van aandelen"},"+"]
["",{"$f":"INDEX(labels!A486:C486,1,MATCH(PP_Language,labels!A1:C1,0))","v":"Wettelijke reserve voor geactiveerde kosten van ontwikkeling"},"+"]
["",{"$f":"INDEX(labels!A487:C487,1,MATCH(PP_Language,labels!A1:C1,0))","v":"Wettelijke reserve deelnemingen"},"+"]
["",{"$f":"INDEX(labels!A488:C488,1,MATCH(PP_Language,labels!A1:C1,0))","v":"Wettelijke reserve omrekeningsverschillen voor omrekening van het geïnvesteerde vermogen en het resultaat van deelnemingen"},"+"]
["",{"$f":"INDEX(labels!A489:C489,1,MATCH(PP_Language,labels!A1:C1,0))","v":"Reserve omrekeningsverschillen"},"+"]
[""]
["",{"$f":"INDEX(labels!A490:C490,1,MATCH(PP_Language,labels!A1:C1,0))","v":"Totaal van andere wettelijke reserves"},"+",{"$f":"IF(OR(NOT(AND(Stamdata!D795=\"\",Stamdata!D796=\"\",Stamdata!D797=\"\",Stamdata!D798=\"\",Stamdata!D799=\"\",Stamdata!D800=\"\",Stamdata!D801=\"\",Stamdata!D802=\"\",Stamdata!D803=\"\")),NOT(0=0)), SUM(Stamdata!D795,Stamdata!D796,Stamdata!D797,Stamdata!D798,Stamdata!D799,Stamdata!D800,Stamdata!D801,Stamdata!D802,Stamdata!D803),\"\")","v":""},null,{"$f":"IF(OR(NOT(AND(Stamdata!F795=\"\",Stamdata!F796=\"\",Stamdata!F797=\"\",Stamdata!F798=\"\",Stamdata!F799=\"\",Stamdata!F800=\"\",Stamdata!F801=\"\",Stamdata!F802=\"\",Stamdata!F803=\"\")),NOT(0=0)), SUM(Stamdata!F795,Stamdata!F796,Stamdata!F797,Stamdata!F798,Stamdata!F799,Stamdata!F800,Stamdata!F801,Stamdata!F802,Stamdata!F803),\"\")","v":""}]
[""]
["",null,null,null,null,null,null,null,null,null,null,null,null,null,null,null,null,null,null,null,null,null,null,null,null,{"$f":"\"//notes-legal-reserves-breakdown label {\"&COLUMN(B805)&\"}\"","v":"//notes-legal-reserves-breakdown label {2}"},null,{"$f":"\"//notes-legal-reserves-breakdown \" & INDEX(labels!A56:C56,1,MATCH(PP_Language,labels!A1:C1,0)) & \" \" & BasisOfPreparationAxis & \" \" & INDEX(labels!A55:C55,1,MATCH(PP_Language,labels!A1:C1,0)) &  \"  {\"&COLUMN(D805)&\"}\"","v":"//notes-legal-reserves-breakdown Enkelvoudig Commercial Huidig  {4}"},null,{"$f":"\"//notes-legal-reserves-breakdown \" & INDEX(labels!A56:C56,1,MATCH(PP_Language,labels!A1:C1,0)) & \" \" & BasisOfPreparationAxis & \" \" & INDEX(labels!A57:C57,1,MATCH(PP_Language,labels!A1:C1,0)) &  \"  {\"&COLUMN(F805)&\"}\"","v":"//notes-legal-reserves-breakdown Enkelvoudig Commercial Voorgaand  {6}"}]
["",{"$f":"INDEX(labels!A491:C491,1,MATCH(PP_Language,labels!A1:C1,0))","v":"Toelichting op de jaarrekening - Andere wettelijke reserves"}]
[""]
[""]
["",{"$f":"INDEX(labels!A492:C492,1,MATCH(PP_Language,labels!A1:C1,0))","v":"Informatieverschaffing over andere wettelijke reserves, onderscheiden naar hun aard"},"",null,null,null,null,null,null,null,null,null,null,null,null,null,null,null,null,null,null,null,null,null,null,{"$f":"\"/notes-legal-reserves label {\"&COLUMN(B809)&\"}\"","v":"/notes-legal-reserves label {2}"},null,{"$f":"\"/notes-legal-reserves \" & INDEX(labels!A56:C56,1,MATCH(PP_Language,labels!A1:C1,0)) & \" \" & BasisOfPreparationAxis & \"  {\"&COLUMN(D809)&\"}\"","v":"/notes-legal-reserves Enkelvoudig Commercial  {4}"}]
[""]
["",null,null,null,null,null,null,null,null,null,null,null,null,null,null,null,null,null,null,null,null,null,null,null,null,{"$f":"\"//notes-legal-reserves label {\"&COLUMN(B811)&\"}\"","v":"//notes-legal-reserves label {2}"},null,{"$f":"\"//notes-legal-reserves \" & INDEX(labels!A56:C56,1,MATCH(PP_Language,labels!A1:C1,0)) & \" \" & BasisOfPreparationAxis & \"  {\"&COLUMN(D811)&\"}\"","v":"//notes-legal-reserves Enkelvoudig Commercial  {4}"}]
["",{"$f":"INDEX(labels!A75:C75,1,MATCH(PP_Language,labels!A1:C1,0))","v":"Statutaire reserves"}]
["",{"$f":"INDEX(labels!A493:C493,1,MATCH(PP_Language,labels!A1:C1,0))","v":"Toelichting op de jaarrekening - Statutaire reserves"}]
[""]
[""]
["",{"$f":"INDEX(labels!A494:C494,1,MATCH(PP_Language,labels!A1:C1,0))","v":"Informatieverschaffing over statutaire reserves"},"",null,null,null,null,null,null,null,null,null,null,null,null,null,null,null,null,null,null,null,null,null,null,{"$f":"\"/notes-statutory-reserves label {\"&COLUMN(B816)&\"}\"","v":"/notes-statutory-reserves label {2}"},null,{"$f":"\"/notes-statutory-reserves \" & INDEX(labels!A56:C56,1,MATCH(PP_Language,labels!A1:C1,0)) & \" \" & BasisOfPreparationAxis & \"  {\"&COLUMN(D816)&\"}\"","v":"/notes-statutory-reserves Enkelvoudig Commercial  {4}"}]
[""]
["",null,null,null,null,null,null,null,null,null,null,null,null,null,null,null,null,null,null,null,null,null,null,null,null,{"$f":"\"//notes-statutory-reserves label {\"&COLUMN(B818)&\"}\"","v":"//notes-statutory-reserves label {2}"},null,{"$f":"\"//notes-statutory-reserves \" & INDEX(labels!A56:C56,1,MATCH(PP_Language,labels!A1:C1,0)) & \" \" & BasisOfPreparationAxis & \"  {\"&COLUMN(D818)&\"}\"","v":"//notes-statutory-reserves Enkelvoudig Commercial  {4}"}]
["",{"$f":"INDEX(labels!A495:C495,1,MATCH(PP_Language,labels!A1:C1,0))","v":"Toelichting op de jaarrekening - Fiscale herinvesteringsreserve"}]
[""]
[""]
["",{"$f":"INDEX(labels!A496:C496,1,MATCH(PP_Language,labels!A1:C1,0))","v":"Informatieverschaffing over herinvesteringsreserve"},"",null,null,null,null,null,null,null,null,null,null,null,null,null,null,null,null,null,null,null,null,null,null,{"$f":"\"/notes-reinvestment-reserve label {\"&COLUMN(B822)&\"}\"","v":"/notes-reinvestment-reserve label {2}"},null,{"$f":"\"/notes-reinvestment-reserve \" & INDEX(labels!A56:C56,1,MATCH(PP_Language,labels!A1:C1,0)) & \" \" & BasisOfPreparationAxis & \"  {\"&COLUMN(D822)&\"}\"","v":"/notes-reinvestment-reserve Enkelvoudig Commercial  {4}"}]
[""]
["",null,null,null,null,null,null,null,null,null,null,null,null,null,null,null,null,null,null,null,null,null,null,null,null,{"$f":"\"//notes-reinvestment-reserve label {\"&COLUMN(B824)&\"}\"","v":"//notes-reinvestment-reserve label {2}"},null,{"$f":"\"//notes-reinvestment-reserve \" & INDEX(labels!A56:C56,1,MATCH(PP_Language,labels!A1:C1,0)) & \" \" & BasisOfPreparationAxis & \"  {\"&COLUMN(D824)&\"}\"","v":"//notes-reinvestment-reserve Enkelvoudig Commercial  {4}"}]
["",{"$f":"INDEX(labels!A497:C497,1,MATCH(PP_Language,labels!A1:C1,0))","v":"Toelichting op de jaarrekening - Overige reserves"}]
[""]
[""]
["",{"$f":"INDEX(labels!A498:C498,1,MATCH(PP_Language,labels!A1:C1,0))","v":"Informatieverschaffing over overige reserves"},"",null,null,null,null,null,null,null,null,null,null,null,null,null,null,null,null,null,null,null,null,null,null,{"$f":"\"/notes-other-reserves label {\"&COLUMN(B828)&\"}\"","v":"/notes-other-reserves label {2}"},null,{"$f":"\"/notes-other-reserves \" & INDEX(labels!A56:C56,1,MATCH(PP_Language,labels!A1:C1,0)) & \" \" & BasisOfPreparationAxis & \"  {\"&COLUMN(D828)&\"}\"","v":"/notes-other-reserves Enkelvoudig Commercial  {4}"}]
[""]
["",null,null,null,null,null,null,null,null,null,null,null,null,null,null,null,null,null,null,null,null,null,null,null,null,{"$f":"\"//notes-other-reserves label {\"&COLUMN(B830)&\"}\"","v":"//notes-other-reserves label {2}"},null,{"$f":"\"//notes-other-reserves \" & INDEX(labels!A56:C56,1,MATCH(PP_Language,labels!A1:C1,0)) & \" \" & BasisOfPreparationAxis & \"  {\"&COLUMN(D830)&\"}\"","v":"//notes-other-reserves Enkelvoudig Commercial  {4}"}]
["",{"$f":"INDEX(labels!A499:C499,1,MATCH(PP_Language,labels!A1:C1,0))","v":"Toelichting op de jaarrekening - Overige fiscale reserves"}]
[""]
[""]
["",{"$f":"INDEX(labels!A500:C500,1,MATCH(PP_Language,labels!A1:C1,0))","v":"Informatieverschaffing over de overige fiscale reserves"},"",null,null,null,null,null,null,null,null,null,null,null,null,null,null,null,null,null,null,null,null,null,null,{"$f":"\"/notes-other-fiscal-reserves label {\"&COLUMN(B834)&\"}\"","v":"/notes-other-fiscal-reserves label {2}"},null,{"$f":"\"/notes-other-fiscal-reserves \" & INDEX(labels!A56:C56,1,MATCH(PP_Language,labels!A1:C1,0)) & \" \" & BasisOfPreparationAxis & \"  {\"&COLUMN(D834)&\"}\"","v":"/notes-other-fiscal-reserves Enkelvoudig Commercial  {4}"}]
[""]
["",null,null,null,null,null,null,null,null,null,null,null,null,null,null,null,null,null,null,null,null,null,null,null,null,{"$f":"\"//notes-other-fiscal-reserves label {\"&COLUMN(B836)&\"}\"","v":"//notes-other-fiscal-reserves label {2}"},null,{"$f":"\"//notes-other-fiscal-reserves \" & INDEX(labels!A56:C56,1,MATCH(PP_Language,labels!A1:C1,0)) & \" \" & BasisOfPreparationAxis & \"  {\"&COLUMN(D836)&\"}\"","v":"//notes-other-fiscal-reserves Enkelvoudig Commercial  {4}"}]
["",{"$f":"INDEX(labels!A501:C501,1,MATCH(PP_Language,labels!A1:C1,0))","v":"Resultaat van het boekjaar"}]
["",{"$f":"INDEX(labels!A502:C502,1,MATCH(PP_Language,labels!A1:C1,0))","v":"Toelichting op de jaarrekening - Resultaat van het boekjaar"}]
[""]
[""]
["",{"$f":"INDEX(labels!A503:C503,1,MATCH(PP_Language,labels!A1:C1,0))","v":"Informatieverschaffing over resultaat na belastingen van het boekjaar"},"",null,null,null,null,null,null,null,null,null,null,null,null,null,null,null,null,null,null,null,null,null,null,{"$f":"\"/notes-result-for-the-year label {\"&COLUMN(B841)&\"}\"","v":"/notes-result-for-the-year label {2}"},null,{"$f":"\"/notes-result-for-the-year \" & INDEX(labels!A56:C56,1,MATCH(PP_Language,labels!A1:C1,0)) & \" \" & BasisOfPreparationAxis & \"  {\"&COLUMN(D841)&\"}\"","v":"/notes-result-for-the-year Enkelvoudig Commercial  {4}"}]
[""]
["",null,null,null,null,null,null,null,null,null,null,null,null,null,null,null,null,null,null,null,null,null,null,null,null,{"$f":"\"//notes-result-for-the-year label {\"&COLUMN(B843)&\"}\"","v":"//notes-result-for-the-year label {2}"},null,{"$f":"\"//notes-result-for-the-year \" & INDEX(labels!A56:C56,1,MATCH(PP_Language,labels!A1:C1,0)) & \" \" & BasisOfPreparationAxis & \"  {\"&COLUMN(D843)&\"}\"","v":"//notes-result-for-the-year Enkelvoudig Commercial  {4}"}]
["",{"$f":"INDEX(labels!A504:C504,1,MATCH(PP_Language,labels!A1:C1,0))","v":"Toelichting op de jaarrekening - Niet verdeelde winsten"}]
[""]
[""]
["",{"$f":"INDEX(labels!A505:C505,1,MATCH(PP_Language,labels!A1:C1,0))","v":"Informatieverschaffing over niet verdeelde winsten"},"",null,null,null,null,null,null,null,null,null,null,null,null,null,null,null,null,null,null,null,null,null,null,{"$f":"\"/notes-retained-earnings label {\"&COLUMN(B847)&\"}\"","v":"/notes-retained-earnings label {2}"},null,{"$f":"\"/notes-retained-earnings \" & INDEX(labels!A56:C56,1,MATCH(PP_Language,labels!A1:C1,0)) & \" \" & BasisOfPreparationAxis & \"  {\"&COLUMN(D847)&\"}\"","v":"/notes-retained-earnings Enkelvoudig Commercial  {4}"}]
[""]
["",null,null,null,null,null,null,null,null,null,null,null,null,null,null,null,null,null,null,null,null,null,null,null,null,{"$f":"\"//notes-retained-earnings label {\"&COLUMN(B849)&\"}\"","v":"//notes-retained-earnings label {2}"},null,{"$f":"\"//notes-retained-earnings \" & INDEX(labels!A56:C56,1,MATCH(PP_Language,labels!A1:C1,0)) & \" \" & BasisOfPreparationAxis & \"  {\"&COLUMN(D849)&\"}\"","v":"//notes-retained-earnings Enkelvoudig Commercial  {4}"}]
["",{"$f":"INDEX(labels!A82:C82,1,MATCH(PP_Language,labels!A1:C1,0))","v":"Voorzieningen"}]
["",{"$f":"INDEX(labels!A506:C506,1,MATCH(PP_Language,labels!A1:C1,0))","v":"Toelichting op de jaarrekening - Voorzieningen"}]
[""]
[""]
["",{"$f":"INDEX(labels!A507:C507,1,MATCH(PP_Language,labels!A1:C1,0))","v":"Informatieverschaffing over voorzieningen"},"",null,null,null,null,null,null,null,null,null,null,null,null,null,null,null,null,null,null,null,null,null,null,{"$f":"\"/notes-provisions label {\"&COLUMN(B854)&\"}\"","v":"/notes-provisions label {2}"},null,{"$f":"\"/notes-provisions \" & INDEX(labels!A56:C56,1,MATCH(PP_Language,labels!A1:C1,0)) & \" \" & BasisOfPreparationAxis & \"  {\"&COLUMN(D854)&\"}\"","v":"/notes-provisions Enkelvoudig Commercial  {4}"}]
["",{"$f":"INDEX(labels!A508:C508,1,MATCH(PP_Language,labels!A1:C1,0))","v":"Informatieverschaffing over voorziening voor herstelkosten"},""]
["",{"$f":"INDEX(labels!A509:C509,1,MATCH(PP_Language,labels!A1:C1,0))","v":"Informatieverschaffing over voorziening voor belastingverplichtingen"},""]
["",{"$f":"INDEX(labels!A510:C510,1,MATCH(PP_Language,labels!A1:C1,0))","v":"Informatieverschaffing over voorzieningen voor pensioenverplichtingen"},""]
["",{"$f":"INDEX(labels!A511:C511,1,MATCH(PP_Language,labels!A1:C1,0))","v":"Informatieverschaffing over voorziening uit hoofde van personeelsbeloningen"},""]
["",{"$f":"INDEX(labels!A512:C512,1,MATCH(PP_Language,labels!A1:C1,0))","v":"Informatieverschaffing over voorziening voor opruiming van aanwezige milieuvervuiling"},""]
["",{"$f":"INDEX(labels!A513:C513,1,MATCH(PP_Language,labels!A1:C1,0))","v":"Informatieverschaffing over voorziening uit hoofde van claims, geschillen en rechtsgedingen"},""]
["",{"$f":"INDEX(labels!A514:C514,1,MATCH(PP_Language,labels!A1:C1,0))","v":"Informatieverschaffing over voorziening voor groot onderhoud"},""]
["",{"$f":"INDEX(labels!A515:C515,1,MATCH(PP_Language,labels!A1:C1,0))","v":"Informatieverschaffing over de toepassing van de overgangsbepaling - voorziening groot onderhoud"},""]
["",{"$f":"INDEX(labels!A516:C516,1,MATCH(PP_Language,labels!A1:C1,0))","v":"Informatieverschaffing over voorziening voor verwijderingsverplichtingen"},""]
["",{"$f":"INDEX(labels!A517:C517,1,MATCH(PP_Language,labels!A1:C1,0))","v":"Informatieverschaffing over voorziening voor verlieslatende contracten"},""]
["",{"$f":"INDEX(labels!A518:C518,1,MATCH(PP_Language,labels!A1:C1,0))","v":"Beschrijving van de actuariële grondslagen gehanteerd voor de voorziening voor pensioenverplichtingen"},""]
["",{"$f":"INDEX(labels!A519:C519,1,MATCH(PP_Language,labels!A1:C1,0))","v":"Beschrijving van de per balansdatum bestaande verplichtingen waarvoor een pensioenvoorziening is opgenomen"},""]
["",{"$f":"INDEX(labels!A520:C520,1,MATCH(PP_Language,labels!A1:C1,0))","v":"Informatieverschaffing over voorziening in verband met reorganisaties"},""]
["",{"$f":"INDEX(labels!A521:C521,1,MATCH(PP_Language,labels!A1:C1,0))","v":"Informatieverschaffing over voorziening in verband met deelnemingen"},""]
["",{"$f":"INDEX(labels!A522:C522,1,MATCH(PP_Language,labels!A1:C1,0))","v":"Beschrijving van de methode van waardering van de opgenomen pensioenvoorziening"},""]
["",{"$f":"INDEX(labels!A523:C523,1,MATCH(PP_Language,labels!A1:C1,0))","v":"Informatieverschaffing over latente belastingverplichtingen"},""]
["",{"$f":"INDEX(labels!A524:C524,1,MATCH(PP_Language,labels!A1:C1,0))","v":"Informatieverschaffing over garantievoorziening"},""]
[""]
["",null,null,null,null,null,null,null,null,null,null,null,null,null,null,null,null,null,null,null,null,null,null,null,null,{"$f":"\"//notes-provisions label {\"&COLUMN(B873)&\"}\"","v":"//notes-provisions label {2}"},null,{"$f":"\"//notes-provisions \" & INDEX(labels!A56:C56,1,MATCH(PP_Language,labels!A1:C1,0)) & \" \" & BasisOfPreparationAxis & \"  {\"&COLUMN(D873)&\"}\"","v":"//notes-provisions Enkelvoudig Commercial  {4}"}]
["",{"$f":"INDEX(labels!A525:C525,1,MATCH(PP_Language,labels!A1:C1,0))","v":"Toelichting op de jaarrekening - Voorzieningen: Overige bedragen: Uitsplitsing"}]
["",null,null,{"$f":"INDEX(labels!A55:C55,1,MATCH(PP_Language,labels!A1:C1,0))","v":"Huidig"}]
[""]
["",{"$f":"INDEX(labels!A526:C526,1,MATCH(PP_Language,labels!A1:C1,0))","v":"Langlopend deel van de voorzieningen"},"",null,null,null,null,null,null,null,null,null,null,null,null,null,null,null,null,null,null,null,null,null,null,{"$f":"\"/notes-provisions-other-amounts-breakdown label {\"&COLUMN(B877)&\"}\"","v":"/notes-provisions-other-amounts-breakdown label {2}"},null,{"$f":"\"/notes-provisions-other-amounts-breakdown \" & INDEX(labels!A56:C56,1,MATCH(PP_Language,labels!A1:C1,0)) & \" \" & BasisOfPreparationAxis & \"  {\"&COLUMN(D877)&\"}\"","v":"/notes-provisions-other-amounts-breakdown Enkelvoudig Commercial  {4}"}]
[""]
["",null,null,null,null,null,null,null,null,null,null,null,null,null,null,null,null,null,null,null,null,null,null,null,null,{"$f":"\"//notes-provisions-other-amounts-breakdown label {\"&COLUMN(B879)&\"}\"","v":"//notes-provisions-other-amounts-breakdown label {2}"},null,{"$f":"\"//notes-provisions-other-amounts-breakdown \" & INDEX(labels!A56:C56,1,MATCH(PP_Language,labels!A1:C1,0)) & \" \" & BasisOfPreparationAxis & \"  {\"&COLUMN(D879)&\"}\"","v":"//notes-provisions-other-amounts-breakdown Enkelvoudig Commercial  {4}"}]
["",{"$f":"INDEX(labels!A83:C83,1,MATCH(PP_Language,labels!A1:C1,0))","v":"Langlopende schulden"}]
["",{"$f":"INDEX(labels!A527:C527,1,MATCH(PP_Language,labels!A1:C1,0))","v":"Toelichting op de jaarrekening - Langlopende schulden: Uitsplitsing"}]
["",null,null,{"$f":"INDEX(labels!A55:C55,1,MATCH(PP_Language,labels!A1:C1,0))","v":"Huidig"},null,{"$f":"INDEX(labels!A57:C57,1,MATCH(PP_Language,labels!A1:C1,0))","v":"Voorgaand"}]
[""]
["",{"$f":"INDEX(labels!A528:C528,1,MATCH(PP_Language,labels!A1:C1,0))","v":"Oudedagsverplichting"},"+",null,null,null,null,null,null,null,null,null,null,null,null,null,null,null,null,null,null,null,null,null,null,{"$f":"\"/notes-noncurrent-liabilities-breakdown label {\"&COLUMN(B884)&\"}\"","v":"/notes-noncurrent-liabilities-breakdown label {2}"},null,{"$f":"\"/notes-noncurrent-liabilities-breakdown \" & INDEX(labels!A56:C56,1,MATCH(PP_Language,labels!A1:C1,0)) & \" \" & BasisOfPreparationAxis & \" \" & INDEX(labels!A55:C55,1,MATCH(PP_Language,labels!A1:C1,0)) &  \"  {\"&COLUMN(D884)&\"}\"","v":"/notes-noncurrent-liabilities-breakdown Enkelvoudig Commercial Huidig  {4}"},null,{"$f":"\"/notes-noncurrent-liabilities-breakdown \" & INDEX(labels!A56:C56,1,MATCH(PP_Language,labels!A1:C1,0)) & \" \" & BasisOfPreparationAxis & \" \" & INDEX(labels!A57:C57,1,MATCH(PP_Language,labels!A1:C1,0)) &  \"  {\"&COLUMN(F884)&\"}\"","v":"/notes-noncurrent-liabilities-breakdown Enkelvoudig Commercial Voorgaand  {6}"}]
["",{"$f":"INDEX(labels!A529:C529,1,MATCH(PP_Language,labels!A1:C1,0))","v":"Overige schulden"},"+"]
[""]
["",{"$f":"INDEX(labels!A530:C530,1,MATCH(PP_Language,labels!A1:C1,0))","v":"Totaal van langlopende schulden"},"+",{"$f":"IF(OR(NOT(AND(Stamdata!D886=\"\",Stamdata!D887=\"\")),NOT(0=0)), SUM(Stamdata!D886,Stamdata!D887),\"\")","v":""},null,{"$f":"IF(OR(NOT(AND(Stamdata!F886=\"\",Stamdata!F887=\"\")),NOT(0=0)), SUM(Stamdata!F886,Stamdata!F887),\"\")","v":""}]
[""]
["",null,null,null,null,null,null,null,null,null,null,null,null,null,null,null,null,null,null,null,null,null,null,null,null,{"$f":"\"//notes-noncurrent-liabilities-breakdown label {\"&COLUMN(B889)&\"}\"","v":"//notes-noncurrent-liabilities-breakdown label {2}"},null,{"$f":"\"//notes-noncurrent-liabilities-breakdown \" & INDEX(labels!A56:C56,1,MATCH(PP_Language,labels!A1:C1,0)) & \" \" & BasisOfPreparationAxis & \" \" & INDEX(labels!A55:C55,1,MATCH(PP_Language,labels!A1:C1,0)) &  \"  {\"&COLUMN(D889)&\"}\"","v":"//notes-noncurrent-liabilities-breakdown Enkelvoudig Commercial Huidig  {4}"},null,{"$f":"\"//notes-noncurrent-liabilities-breakdown \" & INDEX(labels!A56:C56,1,MATCH(PP_Language,labels!A1:C1,0)) & \" \" & BasisOfPreparationAxis & \" \" & INDEX(labels!A57:C57,1,MATCH(PP_Language,labels!A1:C1,0)) &  \"  {\"&COLUMN(F889)&\"}\"","v":"//notes-noncurrent-liabilities-breakdown Enkelvoudig Commercial Voorgaand  {6}"}]
["",{"$f":"INDEX(labels!A531:C531,1,MATCH(PP_Language,labels!A1:C1,0))","v":"Toelichting op de jaarrekening - Langlopende schulden"}]
[""]
[""]
["",{"$f":"INDEX(labels!A532:C532,1,MATCH(PP_Language,labels!A1:C1,0))","v":"Informatieverschaffing over langlopende schulden"},"",null,null,null,null,null,null,null,null,null,null,null,null,null,null,null,null,null,null,null,null,null,null,{"$f":"\"/notes-noncurrent-liabilities label {\"&COLUMN(B893)&\"}\"","v":"/notes-noncurrent-liabilities label {2}"},null,{"$f":"\"/notes-noncurrent-liabilities \" & INDEX(labels!A56:C56,1,MATCH(PP_Language,labels!A1:C1,0)) & \" \" & BasisOfPreparationAxis & \"  {\"&COLUMN(D893)&\"}\"","v":"/notes-noncurrent-liabilities Enkelvoudig Commercial  {4}"}]
["",{"$f":"INDEX(labels!A533:C533,1,MATCH(PP_Language,labels!A1:C1,0))","v":"Informatieverschaffing over achtergestelde schulden"},""]
["",{"$f":"INDEX(labels!A534:C534,1,MATCH(PP_Language,labels!A1:C1,0))","v":"Informatieverschaffing over financiële leaseverplichtingen"},""]
["",{"$f":"INDEX(labels!A535:C535,1,MATCH(PP_Language,labels!A1:C1,0))","v":"Informatieverschaffing over oudedagsverplichting"},""]
["",{"$f":"INDEX(labels!A536:C536,1,MATCH(PP_Language,labels!A1:C1,0))","v":"Informatieverschaffing over negatieve goodwill"},""]
["",{"$f":"INDEX(labels!A537:C537,1,MATCH(PP_Language,labels!A1:C1,0))","v":"Beschrijving van de periode waarin de negatieve goodwill ten gunste van de winst-en-verliesrekening wordt gebracht"},""]
["",{"$f":"INDEX(labels!A538:C538,1,MATCH(PP_Language,labels!A1:C1,0))","v":"Informatieverschaffing over overlopende passiva"},""]
["",{"$f":"INDEX(labels!A539:C539,1,MATCH(PP_Language,labels!A1:C1,0))","v":"Opgave van de schulden waarvoor zakelijke zekerheid is gesteld en in welke vorm dat is geschied"},""]
["",{"$f":"INDEX(labels!A540:C540,1,MATCH(PP_Language,labels!A1:C1,0))","v":"Informatieverschaffing over de looptijd van langlopende schulden"},""]
["",{"$f":"INDEX(labels!A541:C541,1,MATCH(PP_Language,labels!A1:C1,0))","v":"Informatieverschaffing over de schulden waarvoor de rechtspersoon zich, al dan niet voorwaardelijk, heeft verbonden tot het bezwaren of niet bezwaren van goederen"},""]
[""]
["",null,null,null,null,null,null,null,null,null,null,null,null,null,null,null,null,null,null,null,null,null,null,null,null,{"$f":"\"//notes-noncurrent-liabilities label {\"&COLUMN(B904)&\"}\"","v":"//notes-noncurrent-liabilities label {2}"},null,{"$f":"\"//notes-noncurrent-liabilities \" & INDEX(labels!A56:C56,1,MATCH(PP_Language,labels!A1:C1,0)) & \" \" & BasisOfPreparationAxis & \"  {\"&COLUMN(D904)&\"}\"","v":"//notes-noncurrent-liabilities Enkelvoudig Commercial  {4}"}]
["",{"$f":"INDEX(labels!A542:C542,1,MATCH(PP_Language,labels!A1:C1,0))","v":"Toelichting op de jaarrekening - Langlopende schulden: Overige bedragen: Uitsplitsing"}]
["",null,null,{"$f":"INDEX(labels!A55:C55,1,MATCH(PP_Language,labels!A1:C1,0))","v":"Huidig"},null,{"$f":"INDEX(labels!A57:C57,1,MATCH(PP_Language,labels!A1:C1,0))","v":"Voorgaand"}]
[""]
["",{"$f":"INDEX(labels!A543:C543,1,MATCH(PP_Language,labels!A1:C1,0))","v":"Langlopende schulden met een looptijd langer dan vijf jaar"},"+",null,null,null,null,null,null,null,null,null,null,null,null,null,null,null,null,null,null,null,null,null,null,{"$f":"\"/notes-noncurrent-liabilities-other-amounts-breakdown label {\"&COLUMN(B908)&\"}\"","v":"/notes-noncurrent-liabilities-other-amounts-breakdown label {2}"},null,{"$f":"\"/notes-noncurrent-liabilities-other-amounts-breakdown \" & INDEX(labels!A56:C56,1,MATCH(PP_Language,labels!A1:C1,0)) & \" \" & BasisOfPreparationAxis & \" \" & INDEX(labels!A55:C55,1,MATCH(PP_Language,labels!A1:C1,0)) &  \"  {\"&COLUMN(D908)&\"}\"","v":"/notes-noncurrent-liabilities-other-amounts-breakdown Enkelvoudig Commercial Huidig  {4}"},null,{"$f":"\"/notes-noncurrent-liabilities-other-amounts-breakdown \" & INDEX(labels!A56:C56,1,MATCH(PP_Language,labels!A1:C1,0)) & \" \" & BasisOfPreparationAxis & \" \" & INDEX(labels!A57:C57,1,MATCH(PP_Language,labels!A1:C1,0)) &  \"  {\"&COLUMN(F908)&\"}\"","v":"/notes-noncurrent-liabilities-other-amounts-breakdown Enkelvoudig Commercial Voorgaand  {6}"}]
["",{"$f":"INDEX(labels!A544:C544,1,MATCH(PP_Language,labels!A1:C1,0))","v":"Bedrag aan langlopende schulden waarvoor zakelijke zekerheid is gesteld"},"+"]
["",{"$f":"INDEX(labels!A545:C545,1,MATCH(PP_Language,labels!A1:C1,0))","v":"Negatieve goodwill"},"+"]
[""]
["",null,null,null,null,null,null,null,null,null,null,null,null,null,null,null,null,null,null,null,null,null,null,null,null,{"$f":"\"//notes-noncurrent-liabilities-other-amounts-breakdown label {\"&COLUMN(B912)&\"}\"","v":"//notes-noncurrent-liabilities-other-amounts-breakdown label {2}"},null,{"$f":"\"//notes-noncurrent-liabilities-other-amounts-breakdown \" & INDEX(labels!A56:C56,1,MATCH(PP_Language,labels!A1:C1,0)) & \" \" & BasisOfPreparationAxis & \" \" & INDEX(labels!A55:C55,1,MATCH(PP_Language,labels!A1:C1,0)) &  \"  {\"&COLUMN(D912)&\"}\"","v":"//notes-noncurrent-liabilities-other-amounts-breakdown Enkelvoudig Commercial Huidig  {4}"},null,{"$f":"\"//notes-noncurrent-liabilities-other-amounts-breakdown \" & INDEX(labels!A56:C56,1,MATCH(PP_Language,labels!A1:C1,0)) & \" \" & BasisOfPreparationAxis & \" \" & INDEX(labels!A57:C57,1,MATCH(PP_Language,labels!A1:C1,0)) &  \"  {\"&COLUMN(F912)&\"}\"","v":"//notes-noncurrent-liabilities-other-amounts-breakdown Enkelvoudig Commercial Voorgaand  {6}"}]
["",{"$f":"INDEX(labels!A84:C84,1,MATCH(PP_Language,labels!A1:C1,0))","v":"Kortlopende schulden"}]
["",{"$f":"INDEX(labels!A546:C546,1,MATCH(PP_Language,labels!A1:C1,0))","v":"Toelichting op de jaarrekening - Kortlopende schulden"}]
[""]
[""]
["",{"$f":"INDEX(labels!A547:C547,1,MATCH(PP_Language,labels!A1:C1,0))","v":"Informatieverschaffing over kortlopende schulden"},"",null,null,null,null,null,null,null,null,null,null,null,null,null,null,null,null,null,null,null,null,null,null,{"$f":"\"/notes-current-liabilities label {\"&COLUMN(B917)&\"}\"","v":"/notes-current-liabilities label {2}"},null,{"$f":"\"/notes-current-liabilities \" & INDEX(labels!A56:C56,1,MATCH(PP_Language,labels!A1:C1,0)) & \" \" & BasisOfPreparationAxis & \"  {\"&COLUMN(D917)&\"}\"","v":"/notes-current-liabilities Enkelvoudig Commercial  {4}"}]
["",{"$f":"INDEX(labels!A534:C534,1,MATCH(PP_Language,labels!A1:C1,0))","v":"Informatieverschaffing over financiële leaseverplichtingen"},""]
["",{"$f":"INDEX(labels!A538:C538,1,MATCH(PP_Language,labels!A1:C1,0))","v":"Informatieverschaffing over overlopende passiva"},""]
["",{"$f":"INDEX(labels!A541:C541,1,MATCH(PP_Language,labels!A1:C1,0))","v":"Informatieverschaffing over de schulden waarvoor de rechtspersoon zich, al dan niet voorwaardelijk, heeft verbonden tot het bezwaren of niet bezwaren van goederen"},""]
[""]
["",null,null,null,null,null,null,null,null,null,null,null,null,null,null,null,null,null,null,null,null,null,null,null,null,{"$f":"\"//notes-current-liabilities label {\"&COLUMN(B922)&\"}\"","v":"//notes-current-liabilities label {2}"},null,{"$f":"\"//notes-current-liabilities \" & INDEX(labels!A56:C56,1,MATCH(PP_Language,labels!A1:C1,0)) & \" \" & BasisOfPreparationAxis & \"  {\"&COLUMN(D922)&\"}\"","v":"//notes-current-liabilities Enkelvoudig Commercial  {4}"}]
["",{"$f":"INDEX(labels!A548:C548,1,MATCH(PP_Language,labels!A1:C1,0))","v":"Toelichting op de jaarrekening - Kortlopende schulden: Overige bedragen: Uitsplitsing"}]
["",null,null,{"$f":"INDEX(labels!A55:C55,1,MATCH(PP_Language,labels!A1:C1,0))","v":"Huidig"},null,{"$f":"INDEX(labels!A57:C57,1,MATCH(PP_Language,labels!A1:C1,0))","v":"Voorgaand"}]
[""]
["",{"$f":"INDEX(labels!A549:C549,1,MATCH(PP_Language,labels!A1:C1,0))","v":"Bedrag aan kortlopende schulden waarvoor zakelijke zekerheid is gesteld"},"+",null,null,null,null,null,null,null,null,null,null,null,null,null,null,null,null,null,null,null,null,null,null,{"$f":"\"/notes-current-liabilities-other-amounts-breakdown label {\"&COLUMN(B926)&\"}\"","v":"/notes-current-liabilities-other-amounts-breakdown label {2}"},null,{"$f":"\"/notes-current-liabilities-other-amounts-breakdown \" & INDEX(labels!A56:C56,1,MATCH(PP_Language,labels!A1:C1,0)) & \" \" & BasisOfPreparationAxis & \" \" & INDEX(labels!A55:C55,1,MATCH(PP_Language,labels!A1:C1,0)) &  \"  {\"&COLUMN(D926)&\"}\"","v":"/notes-current-liabilities-other-amounts-breakdown Enkelvoudig Commercial Huidig  {4}"},null,{"$f":"\"/notes-current-liabilities-other-amounts-breakdown \" & INDEX(labels!A56:C56,1,MATCH(PP_Language,labels!A1:C1,0)) & \" \" & BasisOfPreparationAxis & \" \" & INDEX(labels!A57:C57,1,MATCH(PP_Language,labels!A1:C1,0)) &  \"  {\"&COLUMN(F926)&\"}\"","v":"/notes-current-liabilities-other-amounts-breakdown Enkelvoudig Commercial Voorgaand  {6}"}]
[""]
["",null,null,null,null,null,null,null,null,null,null,null,null,null,null,null,null,null,null,null,null,null,null,null,null,{"$f":"\"//notes-current-liabilities-other-amounts-breakdown label {\"&COLUMN(B928)&\"}\"","v":"//notes-current-liabilities-other-amounts-breakdown label {2}"},null,{"$f":"\"//notes-current-liabilities-other-amounts-breakdown \" & INDEX(labels!A56:C56,1,MATCH(PP_Language,labels!A1:C1,0)) & \" \" & BasisOfPreparationAxis & \" \" & INDEX(labels!A55:C55,1,MATCH(PP_Language,labels!A1:C1,0)) &  \"  {\"&COLUMN(D928)&\"}\"","v":"//notes-current-liabilities-other-amounts-breakdown Enkelvoudig Commercial Huidig  {4}"},null,{"$f":"\"//notes-current-liabilities-other-amounts-breakdown \" & INDEX(labels!A56:C56,1,MATCH(PP_Language,labels!A1:C1,0)) & \" \" & BasisOfPreparationAxis & \" \" & INDEX(labels!A57:C57,1,MATCH(PP_Language,labels!A1:C1,0)) &  \"  {\"&COLUMN(F928)&\"}\"","v":"//notes-current-liabilities-other-amounts-breakdown Enkelvoudig Commercial Voorgaand  {6}"}]
["",{"$f":"INDEX(labels!A550:C550,1,MATCH(PP_Language,labels!A1:C1,0))","v":"Niet in de balans opgenomen verplichtingen"}]
["",{"$f":"INDEX(labels!A551:C551,1,MATCH(PP_Language,labels!A1:C1,0))","v":"Toelichting op de jaarrekening - Niet in de balans opgenomen activa en verplichtingen"}]
[""]
[""]
["",{"$f":"INDEX(labels!A552:C552,1,MATCH(PP_Language,labels!A1:C1,0))","v":"Beschrijving van niet in de balans opgenomen verplichtingen inzake betalingen ter verkrijging van (gebruiks)rechten"},"",null,null,null,null,null,null,null,null,null,null,null,null,null,null,null,null,null,null,null,null,null,null,{"$f":"\"/notes-assets-liabilities-not-recognised label {\"&COLUMN(B933)&\"}\"","v":"/notes-assets-liabilities-not-recognised label {2}"},null,{"$f":"\"/notes-assets-liabilities-not-recognised \" & INDEX(labels!A56:C56,1,MATCH(PP_Language,labels!A1:C1,0)) & \" \" & BasisOfPreparationAxis & \"  {\"&COLUMN(D933)&\"}\"","v":"/notes-assets-liabilities-not-recognised Enkelvoudig Commercial  {4}"}]
["",{"$f":"INDEX(labels!A553:C553,1,MATCH(PP_Language,labels!A1:C1,0))","v":"Informatieverschaffing over niet in de balans opgenomen verplichtingen"},""]
["",{"$f":"INDEX(labels!A554:C554,1,MATCH(PP_Language,labels!A1:C1,0))","v":"Beschrijving van de aard van niet uit de balans blijkende verplichtingen"},""]
["",{"$f":"INDEX(labels!A555:C555,1,MATCH(PP_Language,labels!A1:C1,0))","v":"Beschrijving van de financiële gevolgen van de niet in de balans opgenomen regelingen"},""]
["",{"$f":"INDEX(labels!A556:C556,1,MATCH(PP_Language,labels!A1:C1,0))","v":"Beschrijving van het zakelijk doel van de niet in de balans opgenomen regelingen"},""]
["",{"$f":"INDEX(labels!A557:C557,1,MATCH(PP_Language,labels!A1:C1,0))","v":"Beschrijving van de aard van de niet in de balans opgenomen regelingen"},""]
["",{"$f":"INDEX(labels!A558:C558,1,MATCH(PP_Language,labels!A1:C1,0))","v":"Beschrijving van de indicatie van de onzekerheden met betrekking tot het bedrag of het moment van uitstroom in het kader van niet uit de balans blijkende verplichtingen"},""]
["",{"$f":"INDEX(labels!A559:C559,1,MATCH(PP_Language,labels!A1:C1,0))","v":"Beschrijving van de mogelijkheid van enigerlei vergoeding in het kader van niet uit de balans blijkende verplichtingen"},""]
["",{"$f":"INDEX(labels!A560:C560,1,MATCH(PP_Language,labels!A1:C1,0))","v":"Informatieverschaffing over niet uit de balans blijkende verplichtingen ten behoeve van groepsmaatschappijen"},""]
["",{"$f":"INDEX(labels!A561:C561,1,MATCH(PP_Language,labels!A1:C1,0))","v":"Beschrijving van niet in de balans opgenomen verplichtingen inzake aansprakelijkheidsstellingen"},""]
["",{"$f":"INDEX(labels!A562:C562,1,MATCH(PP_Language,labels!A1:C1,0))","v":"Beschrijving van de niet in de balans opgenomen verplichtingen inzake de fiscale eenheid"},""]
["",{"$f":"INDEX(labels!A563:C563,1,MATCH(PP_Language,labels!A1:C1,0))","v":"Beschrijving van niet in de balans opgenomen verplichtingen inzake investeringsverplichtingen"},""]
["",{"$f":"INDEX(labels!A564:C564,1,MATCH(PP_Language,labels!A1:C1,0))","v":"Beschrijving van niet in de balans opgenomen verplichtingen inzake garanties"},""]
["",{"$f":"INDEX(labels!A565:C565,1,MATCH(PP_Language,labels!A1:C1,0))","v":"Beschrijving van garanties ten behoeve van de gezamenlijke commissarissen van de rechtspersoon, zoals verstrekt door de rechtspersoon, zijn dochtermaatschappijen en de maatschappijen waarvan hij de gegevens consolideert"},""]
["",{"$f":"INDEX(labels!A566:C566,1,MATCH(PP_Language,labels!A1:C1,0))","v":"Informatieverschaffing over niet in de balans opgenomen activa"},""]
["",{"$f":"INDEX(labels!A567:C567,1,MATCH(PP_Language,labels!A1:C1,0))","v":"Beschrijving van de schatting van het financiële effect van niet uit de balans blijkende verplichtingen"},""]
["",{"$f":"INDEX(labels!A568:C568,1,MATCH(PP_Language,labels!A1:C1,0))","v":"Informatieverschaffing over operationele leases"},""]
["",{"$f":"INDEX(labels!A569:C569,1,MATCH(PP_Language,labels!A1:C1,0))","v":"Beschrijving van de gemiddelde looptijd van de operationele leaseverplichtingen"},""]
["",{"$f":"INDEX(labels!A570:C570,1,MATCH(PP_Language,labels!A1:C1,0))","v":"Beschrijving van omvang en looptijd van verplichtingen tot aan- of verkoop van voorraden van bijzondere betekenis"},""]
["",{"$f":"INDEX(labels!A107:C107,1,MATCH(PP_Language,labels!A1:C1,0))","v":"Vermelding van de rechtspersonen waarvoor de rechtspersoon een aansprakelijkstelling overeenkomstig Art. 2:403 heeft afgegeven"},""]
[""]
["",null,null,null,null,null,null,null,null,null,null,null,null,null,null,null,null,null,null,null,null,null,null,null,null,{"$f":"\"//notes-assets-liabilities-not-recognised label {\"&COLUMN(B954)&\"}\"","v":"//notes-assets-liabilities-not-recognised label {2}"},null,{"$f":"\"//notes-assets-liabilities-not-recognised \" & INDEX(labels!A56:C56,1,MATCH(PP_Language,labels!A1:C1,0)) & \" \" & BasisOfPreparationAxis & \"  {\"&COLUMN(D954)&\"}\"","v":"//notes-assets-liabilities-not-recognised Enkelvoudig Commercial  {4}"}]
["",{"$f":"INDEX(labels!A571:C571,1,MATCH(PP_Language,labels!A1:C1,0))","v":"Toelichting op de jaarrekening - Niet in de balans opgenomen activa en verplichtingen: Overige bedragen: Uitsplitsing"}]
["",null,null,{"$f":"INDEX(labels!A55:C55,1,MATCH(PP_Language,labels!A1:C1,0))","v":"Huidig"},null,{"$f":"INDEX(labels!A57:C57,1,MATCH(PP_Language,labels!A1:C1,0))","v":"Voorgaand"}]
[""]
["",{"$f":"INDEX(labels!A572:C572,1,MATCH(PP_Language,labels!A1:C1,0))","v":"Voorwaardelijke activa waartoe de rechtspersoon zich heeft verbonden"},"-",null,null,null,null,null,null,null,null,null,null,null,null,null,null,null,null,null,null,null,null,null,null,{"$f":"\"/notes-assets-liabilities-not-recognised-other-amounts-breakdown label {\"&COLUMN(B958)&\"}\"","v":"/notes-assets-liabilities-not-recognised-other-amounts-breakdown label {2}"},null,{"$f":"\"/notes-assets-liabilities-not-recognised-other-amounts-breakdown \" & INDEX(labels!A56:C56,1,MATCH(PP_Language,labels!A1:C1,0)) & \" \" & BasisOfPreparationAxis & \" \" & INDEX(labels!A55:C55,1,MATCH(PP_Language,labels!A1:C1,0)) &  \"  {\"&COLUMN(D958)&\"}\"","v":"/notes-assets-liabilities-not-recognised-other-amounts-breakdown Enkelvoudig Commercial Huidig  {4}"},null,{"$f":"\"/notes-assets-liabilities-not-recognised-other-amounts-breakdown \" & INDEX(labels!A56:C56,1,MATCH(PP_Language,labels!A1:C1,0)) & \" \" & BasisOfPreparationAxis & \" \" & INDEX(labels!A57:C57,1,MATCH(PP_Language,labels!A1:C1,0)) &  \"  {\"&COLUMN(F958)&\"}\"","v":"/notes-assets-liabilities-not-recognised-other-amounts-breakdown Enkelvoudig Commercial Voorgaand  {6}"}]
["",{"$f":"INDEX(labels!A573:C573,1,MATCH(PP_Language,labels!A1:C1,0))","v":"Voorwaardelijke verplichtingen waartoe de rechtspersoon zich heeft verbonden"},"+"]
["",{"$f":"INDEX(labels!A574:C574,1,MATCH(PP_Language,labels!A1:C1,0))","v":"Verplichtingen waartoe de rechtspersoon zich heeft verbonden"},"+"]
["",{"$f":"INDEX(labels!A575:C575,1,MATCH(PP_Language,labels!A1:C1,0))","v":"Niet verwerkte verplichtingen waartoe de rechtspersoon zich heeft verbonden"},"+"]
["",{"$f":"INDEX(labels!A576:C576,1,MATCH(PP_Language,labels!A1:C1,0))","v":"Verplichtingen voortkomend uit aansprakelijkheid voor schulden van groepsmaatschappijen"},"+"]
["",{"$f":"INDEX(labels!A577:C577,1,MATCH(PP_Language,labels!A1:C1,0))","v":"Verplichtingen voortkomend uit verdisconteerde wissels of chèques van groepsmaatschappijen"},"+"]
["",{"$f":"INDEX(labels!A578:C578,1,MATCH(PP_Language,labels!A1:C1,0))","v":"Voorwaardelijke activa waartoe de rechtspersoon zich ten behoeve van groepsmaatschappijen heeft verbonden"},"-"]
["",{"$f":"INDEX(labels!A579:C579,1,MATCH(PP_Language,labels!A1:C1,0))","v":"Voorwaardelijke verplichtingen waartoe de rechtspersoon zich ten behoeve van groepsmaatschappijen heeft verbonden"},"+"]
["",{"$f":"INDEX(labels!A580:C580,1,MATCH(PP_Language,labels!A1:C1,0))","v":"Verplichtingen waartoe de rechtspersoon zich ten behoeve van groepsmaatschappijen heeft verbonden"},"+"]
["",{"$f":"INDEX(labels!A581:C581,1,MATCH(PP_Language,labels!A1:C1,0))","v":"Niet verwerkte verplichtingen waartoe de rechtspersoon zich ten behoeve van groepsmaatschappijen heeft verbonden"},"+"]
[""]
["",null,null,null,null,null,null,null,null,null,null,null,null,null,null,null,null,null,null,null,null,null,null,null,null,{"$f":"\"//notes-assets-liabilities-not-recognised-other-amounts-breakdown label {\"&COLUMN(B969)&\"}\"","v":"//notes-assets-liabilities-not-recognised-other-amounts-breakdown label {2}"},null,{"$f":"\"//notes-assets-liabilities-not-recognised-other-amounts-breakdown \" & INDEX(labels!A56:C56,1,MATCH(PP_Language,labels!A1:C1,0)) & \" \" & BasisOfPreparationAxis & \" \" & INDEX(labels!A55:C55,1,MATCH(PP_Language,labels!A1:C1,0)) &  \"  {\"&COLUMN(D969)&\"}\"","v":"//notes-assets-liabilities-not-recognised-other-amounts-breakdown Enkelvoudig Commercial Huidig  {4}"},null,{"$f":"\"//notes-assets-liabilities-not-recognised-other-amounts-breakdown \" & INDEX(labels!A56:C56,1,MATCH(PP_Language,labels!A1:C1,0)) & \" \" & BasisOfPreparationAxis & \" \" & INDEX(labels!A57:C57,1,MATCH(PP_Language,labels!A1:C1,0)) &  \"  {\"&COLUMN(F969)&\"}\"","v":"//notes-assets-liabilities-not-recognised-other-amounts-breakdown Enkelvoudig Commercial Voorgaand  {6}"}]
["",{"$f":"INDEX(labels!A582:C582,1,MATCH(PP_Language,labels!A1:C1,0))","v":"Toelichting op de jaarrekening - Niet in de balans opgenomen activa en verplichtingen: Betalingen ter verkrijging van rechten: Uitsplitsing looptijd"}]
["",null,null,{"$f":"INDEX(labels!A55:C55,1,MATCH(PP_Language,labels!A1:C1,0))","v":"Huidig"},null,{"$f":"INDEX(labels!A57:C57,1,MATCH(PP_Language,labels!A1:C1,0))","v":"Voorgaand"}]
[""]
["",{"$f":"INDEX(labels!A583:C583,1,MATCH(PP_Language,labels!A1:C1,0))","v":"Niet in de balans opgenomen verplichtingen inzake betalingen ter verkrijging van (gebruiks)rechten"},"+",null,null,null,null,null,null,null,null,null,null,null,null,null,null,null,null,null,null,null,null,null,null,{"$f":"\"/notes-contingent-liabilities-payments-obtain-usage-rights-breakdown-maturity label {\"&COLUMN(B973)&\"}\"","v":"/notes-contingent-liabilities-payments-obtain-usage-rights-breakdown-maturity label {2}"},null,{"$f":"\"/notes-contingent-liabilities-payments-obtain-usage-rights-breakdown-maturity \" & INDEX(labels!A56:C56,1,MATCH(PP_Language,labels!A1:C1,0)) & \" \" & BasisOfPreparationAxis & \" \" & INDEX(labels!A55:C55,1,MATCH(PP_Language,labels!A1:C1,0)) &  \"  {\"&COLUMN(D973)&\"}\"","v":"/notes-contingent-liabilities-payments-obtain-usage-rights-breakdown-maturity Enkelvoudig Commercial Huidig  {4}"},null,{"$f":"\"/notes-contingent-liabilities-payments-obtain-usage-rights-breakdown-maturity \" & INDEX(labels!A56:C56,1,MATCH(PP_Language,labels!A1:C1,0)) & \" \" & BasisOfPreparationAxis & \" \" & INDEX(labels!A57:C57,1,MATCH(PP_Language,labels!A1:C1,0)) &  \"  {\"&COLUMN(F973)&\"}\"","v":"/notes-contingent-liabilities-payments-obtain-usage-rights-breakdown-maturity Enkelvoudig Commercial Voorgaand  {6}"}]
["",{"$f":"INDEX(labels!A584:C584,1,MATCH(PP_Language,labels!A1:C1,0))","v":"Niet in de balans opgenomen verplichtingen inzake betalingen ter verkrijging van (gebruiks)rechten met een looptijd langer dan een jaar"},"+"]
["",{"$f":"INDEX(labels!A585:C585,1,MATCH(PP_Language,labels!A1:C1,0))","v":"Niet in de balans opgenomen verplichtingen inzake betalingen ter verkrijging van (gebruiks)rechten met een looptijd langer dan vijf jaar"},"+"]
[""]
["",null,null,null,null,null,null,null,null,null,null,null,null,null,null,null,null,null,null,null,null,null,null,null,null,{"$f":"\"//notes-contingent-liabilities-payments-obtain-usage-rights-breakdown-maturity label {\"&COLUMN(B977)&\"}\"","v":"//notes-contingent-liabilities-payments-obtain-usage-rights-breakdown-maturity label {2}"},null,{"$f":"\"//notes-contingent-liabilities-payments-obtain-usage-rights-breakdown-maturity \" & INDEX(labels!A56:C56,1,MATCH(PP_Language,labels!A1:C1,0)) & \" \" & BasisOfPreparationAxis & \" \" & INDEX(labels!A55:C55,1,MATCH(PP_Language,labels!A1:C1,0)) &  \"  {\"&COLUMN(D977)&\"}\"","v":"//notes-contingent-liabilities-payments-obtain-usage-rights-breakdown-maturity Enkelvoudig Commercial Huidig  {4}"},null,{"$f":"\"//notes-contingent-liabilities-payments-obtain-usage-rights-breakdown-maturity \" & INDEX(labels!A56:C56,1,MATCH(PP_Language,labels!A1:C1,0)) & \" \" & BasisOfPreparationAxis & \" \" & INDEX(labels!A57:C57,1,MATCH(PP_Language,labels!A1:C1,0)) &  \"  {\"&COLUMN(F977)&\"}\"","v":"//notes-contingent-liabilities-payments-obtain-usage-rights-breakdown-maturity Enkelvoudig Commercial Voorgaand  {6}"}]
["",{"$f":"INDEX(labels!A586:C586,1,MATCH(PP_Language,labels!A1:C1,0))","v":"Winst-en-verliesrekening"}]
["",{"$f":"INDEX(labels!A587:C587,1,MATCH(PP_Language,labels!A1:C1,0))","v":"Afschrijvingen op immateriële en materiële vaste activa"}]
["",{"$f":"INDEX(labels!A588:C588,1,MATCH(PP_Language,labels!A1:C1,0))","v":"Toelichting op de jaarrekening - Afschrijvingen op immateriële en materiële vaste activa"}]
[""]
[""]
["",{"$f":"INDEX(labels!A589:C589,1,MATCH(PP_Language,labels!A1:C1,0))","v":"Informatieverschaffing over afschrijvingen op immateriële en materiële vaste activa"},"",null,null,null,null,null,null,null,null,null,null,null,null,null,null,null,null,null,null,null,null,null,null,{"$f":"\"/notes-amortisation-depreciation label {\"&COLUMN(B983)&\"}\"","v":"/notes-amortisation-depreciation label {2}"},null,{"$f":"\"/notes-amortisation-depreciation \" & INDEX(labels!A56:C56,1,MATCH(PP_Language,labels!A1:C1,0)) & \" \" & BasisOfPreparationAxis & \"  {\"&COLUMN(D983)&\"}\"","v":"/notes-amortisation-depreciation Enkelvoudig Commercial  {4}"}]
["",{"$f":"INDEX(labels!A590:C590,1,MATCH(PP_Language,labels!A1:C1,0))","v":"Informatieverschaffing over afschrijvingen op immateriële vaste activa"},""]
["",{"$f":"INDEX(labels!A591:C591,1,MATCH(PP_Language,labels!A1:C1,0))","v":"Informatieverschaffing over afschrijvingen op materiële vaste activa"},""]
["",{"$f":"INDEX(labels!A592:C592,1,MATCH(PP_Language,labels!A1:C1,0))","v":"Informatieverschaffing over afschrijvingen van het bedrag aan willekeurige afschrijving dat uitgaat boven het bedrag van de reguliere afschrijving wanneer niet willekeurig zou zijn afgeschreven"},""]
[""]
["",null,null,null,null,null,null,null,null,null,null,null,null,null,null,null,null,null,null,null,null,null,null,null,null,{"$f":"\"//notes-amortisation-depreciation label {\"&COLUMN(B988)&\"}\"","v":"//notes-amortisation-depreciation label {2}"},null,{"$f":"\"//notes-amortisation-depreciation \" & INDEX(labels!A56:C56,1,MATCH(PP_Language,labels!A1:C1,0)) & \" \" & BasisOfPreparationAxis & \"  {\"&COLUMN(D988)&\"}\"","v":"//notes-amortisation-depreciation Enkelvoudig Commercial  {4}"}]
["",{"$f":"INDEX(labels!A593:C593,1,MATCH(PP_Language,labels!A1:C1,0))","v":"Toelichting op de jaarrekening - Bijzonder waardeverminderingsverlies van individueel actief welke van materieel belang is: Specificatie"}]
["",null,null,{"$f":"INDEX(labels!A55:C55,1,MATCH(PP_Language,labels!A1:C1,0))","v":"Huidig"}]
[""]
["",null,null,{"$f":"\" \"  & INDEX(labels!A56:C56,1,MATCH(PP_Language,labels!A1:C1,0)) &  \"  \"  & INDEX(labels!A594:C594,1,MATCH(PP_Language,labels!A1:C1,0)) &  \" \"","v":" Enkelvoudig  Individueel actief "},{"$f":"\" \"  & INDEX(labels!A56:C56,1,MATCH(PP_Language,labels!A1:C1,0)) &  \"  \"  & INDEX(labels!A594:C594,1,MATCH(PP_Language,labels!A1:C1,0)) &  \" \"","v":" Enkelvoudig  Individueel actief "},{"$f":"\" \"  & INDEX(labels!A56:C56,1,MATCH(PP_Language,labels!A1:C1,0)) &  \"  \"  & INDEX(labels!A594:C594,1,MATCH(PP_Language,labels!A1:C1,0)) &  \" \"","v":" Enkelvoudig  Individueel actief "},{"$f":"\" \"  & INDEX(labels!A56:C56,1,MATCH(PP_Language,labels!A1:C1,0)) &  \"  \"  & INDEX(labels!A594:C594,1,MATCH(PP_Language,labels!A1:C1,0)) &  \" \"","v":" Enkelvoudig  Individueel actief "},{"$f":"\" \"  & INDEX(labels!A56:C56,1,MATCH(PP_Language,labels!A1:C1,0)) &  \"  \"  & INDEX(labels!A594:C594,1,MATCH(PP_Language,labels!A1:C1,0)) &  \" \"","v":" Enkelvoudig  Individueel actief "},null,null,null,null,null,null,null,null,null,null,null,null,null,null,null,null,null,{"$f":"\"/notes-material-impairment-loss-individual-asset-specification label {\"&COLUMN(B992)&\"}\"","v":"/notes-material-impairment-loss-individual-asset-specification label {2}"},null,{"$f":"\"/notes-material-impairment-loss-individual-asset-specification \" & INDEX(labels!A56:C56,1,MATCH(PP_Language,labels!A1:C1,0)) & \" \" & INDEX(labels!A594:C594,1,MATCH(PP_Language,labels!A1:C1,0)) & \" \" & BasisOfPreparationAxis & \"  {\"&COLUMN(D992)&\"}\"","v":"/notes-material-impairment-loss-individual-asset-specification Enkelvoudig Individueel actief Commercial  {4}"},{"$f":"\"/notes-material-impairment-loss-individual-asset-specification \" & INDEX(labels!A56:C56,1,MATCH(PP_Language,labels!A1:C1,0)) & \" \" & INDEX(labels!A594:C594,1,MATCH(PP_Language,labels!A1:C1,0)) & \" \" & BasisOfPreparationAxis & \"  {\"&COLUMN(E992)&\"}\"","v":"/notes-material-impairment-loss-individual-asset-specification Enkelvoudig Individueel actief Commercial  {5}"},{"$f":"\"/notes-material-impairment-loss-individual-asset-specification \" & INDEX(labels!A56:C56,1,MATCH(PP_Language,labels!A1:C1,0)) & \" \" & INDEX(labels!A594:C594,1,MATCH(PP_Language,labels!A1:C1,0)) & \" \" & BasisOfPreparationAxis & \"  {\"&COLUMN(F992)&\"}\"","v":"/notes-material-impairment-loss-individual-asset-specification Enkelvoudig Individueel actief Commercial  {6}"},{"$f":"\"/notes-material-impairment-loss-individual-asset-specification \" & INDEX(labels!A56:C56,1,MATCH(PP_Language,labels!A1:C1,0)) & \" \" & INDEX(labels!A594:C594,1,MATCH(PP_Language,labels!A1:C1,0)) & \" \" & BasisOfPreparationAxis & \"  {\"&COLUMN(G992)&\"}\"","v":"/notes-material-impairment-loss-individual-asset-specification Enkelvoudig Individueel actief Commercial  {7}"},{"$f":"\"/notes-material-impairment-loss-individual-asset-specification \" & INDEX(labels!A56:C56,1,MATCH(PP_Language,labels!A1:C1,0)) & \" \" & INDEX(labels!A594:C594,1,MATCH(PP_Language,labels!A1:C1,0)) & \" \" & BasisOfPreparationAxis & \"  {\"&COLUMN(H992)&\"}\"","v":"/notes-material-impairment-loss-individual-asset-specification Enkelvoudig Individueel actief Commercial  {8}"}]
["",{"$f":"INDEX(labels!A595:C595,1,MATCH(PP_Language,labels!A1:C1,0))","v":"Omschrijving Individueel actief"}]
["",{"$f":"INDEX(labels!A596:C596,1,MATCH(PP_Language,labels!A1:C1,0))","v":"Beschrijving van de aard van het individueel actief waarvoor een bijzondere waardeverminderingsverlies, of terugneming hiervan, is verantwoord welke van materieel belang is"},""]
["",{"$f":"INDEX(labels!A597:C597,1,MATCH(PP_Language,labels!A1:C1,0))","v":"Beschrijving van het te rapporteren segment waartoe het individueel actief behoort waarvoor een bijzondere waardeverminderingsverlies, of terugneming hiervan, is verantwoord welke van materieel belang is"},""]
["",{"$f":"INDEX(labels!A598:C598,1,MATCH(PP_Language,labels!A1:C1,0))","v":"Beschrijving van of de opbrengstwaarde of de bedrijfswaarde van toepassing is"},""]
["",{"$f":"INDEX(labels!A141:C141,1,MATCH(PP_Language,labels!A1:C1,0))","v":"Presentatievolgorde"},""]
[""]
["",null,null,null,null,null,null,null,null,null,null,null,null,null,null,null,null,null,null,null,null,null,null,null,null,{"$f":"\"//notes-material-impairment-loss-individual-asset-specification label {\"&COLUMN(B999)&\"}\"","v":"//notes-material-impairment-loss-individual-asset-specification label {2}"},null,{"$f":"\"//notes-material-impairment-loss-individual-asset-specification \" & INDEX(labels!A56:C56,1,MATCH(PP_Language,labels!A1:C1,0)) & \" \" & INDEX(labels!A594:C594,1,MATCH(PP_Language,labels!A1:C1,0)) & \" \" & BasisOfPreparationAxis & \"  {\"&COLUMN(D999)&\"}\"","v":"//notes-material-impairment-loss-individual-asset-specification Enkelvoudig Individueel actief Commercial  {4}"},{"$f":"\"//notes-material-impairment-loss-individual-asset-specification \" & INDEX(labels!A56:C56,1,MATCH(PP_Language,labels!A1:C1,0)) & \" \" & INDEX(labels!A594:C594,1,MATCH(PP_Language,labels!A1:C1,0)) & \" \" & BasisOfPreparationAxis & \"  {\"&COLUMN(E999)&\"}\"","v":"//notes-material-impairment-loss-individual-asset-specification Enkelvoudig Individueel actief Commercial  {5}"},{"$f":"\"//notes-material-impairment-loss-individual-asset-specification \" & INDEX(labels!A56:C56,1,MATCH(PP_Language,labels!A1:C1,0)) & \" \" & INDEX(labels!A594:C594,1,MATCH(PP_Language,labels!A1:C1,0)) & \" \" & BasisOfPreparationAxis & \"  {\"&COLUMN(F999)&\"}\"","v":"//notes-material-impairment-loss-individual-asset-specification Enkelvoudig Individueel actief Commercial  {6}"},{"$f":"\"//notes-material-impairment-loss-individual-asset-specification \" & INDEX(labels!A56:C56,1,MATCH(PP_Language,labels!A1:C1,0)) & \" \" & INDEX(labels!A594:C594,1,MATCH(PP_Language,labels!A1:C1,0)) & \" \" & BasisOfPreparationAxis & \"  {\"&COLUMN(G999)&\"}\"","v":"//notes-material-impairment-loss-individual-asset-specification Enkelvoudig Individueel actief Commercial  {7}"},{"$f":"\"//notes-material-impairment-loss-individual-asset-specification \" & INDEX(labels!A56:C56,1,MATCH(PP_Language,labels!A1:C1,0)) & \" \" & INDEX(labels!A594:C594,1,MATCH(PP_Language,labels!A1:C1,0)) & \" \" & BasisOfPreparationAxis & \"  {\"&COLUMN(H999)&\"}\"","v":"//notes-material-impairment-loss-individual-asset-specification Enkelvoudig Individueel actief Commercial  {8}"}]
["",{"$f":"INDEX(labels!A599:C599,1,MATCH(PP_Language,labels!A1:C1,0))","v":"Belastingen"}]
["",{"$f":"INDEX(labels!A600:C600,1,MATCH(PP_Language,labels!A1:C1,0))","v":"Toelichting op de jaarrekening - Belastingen"}]
[""]
[""]
["",{"$f":"INDEX(labels!A601:C601,1,MATCH(PP_Language,labels!A1:C1,0))","v":"Informatieverschaffing over belastingen over de winst of het verlies"},"",null,null,null,null,null,null,null,null,null,null,null,null,null,null,null,null,null,null,null,null,null,null,{"$f":"\"/notes-income-tax-expense label {\"&COLUMN(B1004)&\"}\"","v":"/notes-income-tax-expense label {2}"},null,{"$f":"\"/notes-income-tax-expense \" & INDEX(labels!A56:C56,1,MATCH(PP_Language,labels!A1:C1,0)) & \" \" & BasisOfPreparationAxis & \"  {\"&COLUMN(D1004)&\"}\"","v":"/notes-income-tax-expense Enkelvoudig Commercial  {4}"}]
["",{"$f":"INDEX(labels!A602:C602,1,MATCH(PP_Language,labels!A1:C1,0))","v":"Informatieverschaffing over belastingen over resultaat uit gewone bedrijfsuitoefening"},""]
["",{"$f":"INDEX(labels!A603:C603,1,MATCH(PP_Language,labels!A1:C1,0))","v":"Informatieverschaffing over de aansluiting van belastingen met de aangifte vennootschapsbelasting"},""]
["",{"$f":"INDEX(labels!A604:C604,1,MATCH(PP_Language,labels!A1:C1,0))","v":"Informatieverschaffing over fiscale correcties over eerdere jaren inzake belastingen"},""]
["",{"$f":"INDEX(labels!A605:C605,1,MATCH(PP_Language,labels!A1:C1,0))","v":"Informatieverschaffing over belastingen rechtstreeks in het eigen vermogen verwerkt"},""]
[""]
["",null,null,null,null,null,null,null,null,null,null,null,null,null,null,null,null,null,null,null,null,null,null,null,null,{"$f":"\"//notes-income-tax-expense label {\"&COLUMN(B1010)&\"}\"","v":"//notes-income-tax-expense label {2}"},null,{"$f":"\"//notes-income-tax-expense \" & INDEX(labels!A56:C56,1,MATCH(PP_Language,labels!A1:C1,0)) & \" \" & BasisOfPreparationAxis & \"  {\"&COLUMN(D1010)&\"}\"","v":"//notes-income-tax-expense Enkelvoudig Commercial  {4}"}]
["",{"$f":"INDEX(labels!A606:C606,1,MATCH(PP_Language,labels!A1:C1,0))","v":"Toelichting op de jaarrekening - Belastingen: Overige bedragen: Uitsplitsing"}]
["",null,null,{"$f":"INDEX(labels!A55:C55,1,MATCH(PP_Language,labels!A1:C1,0))","v":"Huidig"},null,{"$f":"INDEX(labels!A57:C57,1,MATCH(PP_Language,labels!A1:C1,0))","v":"Voorgaand"}]
[""]
["",{"$f":"INDEX(labels!A607:C607,1,MATCH(PP_Language,labels!A1:C1,0))","v":"Beperkte aftrekbare kosten"},"-",null,null,null,null,null,null,null,null,null,null,null,null,null,null,null,null,null,null,null,null,null,null,{"$f":"\"/notes-income-tax-expense-other-amounts-breakdown label {\"&COLUMN(B1014)&\"}\"","v":"/notes-income-tax-expense-other-amounts-breakdown label {2}"},null,{"$f":"\"/notes-income-tax-expense-other-amounts-breakdown \" & INDEX(labels!A56:C56,1,MATCH(PP_Language,labels!A1:C1,0)) & \" \" & BasisOfPreparationAxis & \" \" & INDEX(labels!A55:C55,1,MATCH(PP_Language,labels!A1:C1,0)) &  \"  {\"&COLUMN(D1014)&\"}\"","v":"/notes-income-tax-expense-other-amounts-breakdown Enkelvoudig Commercial Huidig  {4}"},null,{"$f":"\"/notes-income-tax-expense-other-amounts-breakdown \" & INDEX(labels!A56:C56,1,MATCH(PP_Language,labels!A1:C1,0)) & \" \" & BasisOfPreparationAxis & \" \" & INDEX(labels!A57:C57,1,MATCH(PP_Language,labels!A1:C1,0)) &  \"  {\"&COLUMN(F1014)&\"}\"","v":"/notes-income-tax-expense-other-amounts-breakdown Enkelvoudig Commercial Voorgaand  {6}"}]
["",{"$f":"INDEX(labels!A608:C608,1,MATCH(PP_Language,labels!A1:C1,0))","v":"Niet aftrekbare kosten"},"-"]
[""]
["",null,null,null,null,null,null,null,null,null,null,null,null,null,null,null,null,null,null,null,null,null,null,null,null,{"$f":"\"//notes-income-tax-expense-other-amounts-breakdown label {\"&COLUMN(B1017)&\"}\"","v":"//notes-income-tax-expense-other-amounts-breakdown label {2}"},null,{"$f":"\"//notes-income-tax-expense-other-amounts-breakdown \" & INDEX(labels!A56:C56,1,MATCH(PP_Language,labels!A1:C1,0)) & \" \" & BasisOfPreparationAxis & \" \" & INDEX(labels!A55:C55,1,MATCH(PP_Language,labels!A1:C1,0)) &  \"  {\"&COLUMN(D1017)&\"}\"","v":"//notes-income-tax-expense-other-amounts-breakdown Enkelvoudig Commercial Huidig  {4}"},null,{"$f":"\"//notes-income-tax-expense-other-amounts-breakdown \" & INDEX(labels!A56:C56,1,MATCH(PP_Language,labels!A1:C1,0)) & \" \" & BasisOfPreparationAxis & \" \" & INDEX(labels!A57:C57,1,MATCH(PP_Language,labels!A1:C1,0)) &  \"  {\"&COLUMN(F1017)&\"}\"","v":"//notes-income-tax-expense-other-amounts-breakdown Enkelvoudig Commercial Voorgaand  {6}"}]
["",{"$f":"INDEX(labels!A609:C609,1,MATCH(PP_Language,labels!A1:C1,0))","v":"Overige toelichtingen"}]
["",{"$f":"INDEX(labels!A610:C610,1,MATCH(PP_Language,labels!A1:C1,0))","v":"Concessies"}]
["",{"$f":"INDEX(labels!A611:C611,1,MATCH(PP_Language,labels!A1:C1,0))","v":"Toelichting op de jaarrekening - Concessies"}]
[""]
[""]
["",{"$f":"INDEX(labels!A612:C612,1,MATCH(PP_Language,labels!A1:C1,0))","v":"Grondslag van publiek-private concessieovereenkomsten"},"",null,null,null,null,null,null,null,null,null,null,null,null,null,null,null,null,null,null,null,null,null,null,{"$f":"\"/notes-licensing-agreements label {\"&COLUMN(B1023)&\"}\"","v":"/notes-licensing-agreements label {2}"},null,{"$f":"\"/notes-licensing-agreements \" & INDEX(labels!A56:C56,1,MATCH(PP_Language,labels!A1:C1,0)) & \" \" & BasisOfPreparationAxis & \"  {\"&COLUMN(D1023)&\"}\"","v":"/notes-licensing-agreements Enkelvoudig Commercial  {4}"}]
["",{"$f":"INDEX(labels!A613:C613,1,MATCH(PP_Language,labels!A1:C1,0))","v":"Informatieverschaffing over concessies"},""]
["",{"$f":"INDEX(labels!A614:C614,1,MATCH(PP_Language,labels!A1:C1,0))","v":"Beschrijving van de afspraken omtrent concessies in hoofdlijnen"},""]
["",{"$f":"INDEX(labels!A615:C615,1,MATCH(PP_Language,labels!A1:C1,0))","v":"Beschrijving van de belangrijkste voorwaarden in de afspraken omtrent concessies die van invloed zijn op de grootte, het moment en de zekerheid van de toekomstige kasstromen"},""]
["",{"$f":"INDEX(labels!A616:C616,1,MATCH(PP_Language,labels!A1:C1,0))","v":"Beschrijving van de aard en omvang van de rechten op het gebruik van specifieke activa"},""]
["",{"$f":"INDEX(labels!A617:C617,1,MATCH(PP_Language,labels!A1:C1,0))","v":"Beschrijving van de aard en omvang van de verplichtingen tot dienstverlening of de rechten op verwachte dienstverlening"},""]
["",{"$f":"INDEX(labels!A618:C618,1,MATCH(PP_Language,labels!A1:C1,0))","v":"Beschrijving van de aard en omvang van de verplichtingen tot koop of bouw van materiële vaste activa"},""]
["",{"$f":"INDEX(labels!A619:C619,1,MATCH(PP_Language,labels!A1:C1,0))","v":"Beschrijving van de aard en omvang van de verplichtingen tot overdracht van specifieke activa aan het einde van de concessieperiode of de rechten op ontvangst van deze activa"},""]
["",{"$f":"INDEX(labels!A620:C620,1,MATCH(PP_Language,labels!A1:C1,0))","v":"Beschrijving van de aard en omvang van de opties tot verlenging of beëindiging"},""]
["",{"$f":"INDEX(labels!A621:C621,1,MATCH(PP_Language,labels!A1:C1,0))","v":"Beschrijving van de aard en omvang van andere rechten en verplichtingen"},""]
["",{"$f":"INDEX(labels!A622:C622,1,MATCH(PP_Language,labels!A1:C1,0))","v":"Beschrijving van de veranderingen van de afspraken gedurende de periode indien van toepassing; en de wijze waarop de concessieovereenkomst is geclassificeerd"},""]
[""]
["",null,null,null,null,null,null,null,null,null,null,null,null,null,null,null,null,null,null,null,null,null,null,null,null,{"$f":"\"//notes-licensing-agreements label {\"&COLUMN(B1035)&\"}\"","v":"//notes-licensing-agreements label {2}"},null,{"$f":"\"//notes-licensing-agreements \" & INDEX(labels!A56:C56,1,MATCH(PP_Language,labels!A1:C1,0)) & \" \" & BasisOfPreparationAxis & \"  {\"&COLUMN(D1035)&\"}\"","v":"//notes-licensing-agreements Enkelvoudig Commercial  {4}"}]
["",{"$f":"INDEX(labels!A623:C623,1,MATCH(PP_Language,labels!A1:C1,0))","v":"Gemiddeld aantal werknemers"}]
["",{"$f":"INDEX(labels!A624:C624,1,MATCH(PP_Language,labels!A1:C1,0))","v":"Toelichting op de jaarrekening - Gemiddeld aantal werknemers: Uitsplitsing"}]
["",null,null,{"$f":"INDEX(labels!A55:C55,1,MATCH(PP_Language,labels!A1:C1,0))","v":"Huidig"},null,{"$f":"INDEX(labels!A57:C57,1,MATCH(PP_Language,labels!A1:C1,0))","v":"Voorgaand"}]
[""]
["",{"$f":"INDEX(labels!A625:C625,1,MATCH(PP_Language,labels!A1:C1,0))","v":"Gemiddeld aantal werknemers over de periode werkzaam binnen Nederland"},"",null,null,null,null,null,null,null,null,null,null,null,null,null,null,null,null,null,null,null,null,null,null,{"$f":"\"/notes-average-number-of-employees-breakdown label {\"&COLUMN(B1040)&\"}\"","v":"/notes-average-number-of-employees-breakdown label {2}"},null,{"$f":"\"/notes-average-number-of-employees-breakdown \" & INDEX(labels!A56:C56,1,MATCH(PP_Language,labels!A1:C1,0)) & \" \" & BasisOfPreparationAxis & \" \" & INDEX(labels!A55:C55,1,MATCH(PP_Language,labels!A1:C1,0)) &  \"  {\"&COLUMN(D1040)&\"}\"","v":"/notes-average-number-of-employees-breakdown Enkelvoudig Commercial Huidig  {4}"},null,{"$f":"\"/notes-average-number-of-employees-breakdown \" & INDEX(labels!A56:C56,1,MATCH(PP_Language,labels!A1:C1,0)) & \" \" & BasisOfPreparationAxis & \" \" & INDEX(labels!A57:C57,1,MATCH(PP_Language,labels!A1:C1,0)) &  \"  {\"&COLUMN(F1040)&\"}\"","v":"/notes-average-number-of-employees-breakdown Enkelvoudig Commercial Voorgaand  {6}"}]
["",{"$f":"INDEX(labels!A626:C626,1,MATCH(PP_Language,labels!A1:C1,0))","v":"Gemiddeld aantal werknemers over de periode werkzaam buiten Nederland"},""]
[""]
["",{"$f":"INDEX(labels!A627:C627,1,MATCH(PP_Language,labels!A1:C1,0))","v":"Totaal van gemiddeld aantal werknemers over de periode"},""]
[""]
["",null,null,null,null,null,null,null,null,null,null,null,null,null,null,null,null,null,null,null,null,null,null,null,null,{"$f":"\"//notes-average-number-of-employees-breakdown label {\"&COLUMN(B1045)&\"}\"","v":"//notes-average-number-of-employees-breakdown label {2}"},null,{"$f":"\"//notes-average-number-of-employees-breakdown \" & INDEX(labels!A56:C56,1,MATCH(PP_Language,labels!A1:C1,0)) & \" \" & BasisOfPreparationAxis & \" \" & INDEX(labels!A55:C55,1,MATCH(PP_Language,labels!A1:C1,0)) &  \"  {\"&COLUMN(D1045)&\"}\"","v":"//notes-average-number-of-employees-breakdown Enkelvoudig Commercial Huidig  {4}"},null,{"$f":"\"//notes-average-number-of-employees-breakdown \" & INDEX(labels!A56:C56,1,MATCH(PP_Language,labels!A1:C1,0)) & \" \" & BasisOfPreparationAxis & \" \" & INDEX(labels!A57:C57,1,MATCH(PP_Language,labels!A1:C1,0)) &  \"  {\"&COLUMN(F1045)&\"}\"","v":"//notes-average-number-of-employees-breakdown Enkelvoudig Commercial Voorgaand  {6}"}]
["",{"$f":"INDEX(labels!A628:C628,1,MATCH(PP_Language,labels!A1:C1,0))","v":"Toelichting op de jaarrekening - Gemiddeld aantal werknemers"}]
[""]
[""]
["",{"$f":"INDEX(labels!A629:C629,1,MATCH(PP_Language,labels!A1:C1,0))","v":"Informatieverschaffing over gemiddeld aantal werknemers over de periode"},"",null,null,null,null,null,null,null,null,null,null,null,null,null,null,null,null,null,null,null,null,null,null,{"$f":"\"/notes-average-number-of-employees label {\"&COLUMN(B1049)&\"}\"","v":"/notes-average-number-of-employees label {2}"},null,{"$f":"\"/notes-average-number-of-employees \" & INDEX(labels!A56:C56,1,MATCH(PP_Language,labels!A1:C1,0)) & \" \" & BasisOfPreparationAxis & \"  {\"&COLUMN(D1049)&\"}\"","v":"/notes-average-number-of-employees Enkelvoudig Commercial  {4}"}]
[""]
["",null,null,null,null,null,null,null,null,null,null,null,null,null,null,null,null,null,null,null,null,null,null,null,null,{"$f":"\"//notes-average-number-of-employees label {\"&COLUMN(B1051)&\"}\"","v":"//notes-average-number-of-employees label {2}"},null,{"$f":"\"//notes-average-number-of-employees \" & INDEX(labels!A56:C56,1,MATCH(PP_Language,labels!A1:C1,0)) & \" \" & BasisOfPreparationAxis & \"  {\"&COLUMN(D1051)&\"}\"","v":"//notes-average-number-of-employees Enkelvoudig Commercial  {4}"}]
["",{"$f":"INDEX(labels!A630:C630,1,MATCH(PP_Language,labels!A1:C1,0))","v":"Financiële instrumenten"}]
["",{"$f":"INDEX(labels!A631:C631,1,MATCH(PP_Language,labels!A1:C1,0))","v":"Toelichting op de jaarrekening - Financiële instrumenten"}]
[""]
[""]
["",{"$f":"INDEX(labels!A632:C632,1,MATCH(PP_Language,labels!A1:C1,0))","v":"Informatieverschaffing over financiële instrumenten"},"",null,null,null,null,null,null,null,null,null,null,null,null,null,null,null,null,null,null,null,null,null,null,{"$f":"\"/notes-financial-instruments label {\"&COLUMN(B1056)&\"}\"","v":"/notes-financial-instruments label {2}"},null,{"$f":"\"/notes-financial-instruments \" & INDEX(labels!A56:C56,1,MATCH(PP_Language,labels!A1:C1,0)) & \" \" & BasisOfPreparationAxis & \"  {\"&COLUMN(D1056)&\"}\"","v":"/notes-financial-instruments Enkelvoudig Commercial  {4}"}]
["",{"$f":"INDEX(labels!A633:C633,1,MATCH(PP_Language,labels!A1:C1,0))","v":"Informatieverschaffing over financiële vaste activa met de boekwaarde die hoger is dan de actuele waarde"},""]
["",{"$f":"INDEX(labels!A634:C634,1,MATCH(PP_Language,labels!A1:C1,0))","v":"Beschrijving van de aard en omvang van de afgeleide financiële instrumenten"},""]
["",{"$f":"INDEX(labels!A635:C635,1,MATCH(PP_Language,labels!A1:C1,0))","v":"Voorwaarden die op het bedrag, het tijdstip en de zekerheid van toekomstige kasstromen van afgeleide financiële instrumenten van invloed kunnen zijn"},""]
[""]
["",null,null,null,null,null,null,null,null,null,null,null,null,null,null,null,null,null,null,null,null,null,null,null,null,{"$f":"\"//notes-financial-instruments label {\"&COLUMN(B1061)&\"}\"","v":"//notes-financial-instruments label {2}"},null,{"$f":"\"//notes-financial-instruments \" & INDEX(labels!A56:C56,1,MATCH(PP_Language,labels!A1:C1,0)) & \" \" & BasisOfPreparationAxis & \"  {\"&COLUMN(D1061)&\"}\"","v":"//notes-financial-instruments Enkelvoudig Commercial  {4}"}]
["",{"$f":"INDEX(labels!A636:C636,1,MATCH(PP_Language,labels!A1:C1,0))","v":"Toelichting op de jaarrekening - Uitkeringen wegens beëindiging van het dienstverband aan topfunctionarissen met of zonder dienstbetrekking: Specificatie"}]
["",null,null,{"$f":"INDEX(labels!A55:C55,1,MATCH(PP_Language,labels!A1:C1,0))","v":"Huidig"}]
[""]
["",null,null,{"$f":"\" \"  & INDEX(labels!A637:C637,1,MATCH(PP_Language,labels!A1:C1,0)) &  \"  \"  & INDEX(labels!A56:C56,1,MATCH(PP_Language,labels!A1:C1,0)) &  \" \"","v":" De naam (bestaande uit de voorletters en achternaam) van de topfunctionaris  Enkelvoudig "},{"$f":"\" \"  & INDEX(labels!A637:C637,1,MATCH(PP_Language,labels!A1:C1,0)) &  \"  \"  & INDEX(labels!A56:C56,1,MATCH(PP_Language,labels!A1:C1,0)) &  \" \"","v":" De naam (bestaande uit de voorletters en achternaam) van de topfunctionaris  Enkelvoudig "},{"$f":"\" \"  & INDEX(labels!A637:C637,1,MATCH(PP_Language,labels!A1:C1,0)) &  \"  \"  & INDEX(labels!A56:C56,1,MATCH(PP_Language,labels!A1:C1,0)) &  \" \"","v":" De naam (bestaande uit de voorletters en achternaam) van de topfunctionaris  Enkelvoudig "},{"$f":"\" \"  & INDEX(labels!A637:C637,1,MATCH(PP_Language,labels!A1:C1,0)) &  \"  \"  & INDEX(labels!A56:C56,1,MATCH(PP_Language,labels!A1:C1,0)) &  \" \"","v":" De naam (bestaande uit de voorletters en achternaam) van de topfunctionaris  Enkelvoudig "},{"$f":"\" \"  & INDEX(labels!A637:C637,1,MATCH(PP_Language,labels!A1:C1,0)) &  \"  \"  & INDEX(labels!A56:C56,1,MATCH(PP_Language,labels!A1:C1,0)) &  \" \"","v":" De naam (bestaande uit de voorletters en achternaam) van de topfunctionaris  Enkelvoudig "},null,null,null,null,null,null,null,null,null,null,null,null,null,null,null,null,null,{"$f":"\"/notes-payments-due-to-termination-employment-senior-officials-specification label {\"&COLUMN(B1065)&\"}\"","v":"/notes-payments-due-to-termination-employment-senior-officials-specification label {2}"},null,{"$f":"\"/notes-payments-due-to-termination-employment-senior-officials-specification \" & INDEX(labels!A637:C637,1,MATCH(PP_Language,labels!A1:C1,0)) & \" \" & INDEX(labels!A56:C56,1,MATCH(PP_Language,labels!A1:C1,0)) & \" \" & BasisOfPreparationAxis & \"  {\"&COLUMN(D1065)&\"}\"","v":"/notes-payments-due-to-termination-employment-senior-officials-specification De naam (bestaande uit de voorletters en achternaam) van de topfunctionaris Enkelvoudig Commercial  {4}"},{"$f":"\"/notes-payments-due-to-termination-employment-senior-officials-specification \" & INDEX(labels!A637:C637,1,MATCH(PP_Language,labels!A1:C1,0)) & \" \" & INDEX(labels!A56:C56,1,MATCH(PP_Language,labels!A1:C1,0)) & \" \" & BasisOfPreparationAxis & \"  {\"&COLUMN(E1065)&\"}\"","v":"/notes-payments-due-to-termination-employment-senior-officials-specification De naam (bestaande uit de voorletters en achternaam) van de topfunctionaris Enkelvoudig Commercial  {5}"},{"$f":"\"/notes-payments-due-to-termination-employment-senior-officials-specification \" & INDEX(labels!A637:C637,1,MATCH(PP_Language,labels!A1:C1,0)) & \" \" & INDEX(labels!A56:C56,1,MATCH(PP_Language,labels!A1:C1,0)) & \" \" & BasisOfPreparationAxis & \"  {\"&COLUMN(F1065)&\"}\"","v":"/notes-payments-due-to-termination-employment-senior-officials-specification De naam (bestaande uit de voorletters en achternaam) van de topfunctionaris Enkelvoudig Commercial  {6}"},{"$f":"\"/notes-payments-due-to-termination-employment-senior-officials-specification \" & INDEX(labels!A637:C637,1,MATCH(PP_Language,labels!A1:C1,0)) & \" \" & INDEX(labels!A56:C56,1,MATCH(PP_Language,labels!A1:C1,0)) & \" \" & BasisOfPreparationAxis & \"  {\"&COLUMN(G1065)&\"}\"","v":"/notes-payments-due-to-termination-employment-senior-officials-specification De naam (bestaande uit de voorletters en achternaam) van de topfunctionaris Enkelvoudig Commercial  {7}"},{"$f":"\"/notes-payments-due-to-termination-employment-senior-officials-specification \" & INDEX(labels!A637:C637,1,MATCH(PP_Language,labels!A1:C1,0)) & \" \" & INDEX(labels!A56:C56,1,MATCH(PP_Language,labels!A1:C1,0)) & \" \" & BasisOfPreparationAxis & \"  {\"&COLUMN(H1065)&\"}\"","v":"/notes-payments-due-to-termination-employment-senior-officials-specification De naam (bestaande uit de voorletters en achternaam) van de topfunctionaris Enkelvoudig Commercial  {8}"}]
["",{"$f":"INDEX(labels!A638:C638,1,MATCH(PP_Language,labels!A1:C1,0))","v":"Omschrijving De naam (bestaande uit de voorletters en achternaam) van de topfunctionaris"}]
["",{"$f":"INDEX(labels!A639:C639,1,MATCH(PP_Language,labels!A1:C1,0))","v":"Functie(s)"},""]
["",{"$f":"INDEX(labels!A640:C640,1,MATCH(PP_Language,labels!A1:C1,0))","v":"Omvang van het dienstverband uitgedrukt als deeltijdfactor in FTE"},""]
["",{"$f":"INDEX(labels!A641:C641,1,MATCH(PP_Language,labels!A1:C1,0))","v":"Jaar waarin het dienstverband is beëindigd"},""]
["",{"$f":"INDEX(labels!A642:C642,1,MATCH(PP_Language,labels!A1:C1,0))","v":"Overeengekomen uitkeringen wegens beëindiging dienstverband"},"-"]
["",{"$f":"INDEX(labels!A643:C643,1,MATCH(PP_Language,labels!A1:C1,0))","v":"Individueel toepasselijk maximum"},"-"]
["",{"$f":"INDEX(labels!A644:C644,1,MATCH(PP_Language,labels!A1:C1,0))","v":"Totaal van uitkeringen wegens beëindiging van het dienstverband"},"-"]
["",{"$f":"INDEX(labels!A645:C645,1,MATCH(PP_Language,labels!A1:C1,0))","v":"In het boekjaar gedane uitkeringen wegens beëindiging van het dienstverband"},"-"]
["",{"$f":"INDEX(labels!A646:C646,1,MATCH(PP_Language,labels!A1:C1,0))","v":"Onverschuldigd betaald en nog niet terugontvangen bedrag"},"+"]
["",{"$f":"INDEX(labels!A647:C647,1,MATCH(PP_Language,labels!A1:C1,0))","v":"Het bedrag van de overschrijding"},"-"]
["",{"$f":"INDEX(labels!A648:C648,1,MATCH(PP_Language,labels!A1:C1,0))","v":"Reden waarom de overschrijding al dan niet is toegestaan"},""]
["",{"$f":"INDEX(labels!A649:C649,1,MATCH(PP_Language,labels!A1:C1,0))","v":"Toelichting op de vordering wegens onverschuldigde betaling"},""]
["",{"$f":"INDEX(labels!A650:C650,1,MATCH(PP_Language,labels!A1:C1,0))","v":"Foutenherstel in verantwoording WNT"},""]
["",{"$f":"INDEX(labels!A651:C651,1,MATCH(PP_Language,labels!A1:C1,0))","v":"Toelichting op verschil en oorzaak foutenherstel"},""]
["",{"$f":"INDEX(labels!A141:C141,1,MATCH(PP_Language,labels!A1:C1,0))","v":"Presentatievolgorde"},""]
[""]
["",null,null,null,null,null,null,null,null,null,null,null,null,null,null,null,null,null,null,null,null,null,null,null,null,{"$f":"\"//notes-payments-due-to-termination-employment-senior-officials-specification label {\"&COLUMN(B1082)&\"}\"","v":"//notes-payments-due-to-termination-employment-senior-officials-specification label {2}"},null,{"$f":"\"//notes-payments-due-to-termination-employment-senior-officials-specification \" & INDEX(labels!A637:C637,1,MATCH(PP_Language,labels!A1:C1,0)) & \" \" & INDEX(labels!A56:C56,1,MATCH(PP_Language,labels!A1:C1,0)) & \" \" & BasisOfPreparationAxis & \"  {\"&COLUMN(D1082)&\"}\"","v":"//notes-payments-due-to-termination-employment-senior-officials-specification De naam (bestaande uit de voorletters en achternaam) van de topfunctionaris Enkelvoudig Commercial  {4}"},{"$f":"\"//notes-payments-due-to-termination-employment-senior-officials-specification \" & INDEX(labels!A637:C637,1,MATCH(PP_Language,labels!A1:C1,0)) & \" \" & INDEX(labels!A56:C56,1,MATCH(PP_Language,labels!A1:C1,0)) & \" \" & BasisOfPreparationAxis & \"  {\"&COLUMN(E1082)&\"}\"","v":"//notes-payments-due-to-termination-employment-senior-officials-specification De naam (bestaande uit de voorletters en achternaam) van de topfunctionaris Enkelvoudig Commercial  {5}"},{"$f":"\"//notes-payments-due-to-termination-employment-senior-officials-specification \" & INDEX(labels!A637:C637,1,MATCH(PP_Language,labels!A1:C1,0)) & \" \" & INDEX(labels!A56:C56,1,MATCH(PP_Language,labels!A1:C1,0)) & \" \" & BasisOfPreparationAxis & \"  {\"&COLUMN(F1082)&\"}\"","v":"//notes-payments-due-to-termination-employment-senior-officials-specification De naam (bestaande uit de voorletters en achternaam) van de topfunctionaris Enkelvoudig Commercial  {6}"},{"$f":"\"//notes-payments-due-to-termination-employment-senior-officials-specification \" & INDEX(labels!A637:C637,1,MATCH(PP_Language,labels!A1:C1,0)) & \" \" & INDEX(labels!A56:C56,1,MATCH(PP_Language,labels!A1:C1,0)) & \" \" & BasisOfPreparationAxis & \"  {\"&COLUMN(G1082)&\"}\"","v":"//notes-payments-due-to-termination-employment-senior-officials-specification De naam (bestaande uit de voorletters en achternaam) van de topfunctionaris Enkelvoudig Commercial  {7}"},{"$f":"\"//notes-payments-due-to-termination-employment-senior-officials-specification \" & INDEX(labels!A637:C637,1,MATCH(PP_Language,labels!A1:C1,0)) & \" \" & INDEX(labels!A56:C56,1,MATCH(PP_Language,labels!A1:C1,0)) & \" \" & BasisOfPreparationAxis & \"  {\"&COLUMN(H1082)&\"}\"","v":"//notes-payments-due-to-termination-employment-senior-officials-specification De naam (bestaande uit de voorletters en achternaam) van de topfunctionaris Enkelvoudig Commercial  {8}"}]
["",{"$f":"INDEX(labels!A652:C652,1,MATCH(PP_Language,labels!A1:C1,0))","v":"Bezoldiging van bestuurders en commissarissen"}]
["",{"$f":"INDEX(labels!A653:C653,1,MATCH(PP_Language,labels!A1:C1,0))","v":"Toelichting op de jaarrekening - Bezoldiging van leidinggevende topfunctionarissen met dienstbetrekking en zonder dienstbetrekking vanaf de 13e maand: Specificatie"}]
["",null,null,{"$f":"INDEX(labels!A55:C55,1,MATCH(PP_Language,labels!A1:C1,0))","v":"Huidig"}]
[""]
["",null,null,{"$f":"\" \"  & INDEX(labels!A637:C637,1,MATCH(PP_Language,labels!A1:C1,0)) &  \"  \"  & INDEX(labels!A56:C56,1,MATCH(PP_Language,labels!A1:C1,0)) &  \" \"","v":" De naam (bestaande uit de voorletters en achternaam) van de topfunctionaris  Enkelvoudig "},{"$f":"\" \"  & INDEX(labels!A637:C637,1,MATCH(PP_Language,labels!A1:C1,0)) &  \"  \"  & INDEX(labels!A56:C56,1,MATCH(PP_Language,labels!A1:C1,0)) &  \" \"","v":" De naam (bestaande uit de voorletters en achternaam) van de topfunctionaris  Enkelvoudig "},{"$f":"\" \"  & INDEX(labels!A637:C637,1,MATCH(PP_Language,labels!A1:C1,0)) &  \"  \"  & INDEX(labels!A56:C56,1,MATCH(PP_Language,labels!A1:C1,0)) &  \" \"","v":" De naam (bestaande uit de voorletters en achternaam) van de topfunctionaris  Enkelvoudig "},{"$f":"\" \"  & INDEX(labels!A637:C637,1,MATCH(PP_Language,labels!A1:C1,0)) &  \"  \"  & INDEX(labels!A56:C56,1,MATCH(PP_Language,labels!A1:C1,0)) &  \" \"","v":" De naam (bestaande uit de voorletters en achternaam) van de topfunctionaris  Enkelvoudig "},{"$f":"\" \"  & INDEX(labels!A637:C637,1,MATCH(PP_Language,labels!A1:C1,0)) &  \"  \"  & INDEX(labels!A56:C56,1,MATCH(PP_Language,labels!A1:C1,0)) &  \" \"","v":" De naam (bestaande uit de voorletters en achternaam) van de topfunctionaris  Enkelvoudig "},null,null,null,null,null,null,null,null,null,null,null,null,null,null,null,null,null,{"$f":"\"/notes-remuneration-executive-senior-officials-from13month-specification label {\"&COLUMN(B1087)&\"}\"","v":"/notes-remuneration-executive-senior-officials-from13month-specification label {2}"},null,{"$f":"\"/notes-remuneration-executive-senior-officials-from13month-specification \" & INDEX(labels!A637:C637,1,MATCH(PP_Language,labels!A1:C1,0)) & \" \" & INDEX(labels!A56:C56,1,MATCH(PP_Language,labels!A1:C1,0)) & \" \" & BasisOfPreparationAxis & \"  {\"&COLUMN(D1087)&\"}\"","v":"/notes-remuneration-executive-senior-officials-from13month-specification De naam (bestaande uit de voorletters en achternaam) van de topfunctionaris Enkelvoudig Commercial  {4}"},{"$f":"\"/notes-remuneration-executive-senior-officials-from13month-specification \" & INDEX(labels!A637:C637,1,MATCH(PP_Language,labels!A1:C1,0)) & \" \" & INDEX(labels!A56:C56,1,MATCH(PP_Language,labels!A1:C1,0)) & \" \" & BasisOfPreparationAxis & \"  {\"&COLUMN(E1087)&\"}\"","v":"/notes-remuneration-executive-senior-officials-from13month-specification De naam (bestaande uit de voorletters en achternaam) van de topfunctionaris Enkelvoudig Commercial  {5}"},{"$f":"\"/notes-remuneration-executive-senior-officials-from13month-specification \" & INDEX(labels!A637:C637,1,MATCH(PP_Language,labels!A1:C1,0)) & \" \" & INDEX(labels!A56:C56,1,MATCH(PP_Language,labels!A1:C1,0)) & \" \" & BasisOfPreparationAxis & \"  {\"&COLUMN(F1087)&\"}\"","v":"/notes-remuneration-executive-senior-officials-from13month-specification De naam (bestaande uit de voorletters en achternaam) van de topfunctionaris Enkelvoudig Commercial  {6}"},{"$f":"\"/notes-remuneration-executive-senior-officials-from13month-specification \" & INDEX(labels!A637:C637,1,MATCH(PP_Language,labels!A1:C1,0)) & \" \" & INDEX(labels!A56:C56,1,MATCH(PP_Language,labels!A1:C1,0)) & \" \" & BasisOfPreparationAxis & \"  {\"&COLUMN(G1087)&\"}\"","v":"/notes-remuneration-executive-senior-officials-from13month-specification De naam (bestaande uit de voorletters en achternaam) van de topfunctionaris Enkelvoudig Commercial  {7}"},{"$f":"\"/notes-remuneration-executive-senior-officials-from13month-specification \" & INDEX(labels!A637:C637,1,MATCH(PP_Language,labels!A1:C1,0)) & \" \" & INDEX(labels!A56:C56,1,MATCH(PP_Language,labels!A1:C1,0)) & \" \" & BasisOfPreparationAxis & \"  {\"&COLUMN(H1087)&\"}\"","v":"/notes-remuneration-executive-senior-officials-from13month-specification De naam (bestaande uit de voorletters en achternaam) van de topfunctionaris Enkelvoudig Commercial  {8}"}]
["",{"$f":"INDEX(labels!A654:C654,1,MATCH(PP_Language,labels!A1:C1,0))","v":"Omschrijving De naam (bestaande uit de voorletters en achternaam) van de topfunctionaris"}]
["",{"$f":"INDEX(labels!A639:C639,1,MATCH(PP_Language,labels!A1:C1,0))","v":"Functie(s)"},""]
["",{"$f":"INDEX(labels!A655:C655,1,MATCH(PP_Language,labels!A1:C1,0))","v":"Aanvang functievervulling"},""]
["",{"$f":"INDEX(labels!A656:C656,1,MATCH(PP_Language,labels!A1:C1,0))","v":"Einde functievervulling"},""]
["",{"$f":"INDEX(labels!A640:C640,1,MATCH(PP_Language,labels!A1:C1,0))","v":"Omvang van het dienstverband uitgedrukt als deeltijdfactor in FTE"},""]
["",{"$f":"INDEX(labels!A657:C657,1,MATCH(PP_Language,labels!A1:C1,0))","v":"Dienstbetrekking?"},""]
["",{"$f":"INDEX(labels!A658:C658,1,MATCH(PP_Language,labels!A1:C1,0))","v":"Beloning plus belastbare onkostenvergoedingen"},"-"]
["",{"$f":"INDEX(labels!A659:C659,1,MATCH(PP_Language,labels!A1:C1,0))","v":"Beloningen betaalbaar op termijn"},"-"]
[""]
["",{"$f":"INDEX(labels!A660:C660,1,MATCH(PP_Language,labels!A1:C1,0))","v":"Subtotaal"},"-",{"$f":"IF(OR(NOT(0=0),NOT(AND(Stamdata!D1096=\"\",Stamdata!D1097=\"\"))), + SUM(Stamdata!D1096,Stamdata!D1097),\"\")","v":""},{"$f":"IF(OR(NOT(0=0),NOT(AND(Stamdata!E1096=\"\",Stamdata!E1097=\"\"))), + SUM(Stamdata!E1096,Stamdata!E1097),\"\")","v":""},{"$f":"IF(OR(NOT(0=0),NOT(AND(Stamdata!F1096=\"\",Stamdata!F1097=\"\"))), + SUM(Stamdata!F1096,Stamdata!F1097),\"\")","v":""},{"$f":"IF(OR(NOT(0=0),NOT(AND(Stamdata!G1096=\"\",Stamdata!G1097=\"\"))), + SUM(Stamdata!G1096,Stamdata!G1097),\"\")","v":""},{"$f":"IF(OR(NOT(0=0),NOT(AND(Stamdata!H1096=\"\",Stamdata!H1097=\"\"))), + SUM(Stamdata!H1096,Stamdata!H1097),\"\")","v":""}]
["",{"$f":"INDEX(labels!A661:C661,1,MATCH(PP_Language,labels!A1:C1,0))","v":"Individueel toepasselijke bezoldigingsmaximum"},"-"]
["",{"$f":"INDEX(labels!A646:C646,1,MATCH(PP_Language,labels!A1:C1,0))","v":"Onverschuldigd betaald en nog niet terugontvangen bedrag"},"+"]
["",{"$f":"INDEX(labels!A662:C662,1,MATCH(PP_Language,labels!A1:C1,0))","v":"Bezoldiging"},"-"]
["",{"$f":"INDEX(labels!A647:C647,1,MATCH(PP_Language,labels!A1:C1,0))","v":"Het bedrag van de overschrijding"},"-"]
["",{"$f":"INDEX(labels!A648:C648,1,MATCH(PP_Language,labels!A1:C1,0))","v":"Reden waarom de overschrijding al dan niet is toegestaan"},""]
["",{"$f":"INDEX(labels!A649:C649,1,MATCH(PP_Language,labels!A1:C1,0))","v":"Toelichting op de vordering wegens onverschuldigde betaling"},""]
["",{"$f":"INDEX(labels!A650:C650,1,MATCH(PP_Language,labels!A1:C1,0))","v":"Foutenherstel in verantwoording WNT"},""]
["",{"$f":"INDEX(labels!A651:C651,1,MATCH(PP_Language,labels!A1:C1,0))","v":"Toelichting op verschil en oorzaak foutenherstel"},""]
["",{"$f":"INDEX(labels!A141:C141,1,MATCH(PP_Language,labels!A1:C1,0))","v":"Presentatievolgorde"},""]
[""]
["",null,null,null,null,null,null,null,null,null,null,null,null,null,null,null,null,null,null,null,null,null,null,null,null,{"$f":"\"//notes-remuneration-executive-senior-officials-from13month-specification label {\"&COLUMN(B1108)&\"}\"","v":"//notes-remuneration-executive-senior-officials-from13month-specification label {2}"},null,{"$f":"\"//notes-remuneration-executive-senior-officials-from13month-specification \" & INDEX(labels!A637:C637,1,MATCH(PP_Language,labels!A1:C1,0)) & \" \" & INDEX(labels!A56:C56,1,MATCH(PP_Language,labels!A1:C1,0)) & \" \" & BasisOfPreparationAxis & \"  {\"&COLUMN(D1108)&\"}\"","v":"//notes-remuneration-executive-senior-officials-from13month-specification De naam (bestaande uit de voorletters en achternaam) van de topfunctionaris Enkelvoudig Commercial  {4}"},{"$f":"\"//notes-remuneration-executive-senior-officials-from13month-specification \" & INDEX(labels!A637:C637,1,MATCH(PP_Language,labels!A1:C1,0)) & \" \" & INDEX(labels!A56:C56,1,MATCH(PP_Language,labels!A1:C1,0)) & \" \" & BasisOfPreparationAxis & \"  {\"&COLUMN(E1108)&\"}\"","v":"//notes-remuneration-executive-senior-officials-from13month-specification De naam (bestaande uit de voorletters en achternaam) van de topfunctionaris Enkelvoudig Commercial  {5}"},{"$f":"\"//notes-remuneration-executive-senior-officials-from13month-specification \" & INDEX(labels!A637:C637,1,MATCH(PP_Language,labels!A1:C1,0)) & \" \" & INDEX(labels!A56:C56,1,MATCH(PP_Language,labels!A1:C1,0)) & \" \" & BasisOfPreparationAxis & \"  {\"&COLUMN(F1108)&\"}\"","v":"//notes-remuneration-executive-senior-officials-from13month-specification De naam (bestaande uit de voorletters en achternaam) van de topfunctionaris Enkelvoudig Commercial  {6}"},{"$f":"\"//notes-remuneration-executive-senior-officials-from13month-specification \" & INDEX(labels!A637:C637,1,MATCH(PP_Language,labels!A1:C1,0)) & \" \" & INDEX(labels!A56:C56,1,MATCH(PP_Language,labels!A1:C1,0)) & \" \" & BasisOfPreparationAxis & \"  {\"&COLUMN(G1108)&\"}\"","v":"//notes-remuneration-executive-senior-officials-from13month-specification De naam (bestaande uit de voorletters en achternaam) van de topfunctionaris Enkelvoudig Commercial  {7}"},{"$f":"\"//notes-remuneration-executive-senior-officials-from13month-specification \" & INDEX(labels!A637:C637,1,MATCH(PP_Language,labels!A1:C1,0)) & \" \" & INDEX(labels!A56:C56,1,MATCH(PP_Language,labels!A1:C1,0)) & \" \" & BasisOfPreparationAxis & \"  {\"&COLUMN(H1108)&\"}\"","v":"//notes-remuneration-executive-senior-officials-from13month-specification De naam (bestaande uit de voorletters en achternaam) van de topfunctionaris Enkelvoudig Commercial  {8}"}]
["",{"$f":"INDEX(labels!A663:C663,1,MATCH(PP_Language,labels!A1:C1,0))","v":"Toelichting op de jaarrekening - Bezoldiging van leidinggevende topfunctionarissen met dienstbetrekking en zonder dienstbetrekking vanaf de 13e maand, voorgaande periode: Specificatie"}]
["",null,null,{"$f":"INDEX(labels!A57:C57,1,MATCH(PP_Language,labels!A1:C1,0))","v":"Voorgaand"}]
[""]
["",null,null,{"$f":"\" \"  & INDEX(labels!A637:C637,1,MATCH(PP_Language,labels!A1:C1,0)) &  \"  \"  & INDEX(labels!A56:C56,1,MATCH(PP_Language,labels!A1:C1,0)) &  \" \"","v":" De naam (bestaande uit de voorletters en achternaam) van de topfunctionaris  Enkelvoudig "},{"$f":"\" \"  & INDEX(labels!A637:C637,1,MATCH(PP_Language,labels!A1:C1,0)) &  \"  \"  & INDEX(labels!A56:C56,1,MATCH(PP_Language,labels!A1:C1,0)) &  \" \"","v":" De naam (bestaande uit de voorletters en achternaam) van de topfunctionaris  Enkelvoudig "},{"$f":"\" \"  & INDEX(labels!A637:C637,1,MATCH(PP_Language,labels!A1:C1,0)) &  \"  \"  & INDEX(labels!A56:C56,1,MATCH(PP_Language,labels!A1:C1,0)) &  \" \"","v":" De naam (bestaande uit de voorletters en achternaam) van de topfunctionaris  Enkelvoudig "},{"$f":"\" \"  & INDEX(labels!A637:C637,1,MATCH(PP_Language,labels!A1:C1,0)) &  \"  \"  & INDEX(labels!A56:C56,1,MATCH(PP_Language,labels!A1:C1,0)) &  \" \"","v":" De naam (bestaande uit de voorletters en achternaam) van de topfunctionaris  Enkelvoudig "},{"$f":"\" \"  & INDEX(labels!A637:C637,1,MATCH(PP_Language,labels!A1:C1,0)) &  \"  \"  & INDEX(labels!A56:C56,1,MATCH(PP_Language,labels!A1:C1,0)) &  \" \"","v":" De naam (bestaande uit de voorletters en achternaam) van de topfunctionaris  Enkelvoudig "},null,null,null,null,null,null,null,null,null,null,null,null,null,null,null,null,null,{"$f":"\"/notes-remuneration-executive-senior-officials-from13month-previous-specification label {\"&COLUMN(B1112)&\"}\"","v":"/notes-remuneration-executive-senior-officials-from13month-previous-specification label {2}"},null,{"$f":"\"/notes-remuneration-executive-senior-officials-from13month-previous-specification \" & INDEX(labels!A637:C637,1,MATCH(PP_Language,labels!A1:C1,0)) & \" \" & INDEX(labels!A56:C56,1,MATCH(PP_Language,labels!A1:C1,0)) & \" \" & BasisOfPreparationAxis & \"  {\"&COLUMN(D1112)&\"}\"","v":"/notes-remuneration-executive-senior-officials-from13month-previous-specification De naam (bestaande uit de voorletters en achternaam) van de topfunctionaris Enkelvoudig Commercial  {4}"},{"$f":"\"/notes-remuneration-executive-senior-officials-from13month-previous-specification \" & INDEX(labels!A637:C637,1,MATCH(PP_Language,labels!A1:C1,0)) & \" \" & INDEX(labels!A56:C56,1,MATCH(PP_Language,labels!A1:C1,0)) & \" \" & BasisOfPreparationAxis & \"  {\"&COLUMN(E1112)&\"}\"","v":"/notes-remuneration-executive-senior-officials-from13month-previous-specification De naam (bestaande uit de voorletters en achternaam) van de topfunctionaris Enkelvoudig Commercial  {5}"},{"$f":"\"/notes-remuneration-executive-senior-officials-from13month-previous-specification \" & INDEX(labels!A637:C637,1,MATCH(PP_Language,labels!A1:C1,0)) & \" \" & INDEX(labels!A56:C56,1,MATCH(PP_Language,labels!A1:C1,0)) & \" \" & BasisOfPreparationAxis & \"  {\"&COLUMN(F1112)&\"}\"","v":"/notes-remuneration-executive-senior-officials-from13month-previous-specification De naam (bestaande uit de voorletters en achternaam) van de topfunctionaris Enkelvoudig Commercial  {6}"},{"$f":"\"/notes-remuneration-executive-senior-officials-from13month-previous-specification \" & INDEX(labels!A637:C637,1,MATCH(PP_Language,labels!A1:C1,0)) & \" \" & INDEX(labels!A56:C56,1,MATCH(PP_Language,labels!A1:C1,0)) & \" \" & BasisOfPreparationAxis & \"  {\"&COLUMN(G1112)&\"}\"","v":"/notes-remuneration-executive-senior-officials-from13month-previous-specification De naam (bestaande uit de voorletters en achternaam) van de topfunctionaris Enkelvoudig Commercial  {7}"},{"$f":"\"/notes-remuneration-executive-senior-officials-from13month-previous-specification \" & INDEX(labels!A637:C637,1,MATCH(PP_Language,labels!A1:C1,0)) & \" \" & INDEX(labels!A56:C56,1,MATCH(PP_Language,labels!A1:C1,0)) & \" \" & BasisOfPreparationAxis & \"  {\"&COLUMN(H1112)&\"}\"","v":"/notes-remuneration-executive-senior-officials-from13month-previous-specification De naam (bestaande uit de voorletters en achternaam) van de topfunctionaris Enkelvoudig Commercial  {8}"}]
["",{"$f":"INDEX(labels!A664:C664,1,MATCH(PP_Language,labels!A1:C1,0))","v":"Omschrijving De naam (bestaande uit de voorletters en achternaam) van de topfunctionaris"}]
["",{"$f":"INDEX(labels!A639:C639,1,MATCH(PP_Language,labels!A1:C1,0))","v":"Functie(s)"},""]
["",{"$f":"INDEX(labels!A655:C655,1,MATCH(PP_Language,labels!A1:C1,0))","v":"Aanvang functievervulling"},""]
["",{"$f":"INDEX(labels!A656:C656,1,MATCH(PP_Language,labels!A1:C1,0))","v":"Einde functievervulling"},""]
["",{"$f":"INDEX(labels!A640:C640,1,MATCH(PP_Language,labels!A1:C1,0))","v":"Omvang van het dienstverband uitgedrukt als deeltijdfactor in FTE"},""]
["",{"$f":"INDEX(labels!A657:C657,1,MATCH(PP_Language,labels!A1:C1,0))","v":"Dienstbetrekking?"},""]
["",{"$f":"INDEX(labels!A658:C658,1,MATCH(PP_Language,labels!A1:C1,0))","v":"Beloning plus belastbare onkostenvergoedingen"},"-"]
["",{"$f":"INDEX(labels!A659:C659,1,MATCH(PP_Language,labels!A1:C1,0))","v":"Beloningen betaalbaar op termijn"},"-"]
[""]
["",{"$f":"INDEX(labels!A660:C660,1,MATCH(PP_Language,labels!A1:C1,0))","v":"Subtotaal"},"-"]
["",{"$f":"INDEX(labels!A661:C661,1,MATCH(PP_Language,labels!A1:C1,0))","v":"Individueel toepasselijke bezoldigingsmaximum"},"-"]
["",{"$f":"INDEX(labels!A662:C662,1,MATCH(PP_Language,labels!A1:C1,0))","v":"Bezoldiging"},"-"]
["",{"$f":"INDEX(labels!A141:C141,1,MATCH(PP_Language,labels!A1:C1,0))","v":"Presentatievolgorde"},""]
[""]
["",null,null,null,null,null,null,null,null,null,null,null,null,null,null,null,null,null,null,null,null,null,null,null,null,{"$f":"\"//notes-remuneration-executive-senior-officials-from13month-previous-specification label {\"&COLUMN(B1127)&\"}\"","v":"//notes-remuneration-executive-senior-officials-from13month-previous-specification label {2}"},null,{"$f":"\"//notes-remuneration-executive-senior-officials-from13month-previous-specification \" & INDEX(labels!A637:C637,1,MATCH(PP_Language,labels!A1:C1,0)) & \" \" & INDEX(labels!A56:C56,1,MATCH(PP_Language,labels!A1:C1,0)) & \" \" & BasisOfPreparationAxis & \"  {\"&COLUMN(D1127)&\"}\"","v":"//notes-remuneration-executive-senior-officials-from13month-previous-specification De naam (bestaande uit de voorletters en achternaam) van de topfunctionaris Enkelvoudig Commercial  {4}"},{"$f":"\"//notes-remuneration-executive-senior-officials-from13month-previous-specification \" & INDEX(labels!A637:C637,1,MATCH(PP_Language,labels!A1:C1,0)) & \" \" & INDEX(labels!A56:C56,1,MATCH(PP_Language,labels!A1:C1,0)) & \" \" & BasisOfPreparationAxis & \"  {\"&COLUMN(E1127)&\"}\"","v":"//notes-remuneration-executive-senior-officials-from13month-previous-specification De naam (bestaande uit de voorletters en achternaam) van de topfunctionaris Enkelvoudig Commercial  {5}"},{"$f":"\"//notes-remuneration-executive-senior-officials-from13month-previous-specification \" & INDEX(labels!A637:C637,1,MATCH(PP_Language,labels!A1:C1,0)) & \" \" & INDEX(labels!A56:C56,1,MATCH(PP_Language,labels!A1:C1,0)) & \" \" & BasisOfPreparationAxis & \"  {\"&COLUMN(F1127)&\"}\"","v":"//notes-remuneration-executive-senior-officials-from13month-previous-specification De naam (bestaande uit de voorletters en achternaam) van de topfunctionaris Enkelvoudig Commercial  {6}"},{"$f":"\"//notes-remuneration-executive-senior-officials-from13month-previous-specification \" & INDEX(labels!A637:C637,1,MATCH(PP_Language,labels!A1:C1,0)) & \" \" & INDEX(labels!A56:C56,1,MATCH(PP_Language,labels!A1:C1,0)) & \" \" & BasisOfPreparationAxis & \"  {\"&COLUMN(G1127)&\"}\"","v":"//notes-remuneration-executive-senior-officials-from13month-previous-specification De naam (bestaande uit de voorletters en achternaam) van de topfunctionaris Enkelvoudig Commercial  {7}"},{"$f":"\"//notes-remuneration-executive-senior-officials-from13month-previous-specification \" & INDEX(labels!A637:C637,1,MATCH(PP_Language,labels!A1:C1,0)) & \" \" & INDEX(labels!A56:C56,1,MATCH(PP_Language,labels!A1:C1,0)) & \" \" & BasisOfPreparationAxis & \"  {\"&COLUMN(H1127)&\"}\"","v":"//notes-remuneration-executive-senior-officials-from13month-previous-specification De naam (bestaande uit de voorletters en achternaam) van de topfunctionaris Enkelvoudig Commercial  {8}"}]
["",{"$f":"INDEX(labels!A665:C665,1,MATCH(PP_Language,labels!A1:C1,0))","v":"Toelichting op de jaarrekening - Bezoldiging van leidinggevende topfunctionarissen zonder dienstbetrekking in periode tot en met de 12e maand: Specificatie"}]
["",null,null,{"$f":"INDEX(labels!A55:C55,1,MATCH(PP_Language,labels!A1:C1,0))","v":"Huidig"}]
[""]
["",null,null,{"$f":"\" \"  & INDEX(labels!A637:C637,1,MATCH(PP_Language,labels!A1:C1,0)) &  \"  \"  & INDEX(labels!A56:C56,1,MATCH(PP_Language,labels!A1:C1,0)) &  \" \"","v":" De naam (bestaande uit de voorletters en achternaam) van de topfunctionaris  Enkelvoudig "},{"$f":"\" \"  & INDEX(labels!A637:C637,1,MATCH(PP_Language,labels!A1:C1,0)) &  \"  \"  & INDEX(labels!A56:C56,1,MATCH(PP_Language,labels!A1:C1,0)) &  \" \"","v":" De naam (bestaande uit de voorletters en achternaam) van de topfunctionaris  Enkelvoudig "},{"$f":"\" \"  & INDEX(labels!A637:C637,1,MATCH(PP_Language,labels!A1:C1,0)) &  \"  \"  & INDEX(labels!A56:C56,1,MATCH(PP_Language,labels!A1:C1,0)) &  \" \"","v":" De naam (bestaande uit de voorletters en achternaam) van de topfunctionaris  Enkelvoudig "},{"$f":"\" \"  & INDEX(labels!A637:C637,1,MATCH(PP_Language,labels!A1:C1,0)) &  \"  \"  & INDEX(labels!A56:C56,1,MATCH(PP_Language,labels!A1:C1,0)) &  \" \"","v":" De naam (bestaande uit de voorletters en achternaam) van de topfunctionaris  Enkelvoudig "},{"$f":"\" \"  & INDEX(labels!A637:C637,1,MATCH(PP_Language,labels!A1:C1,0)) &  \"  \"  & INDEX(labels!A56:C56,1,MATCH(PP_Language,labels!A1:C1,0)) &  \" \"","v":" De naam (bestaande uit de voorletters en achternaam) van de topfunctionaris  Enkelvoudig "},null,null,null,null,null,null,null,null,null,null,null,null,null,null,null,null,null,{"$f":"\"/notes-remuneration-executive-senior-officials-without-employment12months-specification label {\"&COLUMN(B1131)&\"}\"","v":"/notes-remuneration-executive-senior-officials-without-employment12months-specification label {2}"},null,{"$f":"\"/notes-remuneration-executive-senior-officials-without-employment12months-specification \" & INDEX(labels!A637:C637,1,MATCH(PP_Language,labels!A1:C1,0)) & \" \" & INDEX(labels!A56:C56,1,MATCH(PP_Language,labels!A1:C1,0)) & \" \" & BasisOfPreparationAxis & \"  {\"&COLUMN(D1131)&\"}\"","v":"/notes-remuneration-executive-senior-officials-without-employment12months-specification De naam (bestaande uit de voorletters en achternaam) van de topfunctionaris Enkelvoudig Commercial  {4}"},{"$f":"\"/notes-remuneration-executive-senior-officials-without-employment12months-specification \" & INDEX(labels!A637:C637,1,MATCH(PP_Language,labels!A1:C1,0)) & \" \" & INDEX(labels!A56:C56,1,MATCH(PP_Language,labels!A1:C1,0)) & \" \" & BasisOfPreparationAxis & \"  {\"&COLUMN(E1131)&\"}\"","v":"/notes-remuneration-executive-senior-officials-without-employment12months-specification De naam (bestaande uit de voorletters en achternaam) van de topfunctionaris Enkelvoudig Commercial  {5}"},{"$f":"\"/notes-remuneration-executive-senior-officials-without-employment12months-specification \" & INDEX(labels!A637:C637,1,MATCH(PP_Language,labels!A1:C1,0)) & \" \" & INDEX(labels!A56:C56,1,MATCH(PP_Language,labels!A1:C1,0)) & \" \" & BasisOfPreparationAxis & \"  {\"&COLUMN(F1131)&\"}\"","v":"/notes-remuneration-executive-senior-officials-without-employment12months-specification De naam (bestaande uit de voorletters en achternaam) van de topfunctionaris Enkelvoudig Commercial  {6}"},{"$f":"\"/notes-remuneration-executive-senior-officials-without-employment12months-specification \" & INDEX(labels!A637:C637,1,MATCH(PP_Language,labels!A1:C1,0)) & \" \" & INDEX(labels!A56:C56,1,MATCH(PP_Language,labels!A1:C1,0)) & \" \" & BasisOfPreparationAxis & \"  {\"&COLUMN(G1131)&\"}\"","v":"/notes-remuneration-executive-senior-officials-without-employment12months-specification De naam (bestaande uit de voorletters en achternaam) van de topfunctionaris Enkelvoudig Commercial  {7}"},{"$f":"\"/notes-remuneration-executive-senior-officials-without-employment12months-specification \" & INDEX(labels!A637:C637,1,MATCH(PP_Language,labels!A1:C1,0)) & \" \" & INDEX(labels!A56:C56,1,MATCH(PP_Language,labels!A1:C1,0)) & \" \" & BasisOfPreparationAxis & \"  {\"&COLUMN(H1131)&\"}\"","v":"/notes-remuneration-executive-senior-officials-without-employment12months-specification De naam (bestaande uit de voorletters en achternaam) van de topfunctionaris Enkelvoudig Commercial  {8}"}]
["",{"$f":"INDEX(labels!A666:C666,1,MATCH(PP_Language,labels!A1:C1,0))","v":"Omschrijving De naam (bestaande uit de voorletters en achternaam) van de topfunctionaris"}]
["",{"$f":"INDEX(labels!A639:C639,1,MATCH(PP_Language,labels!A1:C1,0))","v":"Functie(s)"},""]
["",{"$f":"INDEX(labels!A667:C667,1,MATCH(PP_Language,labels!A1:C1,0))","v":"Kalenderjaar"},""]
["",{"$f":"INDEX(labels!A668:C668,1,MATCH(PP_Language,labels!A1:C1,0))","v":"Aanvang functievervulling in het kalenderjaar"},""]
["",{"$f":"INDEX(labels!A669:C669,1,MATCH(PP_Language,labels!A1:C1,0))","v":"Einde functievervulling in het kalenderjaar"},""]
["",{"$f":"INDEX(labels!A670:C670,1,MATCH(PP_Language,labels!A1:C1,0))","v":"Aantal maanden van functievervulling in het kalenderjaar"},""]
["",{"$f":"INDEX(labels!A671:C671,1,MATCH(PP_Language,labels!A1:C1,0))","v":"Omvang van het dienstverband in uren per kalenderjaar"},""]
["",{"$f":"INDEX(labels!A672:C672,1,MATCH(PP_Language,labels!A1:C1,0))","v":"Maximum uurtarief in het kalenderjaar"},"-"]
["",{"$f":"INDEX(labels!A673:C673,1,MATCH(PP_Language,labels!A1:C1,0))","v":"Maxima op basis van de normbedragen per maand"},"-"]
["",{"$f":"INDEX(labels!A674:C674,1,MATCH(PP_Language,labels!A1:C1,0))","v":"Individueel toepasselijke maximum gehele periode kalendermaand 1 t/m 12"},"-"]
["",{"$f":"INDEX(labels!A675:C675,1,MATCH(PP_Language,labels!A1:C1,0))","v":"Bezoldiging in de betreffende periode"},"-"]
["",{"$f":"INDEX(labels!A676:C676,1,MATCH(PP_Language,labels!A1:C1,0))","v":"Totale bezoldiging gehele periode kalendermaand 1 t/m 12"},"-"]
["",{"$f":"INDEX(labels!A646:C646,1,MATCH(PP_Language,labels!A1:C1,0))","v":"Onverschuldigd betaald en nog niet terugontvangen bedrag"},"+"]
["",{"$f":"INDEX(labels!A662:C662,1,MATCH(PP_Language,labels!A1:C1,0))","v":"Bezoldiging"},"-"]
["",{"$f":"INDEX(labels!A647:C647,1,MATCH(PP_Language,labels!A1:C1,0))","v":"Het bedrag van de overschrijding"},"-"]
["",{"$f":"INDEX(labels!A648:C648,1,MATCH(PP_Language,labels!A1:C1,0))","v":"Reden waarom de overschrijding al dan niet is toegestaan"},""]
["",{"$f":"INDEX(labels!A649:C649,1,MATCH(PP_Language,labels!A1:C1,0))","v":"Toelichting op de vordering wegens onverschuldigde betaling"},""]
["",{"$f":"INDEX(labels!A650:C650,1,MATCH(PP_Language,labels!A1:C1,0))","v":"Foutenherstel in verantwoording WNT"},""]
["",{"$f":"INDEX(labels!A651:C651,1,MATCH(PP_Language,labels!A1:C1,0))","v":"Toelichting op verschil en oorzaak foutenherstel"},""]
["",{"$f":"INDEX(labels!A141:C141,1,MATCH(PP_Language,labels!A1:C1,0))","v":"Presentatievolgorde"},""]
[""]
["",null,null,null,null,null,null,null,null,null,null,null,null,null,null,null,null,null,null,null,null,null,null,null,null,{"$f":"\"//notes-remuneration-executive-senior-officials-without-employment12months-specification label {\"&COLUMN(B1153)&\"}\"","v":"//notes-remuneration-executive-senior-officials-without-employment12months-specification label {2}"},null,{"$f":"\"//notes-remuneration-executive-senior-officials-without-employment12months-specification \" & INDEX(labels!A637:C637,1,MATCH(PP_Language,labels!A1:C1,0)) & \" \" & INDEX(labels!A56:C56,1,MATCH(PP_Language,labels!A1:C1,0)) & \" \" & BasisOfPreparationAxis & \"  {\"&COLUMN(D1153)&\"}\"","v":"//notes-remuneration-executive-senior-officials-without-employment12months-specification De naam (bestaande uit de voorletters en achternaam) van de topfunctionaris Enkelvoudig Commercial  {4}"},{"$f":"\"//notes-remuneration-executive-senior-officials-without-employment12months-specification \" & INDEX(labels!A637:C637,1,MATCH(PP_Language,labels!A1:C1,0)) & \" \" & INDEX(labels!A56:C56,1,MATCH(PP_Language,labels!A1:C1,0)) & \" \" & BasisOfPreparationAxis & \"  {\"&COLUMN(E1153)&\"}\"","v":"//notes-remuneration-executive-senior-officials-without-employment12months-specification De naam (bestaande uit de voorletters en achternaam) van de topfunctionaris Enkelvoudig Commercial  {5}"},{"$f":"\"//notes-remuneration-executive-senior-officials-without-employment12months-specification \" & INDEX(labels!A637:C637,1,MATCH(PP_Language,labels!A1:C1,0)) & \" \" & INDEX(labels!A56:C56,1,MATCH(PP_Language,labels!A1:C1,0)) & \" \" & BasisOfPreparationAxis & \"  {\"&COLUMN(F1153)&\"}\"","v":"//notes-remuneration-executive-senior-officials-without-employment12months-specification De naam (bestaande uit de voorletters en achternaam) van de topfunctionaris Enkelvoudig Commercial  {6}"},{"$f":"\"//notes-remuneration-executive-senior-officials-without-employment12months-specification \" & INDEX(labels!A637:C637,1,MATCH(PP_Language,labels!A1:C1,0)) & \" \" & INDEX(labels!A56:C56,1,MATCH(PP_Language,labels!A1:C1,0)) & \" \" & BasisOfPreparationAxis & \"  {\"&COLUMN(G1153)&\"}\"","v":"//notes-remuneration-executive-senior-officials-without-employment12months-specification De naam (bestaande uit de voorletters en achternaam) van de topfunctionaris Enkelvoudig Commercial  {7}"},{"$f":"\"//notes-remuneration-executive-senior-officials-without-employment12months-specification \" & INDEX(labels!A637:C637,1,MATCH(PP_Language,labels!A1:C1,0)) & \" \" & INDEX(labels!A56:C56,1,MATCH(PP_Language,labels!A1:C1,0)) & \" \" & BasisOfPreparationAxis & \"  {\"&COLUMN(H1153)&\"}\"","v":"//notes-remuneration-executive-senior-officials-without-employment12months-specification De naam (bestaande uit de voorletters en achternaam) van de topfunctionaris Enkelvoudig Commercial  {8}"}]
["",{"$f":"INDEX(labels!A677:C677,1,MATCH(PP_Language,labels!A1:C1,0))","v":"Toelichting op de jaarrekening - Bezoldiging van leidinggevende topfunctionarissen zonder dienstbetrekking in periode tot en met de 12e maand, voorgaande periode: Specificatie"}]
["",null,null,{"$f":"INDEX(labels!A57:C57,1,MATCH(PP_Language,labels!A1:C1,0))","v":"Voorgaand"}]
[""]
["",null,null,{"$f":"\" \"  & INDEX(labels!A637:C637,1,MATCH(PP_Language,labels!A1:C1,0)) &  \"  \"  & INDEX(labels!A56:C56,1,MATCH(PP_Language,labels!A1:C1,0)) &  \" \"","v":" De naam (bestaande uit de voorletters en achternaam) van de topfunctionaris  Enkelvoudig "},{"$f":"\" \"  & INDEX(labels!A637:C637,1,MATCH(PP_Language,labels!A1:C1,0)) &  \"  \"  & INDEX(labels!A56:C56,1,MATCH(PP_Language,labels!A1:C1,0)) &  \" \"","v":" De naam (bestaande uit de voorletters en achternaam) van de topfunctionaris  Enkelvoudig "},{"$f":"\" \"  & INDEX(labels!A637:C637,1,MATCH(PP_Language,labels!A1:C1,0)) &  \"  \"  & INDEX(labels!A56:C56,1,MATCH(PP_Language,labels!A1:C1,0)) &  \" \"","v":" De naam (bestaande uit de voorletters en achternaam) van de topfunctionaris  Enkelvoudig "},{"$f":"\" \"  & INDEX(labels!A637:C637,1,MATCH(PP_Language,labels!A1:C1,0)) &  \"  \"  & INDEX(labels!A56:C56,1,MATCH(PP_Language,labels!A1:C1,0)) &  \" \"","v":" De naam (bestaande uit de voorletters en achternaam) van de topfunctionaris  Enkelvoudig "},{"$f":"\" \"  & INDEX(labels!A637:C637,1,MATCH(PP_Language,labels!A1:C1,0)) &  \"  \"  & INDEX(labels!A56:C56,1,MATCH(PP_Language,labels!A1:C1,0)) &  \" \"","v":" De naam (bestaande uit de voorletters en achternaam) van de topfunctionaris  Enkelvoudig "},null,null,null,null,null,null,null,null,null,null,null,null,null,null,null,null,null,{"$f":"\"/notes-remuneration-executive-senior-officials-without-employment12months-previous-specification label {\"&COLUMN(B1157)&\"}\"","v":"/notes-remuneration-executive-senior-officials-without-employment12months-previous-specification label {2}"},null,{"$f":"\"/notes-remuneration-executive-senior-officials-without-employment12months-previous-specification \" & INDEX(labels!A637:C637,1,MATCH(PP_Language,labels!A1:C1,0)) & \" \" & INDEX(labels!A56:C56,1,MATCH(PP_Language,labels!A1:C1,0)) & \" \" & BasisOfPreparationAxis & \"  {\"&COLUMN(D1157)&\"}\"","v":"/notes-remuneration-executive-senior-officials-without-employment12months-previous-specification De naam (bestaande uit de voorletters en achternaam) van de topfunctionaris Enkelvoudig Commercial  {4}"},{"$f":"\"/notes-remuneration-executive-senior-officials-without-employment12months-previous-specification \" & INDEX(labels!A637:C637,1,MATCH(PP_Language,labels!A1:C1,0)) & \" \" & INDEX(labels!A56:C56,1,MATCH(PP_Language,labels!A1:C1,0)) & \" \" & BasisOfPreparationAxis & \"  {\"&COLUMN(E1157)&\"}\"","v":"/notes-remuneration-executive-senior-officials-without-employment12months-previous-specification De naam (bestaande uit de voorletters en achternaam) van de topfunctionaris Enkelvoudig Commercial  {5}"},{"$f":"\"/notes-remuneration-executive-senior-officials-without-employment12months-previous-specification \" & INDEX(labels!A637:C637,1,MATCH(PP_Language,labels!A1:C1,0)) & \" \" & INDEX(labels!A56:C56,1,MATCH(PP_Language,labels!A1:C1,0)) & \" \" & BasisOfPreparationAxis & \"  {\"&COLUMN(F1157)&\"}\"","v":"/notes-remuneration-executive-senior-officials-without-employment12months-previous-specification De naam (bestaande uit de voorletters en achternaam) van de topfunctionaris Enkelvoudig Commercial  {6}"},{"$f":"\"/notes-remuneration-executive-senior-officials-without-employment12months-previous-specification \" & INDEX(labels!A637:C637,1,MATCH(PP_Language,labels!A1:C1,0)) & \" \" & INDEX(labels!A56:C56,1,MATCH(PP_Language,labels!A1:C1,0)) & \" \" & BasisOfPreparationAxis & \"  {\"&COLUMN(G1157)&\"}\"","v":"/notes-remuneration-executive-senior-officials-without-employment12months-previous-specification De naam (bestaande uit de voorletters en achternaam) van de topfunctionaris Enkelvoudig Commercial  {7}"},{"$f":"\"/notes-remuneration-executive-senior-officials-without-employment12months-previous-specification \" & INDEX(labels!A637:C637,1,MATCH(PP_Language,labels!A1:C1,0)) & \" \" & INDEX(labels!A56:C56,1,MATCH(PP_Language,labels!A1:C1,0)) & \" \" & BasisOfPreparationAxis & \"  {\"&COLUMN(H1157)&\"}\"","v":"/notes-remuneration-executive-senior-officials-without-employment12months-previous-specification De naam (bestaande uit de voorletters en achternaam) van de topfunctionaris Enkelvoudig Commercial  {8}"}]
["",{"$f":"INDEX(labels!A678:C678,1,MATCH(PP_Language,labels!A1:C1,0))","v":"Omschrijving De naam (bestaande uit de voorletters en achternaam) van de topfunctionaris"}]
["",{"$f":"INDEX(labels!A639:C639,1,MATCH(PP_Language,labels!A1:C1,0))","v":"Functie(s)"},""]
["",{"$f":"INDEX(labels!A667:C667,1,MATCH(PP_Language,labels!A1:C1,0))","v":"Kalenderjaar"},""]
["",{"$f":"INDEX(labels!A668:C668,1,MATCH(PP_Language,labels!A1:C1,0))","v":"Aanvang functievervulling in het kalenderjaar"},""]
["",{"$f":"INDEX(labels!A669:C669,1,MATCH(PP_Language,labels!A1:C1,0))","v":"Einde functievervulling in het kalenderjaar"},""]
["",{"$f":"INDEX(labels!A670:C670,1,MATCH(PP_Language,labels!A1:C1,0))","v":"Aantal maanden van functievervulling in het kalenderjaar"},""]
["",{"$f":"INDEX(labels!A671:C671,1,MATCH(PP_Language,labels!A1:C1,0))","v":"Omvang van het dienstverband in uren per kalenderjaar"},""]
["",{"$f":"INDEX(labels!A672:C672,1,MATCH(PP_Language,labels!A1:C1,0))","v":"Maximum uurtarief in het kalenderjaar"},"-"]
["",{"$f":"INDEX(labels!A673:C673,1,MATCH(PP_Language,labels!A1:C1,0))","v":"Maxima op basis van de normbedragen per maand"},"-"]
["",{"$f":"INDEX(labels!A674:C674,1,MATCH(PP_Language,labels!A1:C1,0))","v":"Individueel toepasselijke maximum gehele periode kalendermaand 1 t/m 12"},"-"]
["",{"$f":"INDEX(labels!A675:C675,1,MATCH(PP_Language,labels!A1:C1,0))","v":"Bezoldiging in de betreffende periode"},"-"]
["",{"$f":"INDEX(labels!A676:C676,1,MATCH(PP_Language,labels!A1:C1,0))","v":"Totale bezoldiging gehele periode kalendermaand 1 t/m 12"},"-"]
["",{"$f":"INDEX(labels!A646:C646,1,MATCH(PP_Language,labels!A1:C1,0))","v":"Onverschuldigd betaald en nog niet terugontvangen bedrag"},"+"]
["",{"$f":"INDEX(labels!A662:C662,1,MATCH(PP_Language,labels!A1:C1,0))","v":"Bezoldiging"},"-"]
["",{"$f":"INDEX(labels!A647:C647,1,MATCH(PP_Language,labels!A1:C1,0))","v":"Het bedrag van de overschrijding"},"-"]
["",{"$f":"INDEX(labels!A648:C648,1,MATCH(PP_Language,labels!A1:C1,0))","v":"Reden waarom de overschrijding al dan niet is toegestaan"},""]
["",{"$f":"INDEX(labels!A649:C649,1,MATCH(PP_Language,labels!A1:C1,0))","v":"Toelichting op de vordering wegens onverschuldigde betaling"},""]
["",{"$f":"INDEX(labels!A650:C650,1,MATCH(PP_Language,labels!A1:C1,0))","v":"Foutenherstel in verantwoording WNT"},""]
["",{"$f":"INDEX(labels!A651:C651,1,MATCH(PP_Language,labels!A1:C1,0))","v":"Toelichting op verschil en oorzaak foutenherstel"},""]
["",{"$f":"INDEX(labels!A141:C141,1,MATCH(PP_Language,labels!A1:C1,0))","v":"Presentatievolgorde"},""]
[""]
["",null,null,null,null,null,null,null,null,null,null,null,null,null,null,null,null,null,null,null,null,null,null,null,null,{"$f":"\"//notes-remuneration-executive-senior-officials-without-employment12months-previous-specification label {\"&COLUMN(B1179)&\"}\"","v":"//notes-remuneration-executive-senior-officials-without-employment12months-previous-specification label {2}"},null,{"$f":"\"//notes-remuneration-executive-senior-officials-without-employment12months-previous-specification \" & INDEX(labels!A637:C637,1,MATCH(PP_Language,labels!A1:C1,0)) & \" \" & INDEX(labels!A56:C56,1,MATCH(PP_Language,labels!A1:C1,0)) & \" \" & BasisOfPreparationAxis & \"  {\"&COLUMN(D1179)&\"}\"","v":"//notes-remuneration-executive-senior-officials-without-employment12months-previous-specification De naam (bestaande uit de voorletters en achternaam) van de topfunctionaris Enkelvoudig Commercial  {4}"},{"$f":"\"//notes-remuneration-executive-senior-officials-without-employment12months-previous-specification \" & INDEX(labels!A637:C637,1,MATCH(PP_Language,labels!A1:C1,0)) & \" \" & INDEX(labels!A56:C56,1,MATCH(PP_Language,labels!A1:C1,0)) & \" \" & BasisOfPreparationAxis & \"  {\"&COLUMN(E1179)&\"}\"","v":"//notes-remuneration-executive-senior-officials-without-employment12months-previous-specification De naam (bestaande uit de voorletters en achternaam) van de topfunctionaris Enkelvoudig Commercial  {5}"},{"$f":"\"//notes-remuneration-executive-senior-officials-without-employment12months-previous-specification \" & INDEX(labels!A637:C637,1,MATCH(PP_Language,labels!A1:C1,0)) & \" \" & INDEX(labels!A56:C56,1,MATCH(PP_Language,labels!A1:C1,0)) & \" \" & BasisOfPreparationAxis & \"  {\"&COLUMN(F1179)&\"}\"","v":"//notes-remuneration-executive-senior-officials-without-employment12months-previous-specification De naam (bestaande uit de voorletters en achternaam) van de topfunctionaris Enkelvoudig Commercial  {6}"},{"$f":"\"//notes-remuneration-executive-senior-officials-without-employment12months-previous-specification \" & INDEX(labels!A637:C637,1,MATCH(PP_Language,labels!A1:C1,0)) & \" \" & INDEX(labels!A56:C56,1,MATCH(PP_Language,labels!A1:C1,0)) & \" \" & BasisOfPreparationAxis & \"  {\"&COLUMN(G1179)&\"}\"","v":"//notes-remuneration-executive-senior-officials-without-employment12months-previous-specification De naam (bestaande uit de voorletters en achternaam) van de topfunctionaris Enkelvoudig Commercial  {7}"},{"$f":"\"//notes-remuneration-executive-senior-officials-without-employment12months-previous-specification \" & INDEX(labels!A637:C637,1,MATCH(PP_Language,labels!A1:C1,0)) & \" \" & INDEX(labels!A56:C56,1,MATCH(PP_Language,labels!A1:C1,0)) & \" \" & BasisOfPreparationAxis & \"  {\"&COLUMN(H1179)&\"}\"","v":"//notes-remuneration-executive-senior-officials-without-employment12months-previous-specification De naam (bestaande uit de voorletters en achternaam) van de topfunctionaris Enkelvoudig Commercial  {8}"}]
["",{"$f":"INDEX(labels!A679:C679,1,MATCH(PP_Language,labels!A1:C1,0))","v":"Toelichting op de jaarrekening - Bezoldiging van niet-topfunctionarissen: Specificatie"}]
["",null,null,{"$f":"INDEX(labels!A55:C55,1,MATCH(PP_Language,labels!A1:C1,0))","v":"Huidig"}]
[""]
["",null,null,{"$f":"\" \"  & INDEX(labels!A680:C680,1,MATCH(PP_Language,labels!A1:C1,0)) &  \"  \"  & INDEX(labels!A56:C56,1,MATCH(PP_Language,labels!A1:C1,0)) &  \" \"","v":" Beschrijving van de functie van de niet-topfunctionaris  Enkelvoudig "},{"$f":"\" \"  & INDEX(labels!A680:C680,1,MATCH(PP_Language,labels!A1:C1,0)) &  \"  \"  & INDEX(labels!A56:C56,1,MATCH(PP_Language,labels!A1:C1,0)) &  \" \"","v":" Beschrijving van de functie van de niet-topfunctionaris  Enkelvoudig "},{"$f":"\" \"  & INDEX(labels!A680:C680,1,MATCH(PP_Language,labels!A1:C1,0)) &  \"  \"  & INDEX(labels!A56:C56,1,MATCH(PP_Language,labels!A1:C1,0)) &  \" \"","v":" Beschrijving van de functie van de niet-topfunctionaris  Enkelvoudig "},{"$f":"\" \"  & INDEX(labels!A680:C680,1,MATCH(PP_Language,labels!A1:C1,0)) &  \"  \"  & INDEX(labels!A56:C56,1,MATCH(PP_Language,labels!A1:C1,0)) &  \" \"","v":" Beschrijving van de functie van de niet-topfunctionaris  Enkelvoudig "},{"$f":"\" \"  & INDEX(labels!A680:C680,1,MATCH(PP_Language,labels!A1:C1,0)) &  \"  \"  & INDEX(labels!A56:C56,1,MATCH(PP_Language,labels!A1:C1,0)) &  \" \"","v":" Beschrijving van de functie van de niet-topfunctionaris  Enkelvoudig "},null,null,null,null,null,null,null,null,null,null,null,null,null,null,null,null,null,{"$f":"\"/notes-remuneration-of-non-senior-officials-specification label {\"&COLUMN(B1183)&\"}\"","v":"/notes-remuneration-of-non-senior-officials-specification label {2}"},null,{"$f":"\"/notes-remuneration-of-non-senior-officials-specification \" & INDEX(labels!A680:C680,1,MATCH(PP_Language,labels!A1:C1,0)) & \" \" & INDEX(labels!A56:C56,1,MATCH(PP_Language,labels!A1:C1,0)) & \" \" & BasisOfPreparationAxis & \"  {\"&COLUMN(D1183)&\"}\"","v":"/notes-remuneration-of-non-senior-officials-specification Beschrijving van de functie van de niet-topfunctionaris Enkelvoudig Commercial  {4}"},{"$f":"\"/notes-remuneration-of-non-senior-officials-specification \" & INDEX(labels!A680:C680,1,MATCH(PP_Language,labels!A1:C1,0)) & \" \" & INDEX(labels!A56:C56,1,MATCH(PP_Language,labels!A1:C1,0)) & \" \" & BasisOfPreparationAxis & \"  {\"&COLUMN(E1183)&\"}\"","v":"/notes-remuneration-of-non-senior-officials-specification Beschrijving van de functie van de niet-topfunctionaris Enkelvoudig Commercial  {5}"},{"$f":"\"/notes-remuneration-of-non-senior-officials-specification \" & INDEX(labels!A680:C680,1,MATCH(PP_Language,labels!A1:C1,0)) & \" \" & INDEX(labels!A56:C56,1,MATCH(PP_Language,labels!A1:C1,0)) & \" \" & BasisOfPreparationAxis & \"  {\"&COLUMN(F1183)&\"}\"","v":"/notes-remuneration-of-non-senior-officials-specification Beschrijving van de functie van de niet-topfunctionaris Enkelvoudig Commercial  {6}"},{"$f":"\"/notes-remuneration-of-non-senior-officials-specification \" & INDEX(labels!A680:C680,1,MATCH(PP_Language,labels!A1:C1,0)) & \" \" & INDEX(labels!A56:C56,1,MATCH(PP_Language,labels!A1:C1,0)) & \" \" & BasisOfPreparationAxis & \"  {\"&COLUMN(G1183)&\"}\"","v":"/notes-remuneration-of-non-senior-officials-specification Beschrijving van de functie van de niet-topfunctionaris Enkelvoudig Commercial  {7}"},{"$f":"\"/notes-remuneration-of-non-senior-officials-specification \" & INDEX(labels!A680:C680,1,MATCH(PP_Language,labels!A1:C1,0)) & \" \" & INDEX(labels!A56:C56,1,MATCH(PP_Language,labels!A1:C1,0)) & \" \" & BasisOfPreparationAxis & \"  {\"&COLUMN(H1183)&\"}\"","v":"/notes-remuneration-of-non-senior-officials-specification Beschrijving van de functie van de niet-topfunctionaris Enkelvoudig Commercial  {8}"}]
["",{"$f":"INDEX(labels!A681:C681,1,MATCH(PP_Language,labels!A1:C1,0))","v":"Omschrijving Beschrijving van de functie van de niet-topfunctionaris"}]
["",{"$f":"INDEX(labels!A640:C640,1,MATCH(PP_Language,labels!A1:C1,0))","v":"Omvang van het dienstverband uitgedrukt als deeltijdfactor in FTE"},""]
["",{"$f":"INDEX(labels!A658:C658,1,MATCH(PP_Language,labels!A1:C1,0))","v":"Beloning plus belastbare onkostenvergoedingen"},"-"]
["",{"$f":"INDEX(labels!A659:C659,1,MATCH(PP_Language,labels!A1:C1,0))","v":"Beloningen betaalbaar op termijn"},"-"]
[""]
["",{"$f":"INDEX(labels!A682:C682,1,MATCH(PP_Language,labels!A1:C1,0))","v":"Totaal van bezoldiging"},"-",{"$f":"IF(OR(NOT(0=0),NOT(AND(Stamdata!D1188=\"\",Stamdata!D1189=\"\"))), + SUM(Stamdata!D1188,Stamdata!D1189),\"\")","v":""},{"$f":"IF(OR(NOT(0=0),NOT(AND(Stamdata!E1188=\"\",Stamdata!E1189=\"\"))), + SUM(Stamdata!E1188,Stamdata!E1189),\"\")","v":""},{"$f":"IF(OR(NOT(0=0),NOT(AND(Stamdata!F1188=\"\",Stamdata!F1189=\"\"))), + SUM(Stamdata!F1188,Stamdata!F1189),\"\")","v":""},{"$f":"IF(OR(NOT(0=0),NOT(AND(Stamdata!G1188=\"\",Stamdata!G1189=\"\"))), + SUM(Stamdata!G1188,Stamdata!G1189),\"\")","v":""},{"$f":"IF(OR(NOT(0=0),NOT(AND(Stamdata!H1188=\"\",Stamdata!H1189=\"\"))), + SUM(Stamdata!H1188,Stamdata!H1189),\"\")","v":""}]
["",{"$f":"INDEX(labels!A683:C683,1,MATCH(PP_Language,labels!A1:C1,0))","v":"Individueel toepasselijk drempelbedrag bezoldiging"},"-"]
["",{"$f":"INDEX(labels!A684:C684,1,MATCH(PP_Language,labels!A1:C1,0))","v":"Motivering van de overschrijding van de maximale bezoldiging"},""]
["",{"$f":"INDEX(labels!A650:C650,1,MATCH(PP_Language,labels!A1:C1,0))","v":"Foutenherstel in verantwoording WNT"},""]
["",{"$f":"INDEX(labels!A651:C651,1,MATCH(PP_Language,labels!A1:C1,0))","v":"Toelichting op verschil en oorzaak foutenherstel"},""]
["",{"$f":"INDEX(labels!A141:C141,1,MATCH(PP_Language,labels!A1:C1,0))","v":"Presentatievolgorde"},""]
[""]
["",null,null,null,null,null,null,null,null,null,null,null,null,null,null,null,null,null,null,null,null,null,null,null,null,{"$f":"\"//notes-remuneration-of-non-senior-officials-specification label {\"&COLUMN(B1196)&\"}\"","v":"//notes-remuneration-of-non-senior-officials-specification label {2}"},null,{"$f":"\"//notes-remuneration-of-non-senior-officials-specification \" & INDEX(labels!A680:C680,1,MATCH(PP_Language,labels!A1:C1,0)) & \" \" & INDEX(labels!A56:C56,1,MATCH(PP_Language,labels!A1:C1,0)) & \" \" & BasisOfPreparationAxis & \"  {\"&COLUMN(D1196)&\"}\"","v":"//notes-remuneration-of-non-senior-officials-specification Beschrijving van de functie van de niet-topfunctionaris Enkelvoudig Commercial  {4}"},{"$f":"\"//notes-remuneration-of-non-senior-officials-specification \" & INDEX(labels!A680:C680,1,MATCH(PP_Language,labels!A1:C1,0)) & \" \" & INDEX(labels!A56:C56,1,MATCH(PP_Language,labels!A1:C1,0)) & \" \" & BasisOfPreparationAxis & \"  {\"&COLUMN(E1196)&\"}\"","v":"//notes-remuneration-of-non-senior-officials-specification Beschrijving van de functie van de niet-topfunctionaris Enkelvoudig Commercial  {5}"},{"$f":"\"//notes-remuneration-of-non-senior-officials-specification \" & INDEX(labels!A680:C680,1,MATCH(PP_Language,labels!A1:C1,0)) & \" \" & INDEX(labels!A56:C56,1,MATCH(PP_Language,labels!A1:C1,0)) & \" \" & BasisOfPreparationAxis & \"  {\"&COLUMN(F1196)&\"}\"","v":"//notes-remuneration-of-non-senior-officials-specification Beschrijving van de functie van de niet-topfunctionaris Enkelvoudig Commercial  {6}"},{"$f":"\"//notes-remuneration-of-non-senior-officials-specification \" & INDEX(labels!A680:C680,1,MATCH(PP_Language,labels!A1:C1,0)) & \" \" & INDEX(labels!A56:C56,1,MATCH(PP_Language,labels!A1:C1,0)) & \" \" & BasisOfPreparationAxis & \"  {\"&COLUMN(G1196)&\"}\"","v":"//notes-remuneration-of-non-senior-officials-specification Beschrijving van de functie van de niet-topfunctionaris Enkelvoudig Commercial  {7}"},{"$f":"\"//notes-remuneration-of-non-senior-officials-specification \" & INDEX(labels!A680:C680,1,MATCH(PP_Language,labels!A1:C1,0)) & \" \" & INDEX(labels!A56:C56,1,MATCH(PP_Language,labels!A1:C1,0)) & \" \" & BasisOfPreparationAxis & \"  {\"&COLUMN(H1196)&\"}\"","v":"//notes-remuneration-of-non-senior-officials-specification Beschrijving van de functie van de niet-topfunctionaris Enkelvoudig Commercial  {8}"}]
["",{"$f":"INDEX(labels!A685:C685,1,MATCH(PP_Language,labels!A1:C1,0))","v":"Toelichting op de jaarrekening - Bezoldiging van niet-topfunctionarissen, voorgaande periode: Specificatie"}]
["",null,null,{"$f":"INDEX(labels!A57:C57,1,MATCH(PP_Language,labels!A1:C1,0))","v":"Voorgaand"}]
[""]
["",null,null,{"$f":"\" \"  & INDEX(labels!A680:C680,1,MATCH(PP_Language,labels!A1:C1,0)) &  \"  \"  & INDEX(labels!A56:C56,1,MATCH(PP_Language,labels!A1:C1,0)) &  \" \"","v":" Beschrijving van de functie van de niet-topfunctionaris  Enkelvoudig "},{"$f":"\" \"  & INDEX(labels!A680:C680,1,MATCH(PP_Language,labels!A1:C1,0)) &  \"  \"  & INDEX(labels!A56:C56,1,MATCH(PP_Language,labels!A1:C1,0)) &  \" \"","v":" Beschrijving van de functie van de niet-topfunctionaris  Enkelvoudig "},{"$f":"\" \"  & INDEX(labels!A680:C680,1,MATCH(PP_Language,labels!A1:C1,0)) &  \"  \"  & INDEX(labels!A56:C56,1,MATCH(PP_Language,labels!A1:C1,0)) &  \" \"","v":" Beschrijving van de functie van de niet-topfunctionaris  Enkelvoudig "},{"$f":"\" \"  & INDEX(labels!A680:C680,1,MATCH(PP_Language,labels!A1:C1,0)) &  \"  \"  & INDEX(labels!A56:C56,1,MATCH(PP_Language,labels!A1:C1,0)) &  \" \"","v":" Beschrijving van de functie van de niet-topfunctionaris  Enkelvoudig "},{"$f":"\" \"  & INDEX(labels!A680:C680,1,MATCH(PP_Language,labels!A1:C1,0)) &  \"  \"  & INDEX(labels!A56:C56,1,MATCH(PP_Language,labels!A1:C1,0)) &  \" \"","v":" Beschrijving van de functie van de niet-topfunctionaris  Enkelvoudig "},null,null,null,null,null,null,null,null,null,null,null,null,null,null,null,null,null,{"$f":"\"/notes-remuneration-of-non-senior-officials-previous-specification label {\"&COLUMN(B1200)&\"}\"","v":"/notes-remuneration-of-non-senior-officials-previous-specification label {2}"},null,{"$f":"\"/notes-remuneration-of-non-senior-officials-previous-specification \" & INDEX(labels!A680:C680,1,MATCH(PP_Language,labels!A1:C1,0)) & \" \" & INDEX(labels!A56:C56,1,MATCH(PP_Language,labels!A1:C1,0)) & \" \" & BasisOfPreparationAxis & \"  {\"&COLUMN(D1200)&\"}\"","v":"/notes-remuneration-of-non-senior-officials-previous-specification Beschrijving van de functie van de niet-topfunctionaris Enkelvoudig Commercial  {4}"},{"$f":"\"/notes-remuneration-of-non-senior-officials-previous-specification \" & INDEX(labels!A680:C680,1,MATCH(PP_Language,labels!A1:C1,0)) & \" \" & INDEX(labels!A56:C56,1,MATCH(PP_Language,labels!A1:C1,0)) & \" \" & BasisOfPreparationAxis & \"  {\"&COLUMN(E1200)&\"}\"","v":"/notes-remuneration-of-non-senior-officials-previous-specification Beschrijving van de functie van de niet-topfunctionaris Enkelvoudig Commercial  {5}"},{"$f":"\"/notes-remuneration-of-non-senior-officials-previous-specification \" & INDEX(labels!A680:C680,1,MATCH(PP_Language,labels!A1:C1,0)) & \" \" & INDEX(labels!A56:C56,1,MATCH(PP_Language,labels!A1:C1,0)) & \" \" & BasisOfPreparationAxis & \"  {\"&COLUMN(F1200)&\"}\"","v":"/notes-remuneration-of-non-senior-officials-previous-specification Beschrijving van de functie van de niet-topfunctionaris Enkelvoudig Commercial  {6}"},{"$f":"\"/notes-remuneration-of-non-senior-officials-previous-specification \" & INDEX(labels!A680:C680,1,MATCH(PP_Language,labels!A1:C1,0)) & \" \" & INDEX(labels!A56:C56,1,MATCH(PP_Language,labels!A1:C1,0)) & \" \" & BasisOfPreparationAxis & \"  {\"&COLUMN(G1200)&\"}\"","v":"/notes-remuneration-of-non-senior-officials-previous-specification Beschrijving van de functie van de niet-topfunctionaris Enkelvoudig Commercial  {7}"},{"$f":"\"/notes-remuneration-of-non-senior-officials-previous-specification \" & INDEX(labels!A680:C680,1,MATCH(PP_Language,labels!A1:C1,0)) & \" \" & INDEX(labels!A56:C56,1,MATCH(PP_Language,labels!A1:C1,0)) & \" \" & BasisOfPreparationAxis & \"  {\"&COLUMN(H1200)&\"}\"","v":"/notes-remuneration-of-non-senior-officials-previous-specification Beschrijving van de functie van de niet-topfunctionaris Enkelvoudig Commercial  {8}"}]
["",{"$f":"INDEX(labels!A686:C686,1,MATCH(PP_Language,labels!A1:C1,0))","v":"Omschrijving Beschrijving van de functie van de niet-topfunctionaris"}]
["",{"$f":"INDEX(labels!A640:C640,1,MATCH(PP_Language,labels!A1:C1,0))","v":"Omvang van het dienstverband uitgedrukt als deeltijdfactor in FTE"},""]
["",{"$f":"INDEX(labels!A658:C658,1,MATCH(PP_Language,labels!A1:C1,0))","v":"Beloning plus belastbare onkostenvergoedingen"},"-"]
["",{"$f":"INDEX(labels!A659:C659,1,MATCH(PP_Language,labels!A1:C1,0))","v":"Beloningen betaalbaar op termijn"},"-"]
[""]
["",{"$f":"INDEX(labels!A682:C682,1,MATCH(PP_Language,labels!A1:C1,0))","v":"Totaal van bezoldiging"},"-"]
["",{"$f":"INDEX(labels!A141:C141,1,MATCH(PP_Language,labels!A1:C1,0))","v":"Presentatievolgorde"},""]
[""]
["",null,null,null,null,null,null,null,null,null,null,null,null,null,null,null,null,null,null,null,null,null,null,null,null,{"$f":"\"//notes-remuneration-of-non-senior-officials-previous-specification label {\"&COLUMN(B1209)&\"}\"","v":"//notes-remuneration-of-non-senior-officials-previous-specification label {2}"},null,{"$f":"\"//notes-remuneration-of-non-senior-officials-previous-specification \" & INDEX(labels!A680:C680,1,MATCH(PP_Language,labels!A1:C1,0)) & \" \" & INDEX(labels!A56:C56,1,MATCH(PP_Language,labels!A1:C1,0)) & \" \" & BasisOfPreparationAxis & \"  {\"&COLUMN(D1209)&\"}\"","v":"//notes-remuneration-of-non-senior-officials-previous-specification Beschrijving van de functie van de niet-topfunctionaris Enkelvoudig Commercial  {4}"},{"$f":"\"//notes-remuneration-of-non-senior-officials-previous-specification \" & INDEX(labels!A680:C680,1,MATCH(PP_Language,labels!A1:C1,0)) & \" \" & INDEX(labels!A56:C56,1,MATCH(PP_Language,labels!A1:C1,0)) & \" \" & BasisOfPreparationAxis & \"  {\"&COLUMN(E1209)&\"}\"","v":"//notes-remuneration-of-non-senior-officials-previous-specification Beschrijving van de functie van de niet-topfunctionaris Enkelvoudig Commercial  {5}"},{"$f":"\"//notes-remuneration-of-non-senior-officials-previous-specification \" & INDEX(labels!A680:C680,1,MATCH(PP_Language,labels!A1:C1,0)) & \" \" & INDEX(labels!A56:C56,1,MATCH(PP_Language,labels!A1:C1,0)) & \" \" & BasisOfPreparationAxis & \"  {\"&COLUMN(F1209)&\"}\"","v":"//notes-remuneration-of-non-senior-officials-previous-specification Beschrijving van de functie van de niet-topfunctionaris Enkelvoudig Commercial  {6}"},{"$f":"\"//notes-remuneration-of-non-senior-officials-previous-specification \" & INDEX(labels!A680:C680,1,MATCH(PP_Language,labels!A1:C1,0)) & \" \" & INDEX(labels!A56:C56,1,MATCH(PP_Language,labels!A1:C1,0)) & \" \" & BasisOfPreparationAxis & \"  {\"&COLUMN(G1209)&\"}\"","v":"//notes-remuneration-of-non-senior-officials-previous-specification Beschrijving van de functie van de niet-topfunctionaris Enkelvoudig Commercial  {7}"},{"$f":"\"//notes-remuneration-of-non-senior-officials-previous-specification \" & INDEX(labels!A680:C680,1,MATCH(PP_Language,labels!A1:C1,0)) & \" \" & INDEX(labels!A56:C56,1,MATCH(PP_Language,labels!A1:C1,0)) & \" \" & BasisOfPreparationAxis & \"  {\"&COLUMN(H1209)&\"}\"","v":"//notes-remuneration-of-non-senior-officials-previous-specification Beschrijving van de functie van de niet-topfunctionaris Enkelvoudig Commercial  {8}"}]
["",{"$f":"INDEX(labels!A687:C687,1,MATCH(PP_Language,labels!A1:C1,0))","v":"Toelichting op de jaarrekening - Bezoldiging van toezichthoudende topfunctionarissen: Specificatie"}]
["",null,null,{"$f":"INDEX(labels!A55:C55,1,MATCH(PP_Language,labels!A1:C1,0))","v":"Huidig"}]
[""]
["",null,null,{"$f":"\" \"  & INDEX(labels!A688:C688,1,MATCH(PP_Language,labels!A1:C1,0)) &  \"  \"  & INDEX(labels!A56:C56,1,MATCH(PP_Language,labels!A1:C1,0)) &  \" \"","v":" De naam (bestaande uit de voorletters en achternaam) van de toezichthoudende topfunctionaris  Enkelvoudig "},{"$f":"\" \"  & INDEX(labels!A688:C688,1,MATCH(PP_Language,labels!A1:C1,0)) &  \"  \"  & INDEX(labels!A56:C56,1,MATCH(PP_Language,labels!A1:C1,0)) &  \" \"","v":" De naam (bestaande uit de voorletters en achternaam) van de toezichthoudende topfunctionaris  Enkelvoudig "},{"$f":"\" \"  & INDEX(labels!A688:C688,1,MATCH(PP_Language,labels!A1:C1,0)) &  \"  \"  & INDEX(labels!A56:C56,1,MATCH(PP_Language,labels!A1:C1,0)) &  \" \"","v":" De naam (bestaande uit de voorletters en achternaam) van de toezichthoudende topfunctionaris  Enkelvoudig "},{"$f":"\" \"  & INDEX(labels!A688:C688,1,MATCH(PP_Language,labels!A1:C1,0)) &  \"  \"  & INDEX(labels!A56:C56,1,MATCH(PP_Language,labels!A1:C1,0)) &  \" \"","v":" De naam (bestaande uit de voorletters en achternaam) van de toezichthoudende topfunctionaris  Enkelvoudig "},{"$f":"\" \"  & INDEX(labels!A688:C688,1,MATCH(PP_Language,labels!A1:C1,0)) &  \"  \"  & INDEX(labels!A56:C56,1,MATCH(PP_Language,labels!A1:C1,0)) &  \" \"","v":" De naam (bestaande uit de voorletters en achternaam) van de toezichthoudende topfunctionaris  Enkelvoudig "},null,null,null,null,null,null,null,null,null,null,null,null,null,null,null,null,null,{"$f":"\"/notes-remuneration-of-supervisory-senior-officials-specification label {\"&COLUMN(B1213)&\"}\"","v":"/notes-remuneration-of-supervisory-senior-officials-specification label {2}"},null,{"$f":"\"/notes-remuneration-of-supervisory-senior-officials-specification \" & INDEX(labels!A688:C688,1,MATCH(PP_Language,labels!A1:C1,0)) & \" \" & INDEX(labels!A56:C56,1,MATCH(PP_Language,labels!A1:C1,0)) & \" \" & BasisOfPreparationAxis & \"  {\"&COLUMN(D1213)&\"}\"","v":"/notes-remuneration-of-supervisory-senior-officials-specification De naam (bestaande uit de voorletters en achternaam) van de toezichthoudende topfunctionaris Enkelvoudig Commercial  {4}"},{"$f":"\"/notes-remuneration-of-supervisory-senior-officials-specification \" & INDEX(labels!A688:C688,1,MATCH(PP_Language,labels!A1:C1,0)) & \" \" & INDEX(labels!A56:C56,1,MATCH(PP_Language,labels!A1:C1,0)) & \" \" & BasisOfPreparationAxis & \"  {\"&COLUMN(E1213)&\"}\"","v":"/notes-remuneration-of-supervisory-senior-officials-specification De naam (bestaande uit de voorletters en achternaam) van de toezichthoudende topfunctionaris Enkelvoudig Commercial  {5}"},{"$f":"\"/notes-remuneration-of-supervisory-senior-officials-specification \" & INDEX(labels!A688:C688,1,MATCH(PP_Language,labels!A1:C1,0)) & \" \" & INDEX(labels!A56:C56,1,MATCH(PP_Language,labels!A1:C1,0)) & \" \" & BasisOfPreparationAxis & \"  {\"&COLUMN(F1213)&\"}\"","v":"/notes-remuneration-of-supervisory-senior-officials-specification De naam (bestaande uit de voorletters en achternaam) van de toezichthoudende topfunctionaris Enkelvoudig Commercial  {6}"},{"$f":"\"/notes-remuneration-of-supervisory-senior-officials-specification \" & INDEX(labels!A688:C688,1,MATCH(PP_Language,labels!A1:C1,0)) & \" \" & INDEX(labels!A56:C56,1,MATCH(PP_Language,labels!A1:C1,0)) & \" \" & BasisOfPreparationAxis & \"  {\"&COLUMN(G1213)&\"}\"","v":"/notes-remuneration-of-supervisory-senior-officials-specification De naam (bestaande uit de voorletters en achternaam) van de toezichthoudende topfunctionaris Enkelvoudig Commercial  {7}"},{"$f":"\"/notes-remuneration-of-supervisory-senior-officials-specification \" & INDEX(labels!A688:C688,1,MATCH(PP_Language,labels!A1:C1,0)) & \" \" & INDEX(labels!A56:C56,1,MATCH(PP_Language,labels!A1:C1,0)) & \" \" & BasisOfPreparationAxis & \"  {\"&COLUMN(H1213)&\"}\"","v":"/notes-remuneration-of-supervisory-senior-officials-specification De naam (bestaande uit de voorletters en achternaam) van de toezichthoudende topfunctionaris Enkelvoudig Commercial  {8}"}]
["",{"$f":"INDEX(labels!A689:C689,1,MATCH(PP_Language,labels!A1:C1,0))","v":"Omschrijving De naam (bestaande uit de voorletters en achternaam) van de toezichthoudende topfunctionaris"}]
["",{"$f":"INDEX(labels!A639:C639,1,MATCH(PP_Language,labels!A1:C1,0))","v":"Functie(s)"},""]
["",{"$f":"INDEX(labels!A655:C655,1,MATCH(PP_Language,labels!A1:C1,0))","v":"Aanvang functievervulling"},""]
["",{"$f":"INDEX(labels!A656:C656,1,MATCH(PP_Language,labels!A1:C1,0))","v":"Einde functievervulling"},""]
["",{"$f":"INDEX(labels!A690:C690,1,MATCH(PP_Language,labels!A1:C1,0))","v":"Bezoldiging inclusief onverschuldigde betalingen"},"-"]
["",{"$f":"INDEX(labels!A661:C661,1,MATCH(PP_Language,labels!A1:C1,0))","v":"Individueel toepasselijke bezoldigingsmaximum"},"-"]
["",{"$f":"INDEX(labels!A646:C646,1,MATCH(PP_Language,labels!A1:C1,0))","v":"Onverschuldigd betaald en nog niet terugontvangen bedrag"},"+"]
["",{"$f":"INDEX(labels!A662:C662,1,MATCH(PP_Language,labels!A1:C1,0))","v":"Bezoldiging"},"-"]
["",{"$f":"INDEX(labels!A647:C647,1,MATCH(PP_Language,labels!A1:C1,0))","v":"Het bedrag van de overschrijding"},"-"]
["",{"$f":"INDEX(labels!A648:C648,1,MATCH(PP_Language,labels!A1:C1,0))","v":"Reden waarom de overschrijding al dan niet is toegestaan"},""]
["",{"$f":"INDEX(labels!A649:C649,1,MATCH(PP_Language,labels!A1:C1,0))","v":"Toelichting op de vordering wegens onverschuldigde betaling"},""]
["",{"$f":"INDEX(labels!A650:C650,1,MATCH(PP_Language,labels!A1:C1,0))","v":"Foutenherstel in verantwoording WNT"},""]
["",{"$f":"INDEX(labels!A651:C651,1,MATCH(PP_Language,labels!A1:C1,0))","v":"Toelichting op verschil en oorzaak foutenherstel"},""]
["",{"$f":"INDEX(labels!A141:C141,1,MATCH(PP_Language,labels!A1:C1,0))","v":"Presentatievolgorde"},""]
[""]
["",null,null,null,null,null,null,null,null,null,null,null,null,null,null,null,null,null,null,null,null,null,null,null,null,{"$f":"\"//notes-remuneration-of-supervisory-senior-officials-specification label {\"&COLUMN(B1229)&\"}\"","v":"//notes-remuneration-of-supervisory-senior-officials-specification label {2}"},null,{"$f":"\"//notes-remuneration-of-supervisory-senior-officials-specification \" & INDEX(labels!A688:C688,1,MATCH(PP_Language,labels!A1:C1,0)) & \" \" & INDEX(labels!A56:C56,1,MATCH(PP_Language,labels!A1:C1,0)) & \" \" & BasisOfPreparationAxis & \"  {\"&COLUMN(D1229)&\"}\"","v":"//notes-remuneration-of-supervisory-senior-officials-specification De naam (bestaande uit de voorletters en achternaam) van de toezichthoudende topfunctionaris Enkelvoudig Commercial  {4}"},{"$f":"\"//notes-remuneration-of-supervisory-senior-officials-specification \" & INDEX(labels!A688:C688,1,MATCH(PP_Language,labels!A1:C1,0)) & \" \" & INDEX(labels!A56:C56,1,MATCH(PP_Language,labels!A1:C1,0)) & \" \" & BasisOfPreparationAxis & \"  {\"&COLUMN(E1229)&\"}\"","v":"//notes-remuneration-of-supervisory-senior-officials-specification De naam (bestaande uit de voorletters en achternaam) van de toezichthoudende topfunctionaris Enkelvoudig Commercial  {5}"},{"$f":"\"//notes-remuneration-of-supervisory-senior-officials-specification \" & INDEX(labels!A688:C688,1,MATCH(PP_Language,labels!A1:C1,0)) & \" \" & INDEX(labels!A56:C56,1,MATCH(PP_Language,labels!A1:C1,0)) & \" \" & BasisOfPreparationAxis & \"  {\"&COLUMN(F1229)&\"}\"","v":"//notes-remuneration-of-supervisory-senior-officials-specification De naam (bestaande uit de voorletters en achternaam) van de toezichthoudende topfunctionaris Enkelvoudig Commercial  {6}"},{"$f":"\"//notes-remuneration-of-supervisory-senior-officials-specification \" & INDEX(labels!A688:C688,1,MATCH(PP_Language,labels!A1:C1,0)) & \" \" & INDEX(labels!A56:C56,1,MATCH(PP_Language,labels!A1:C1,0)) & \" \" & BasisOfPreparationAxis & \"  {\"&COLUMN(G1229)&\"}\"","v":"//notes-remuneration-of-supervisory-senior-officials-specification De naam (bestaande uit de voorletters en achternaam) van de toezichthoudende topfunctionaris Enkelvoudig Commercial  {7}"},{"$f":"\"//notes-remuneration-of-supervisory-senior-officials-specification \" & INDEX(labels!A688:C688,1,MATCH(PP_Language,labels!A1:C1,0)) & \" \" & INDEX(labels!A56:C56,1,MATCH(PP_Language,labels!A1:C1,0)) & \" \" & BasisOfPreparationAxis & \"  {\"&COLUMN(H1229)&\"}\"","v":"//notes-remuneration-of-supervisory-senior-officials-specification De naam (bestaande uit de voorletters en achternaam) van de toezichthoudende topfunctionaris Enkelvoudig Commercial  {8}"}]
["",{"$f":"INDEX(labels!A691:C691,1,MATCH(PP_Language,labels!A1:C1,0))","v":"Toelichting op de jaarrekening - Bezoldiging van toezichthoudende topfunctionarissen, voorgaande periode: Specificatie"}]
["",null,null,{"$f":"INDEX(labels!A57:C57,1,MATCH(PP_Language,labels!A1:C1,0))","v":"Voorgaand"}]
[""]
["",null,null,{"$f":"\" \"  & INDEX(labels!A688:C688,1,MATCH(PP_Language,labels!A1:C1,0)) &  \"  \"  & INDEX(labels!A56:C56,1,MATCH(PP_Language,labels!A1:C1,0)) &  \" \"","v":" De naam (bestaande uit de voorletters en achternaam) van de toezichthoudende topfunctionaris  Enkelvoudig "},{"$f":"\" \"  & INDEX(labels!A688:C688,1,MATCH(PP_Language,labels!A1:C1,0)) &  \"  \"  & INDEX(labels!A56:C56,1,MATCH(PP_Language,labels!A1:C1,0)) &  \" \"","v":" De naam (bestaande uit de voorletters en achternaam) van de toezichthoudende topfunctionaris  Enkelvoudig "},{"$f":"\" \"  & INDEX(labels!A688:C688,1,MATCH(PP_Language,labels!A1:C1,0)) &  \"  \"  & INDEX(labels!A56:C56,1,MATCH(PP_Language,labels!A1:C1,0)) &  \" \"","v":" De naam (bestaande uit de voorletters en achternaam) van de toezichthoudende topfunctionaris  Enkelvoudig "},{"$f":"\" \"  & INDEX(labels!A688:C688,1,MATCH(PP_Language,labels!A1:C1,0)) &  \"  \"  & INDEX(labels!A56:C56,1,MATCH(PP_Language,labels!A1:C1,0)) &  \" \"","v":" De naam (bestaande uit de voorletters en achternaam) van de toezichthoudende topfunctionaris  Enkelvoudig "},{"$f":"\" \"  & INDEX(labels!A688:C688,1,MATCH(PP_Language,labels!A1:C1,0)) &  \"  \"  & INDEX(labels!A56:C56,1,MATCH(PP_Language,labels!A1:C1,0)) &  \" \"","v":" De naam (bestaande uit de voorletters en achternaam) van de toezichthoudende topfunctionaris  Enkelvoudig "},null,null,null,null,null,null,null,null,null,null,null,null,null,null,null,null,null,{"$f":"\"/notes-remuneration-of-supervisory-senior-officials-previous-specification label {\"&COLUMN(B1233)&\"}\"","v":"/notes-remuneration-of-supervisory-senior-officials-previous-specification label {2}"},null,{"$f":"\"/notes-remuneration-of-supervisory-senior-officials-previous-specification \" & INDEX(labels!A688:C688,1,MATCH(PP_Language,labels!A1:C1,0)) & \" \" & INDEX(labels!A56:C56,1,MATCH(PP_Language,labels!A1:C1,0)) & \" \" & BasisOfPreparationAxis & \"  {\"&COLUMN(D1233)&\"}\"","v":"/notes-remuneration-of-supervisory-senior-officials-previous-specification De naam (bestaande uit de voorletters en achternaam) van de toezichthoudende topfunctionaris Enkelvoudig Commercial  {4}"},{"$f":"\"/notes-remuneration-of-supervisory-senior-officials-previous-specification \" & INDEX(labels!A688:C688,1,MATCH(PP_Language,labels!A1:C1,0)) & \" \" & INDEX(labels!A56:C56,1,MATCH(PP_Language,labels!A1:C1,0)) & \" \" & BasisOfPreparationAxis & \"  {\"&COLUMN(E1233)&\"}\"","v":"/notes-remuneration-of-supervisory-senior-officials-previous-specification De naam (bestaande uit de voorletters en achternaam) van de toezichthoudende topfunctionaris Enkelvoudig Commercial  {5}"},{"$f":"\"/notes-remuneration-of-supervisory-senior-officials-previous-specification \" & INDEX(labels!A688:C688,1,MATCH(PP_Language,labels!A1:C1,0)) & \" \" & INDEX(labels!A56:C56,1,MATCH(PP_Language,labels!A1:C1,0)) & \" \" & BasisOfPreparationAxis & \"  {\"&COLUMN(F1233)&\"}\"","v":"/notes-remuneration-of-supervisory-senior-officials-previous-specification De naam (bestaande uit de voorletters en achternaam) van de toezichthoudende topfunctionaris Enkelvoudig Commercial  {6}"},{"$f":"\"/notes-remuneration-of-supervisory-senior-officials-previous-specification \" & INDEX(labels!A688:C688,1,MATCH(PP_Language,labels!A1:C1,0)) & \" \" & INDEX(labels!A56:C56,1,MATCH(PP_Language,labels!A1:C1,0)) & \" \" & BasisOfPreparationAxis & \"  {\"&COLUMN(G1233)&\"}\"","v":"/notes-remuneration-of-supervisory-senior-officials-previous-specification De naam (bestaande uit de voorletters en achternaam) van de toezichthoudende topfunctionaris Enkelvoudig Commercial  {7}"},{"$f":"\"/notes-remuneration-of-supervisory-senior-officials-previous-specification \" & INDEX(labels!A688:C688,1,MATCH(PP_Language,labels!A1:C1,0)) & \" \" & INDEX(labels!A56:C56,1,MATCH(PP_Language,labels!A1:C1,0)) & \" \" & BasisOfPreparationAxis & \"  {\"&COLUMN(H1233)&\"}\"","v":"/notes-remuneration-of-supervisory-senior-officials-previous-specification De naam (bestaande uit de voorletters en achternaam) van de toezichthoudende topfunctionaris Enkelvoudig Commercial  {8}"}]
["",{"$f":"INDEX(labels!A692:C692,1,MATCH(PP_Language,labels!A1:C1,0))","v":"Omschrijving De naam (bestaande uit de voorletters en achternaam) van de toezichthoudende topfunctionaris"}]
["",{"$f":"INDEX(labels!A639:C639,1,MATCH(PP_Language,labels!A1:C1,0))","v":"Functie(s)"},""]
["",{"$f":"INDEX(labels!A655:C655,1,MATCH(PP_Language,labels!A1:C1,0))","v":"Aanvang functievervulling"},""]
["",{"$f":"INDEX(labels!A656:C656,1,MATCH(PP_Language,labels!A1:C1,0))","v":"Einde functievervulling"},""]
["",{"$f":"INDEX(labels!A662:C662,1,MATCH(PP_Language,labels!A1:C1,0))","v":"Bezoldiging"},"-"]
["",{"$f":"INDEX(labels!A661:C661,1,MATCH(PP_Language,labels!A1:C1,0))","v":"Individueel toepasselijke bezoldigingsmaximum"},"-"]
["",{"$f":"INDEX(labels!A141:C141,1,MATCH(PP_Language,labels!A1:C1,0))","v":"Presentatievolgorde"},""]
[""]
["",null,null,null,null,null,null,null,null,null,null,null,null,null,null,null,null,null,null,null,null,null,null,null,null,{"$f":"\"//notes-remuneration-of-supervisory-senior-officials-previous-specification label {\"&COLUMN(B1242)&\"}\"","v":"//notes-remuneration-of-supervisory-senior-officials-previous-specification label {2}"},null,{"$f":"\"//notes-remuneration-of-supervisory-senior-officials-previous-specification \" & INDEX(labels!A688:C688,1,MATCH(PP_Language,labels!A1:C1,0)) & \" \" & INDEX(labels!A56:C56,1,MATCH(PP_Language,labels!A1:C1,0)) & \" \" & BasisOfPreparationAxis & \"  {\"&COLUMN(D1242)&\"}\"","v":"//notes-remuneration-of-supervisory-senior-officials-previous-specification De naam (bestaande uit de voorletters en achternaam) van de toezichthoudende topfunctionaris Enkelvoudig Commercial  {4}"},{"$f":"\"//notes-remuneration-of-supervisory-senior-officials-previous-specification \" & INDEX(labels!A688:C688,1,MATCH(PP_Language,labels!A1:C1,0)) & \" \" & INDEX(labels!A56:C56,1,MATCH(PP_Language,labels!A1:C1,0)) & \" \" & BasisOfPreparationAxis & \"  {\"&COLUMN(E1242)&\"}\"","v":"//notes-remuneration-of-supervisory-senior-officials-previous-specification De naam (bestaande uit de voorletters en achternaam) van de toezichthoudende topfunctionaris Enkelvoudig Commercial  {5}"},{"$f":"\"//notes-remuneration-of-supervisory-senior-officials-previous-specification \" & INDEX(labels!A688:C688,1,MATCH(PP_Language,labels!A1:C1,0)) & \" \" & INDEX(labels!A56:C56,1,MATCH(PP_Language,labels!A1:C1,0)) & \" \" & BasisOfPreparationAxis & \"  {\"&COLUMN(F1242)&\"}\"","v":"//notes-remuneration-of-supervisory-senior-officials-previous-specification De naam (bestaande uit de voorletters en achternaam) van de toezichthoudende topfunctionaris Enkelvoudig Commercial  {6}"},{"$f":"\"//notes-remuneration-of-supervisory-senior-officials-previous-specification \" & INDEX(labels!A688:C688,1,MATCH(PP_Language,labels!A1:C1,0)) & \" \" & INDEX(labels!A56:C56,1,MATCH(PP_Language,labels!A1:C1,0)) & \" \" & BasisOfPreparationAxis & \"  {\"&COLUMN(G1242)&\"}\"","v":"//notes-remuneration-of-supervisory-senior-officials-previous-specification De naam (bestaande uit de voorletters en achternaam) van de toezichthoudende topfunctionaris Enkelvoudig Commercial  {7}"},{"$f":"\"//notes-remuneration-of-supervisory-senior-officials-previous-specification \" & INDEX(labels!A688:C688,1,MATCH(PP_Language,labels!A1:C1,0)) & \" \" & INDEX(labels!A56:C56,1,MATCH(PP_Language,labels!A1:C1,0)) & \" \" & BasisOfPreparationAxis & \"  {\"&COLUMN(H1242)&\"}\"","v":"//notes-remuneration-of-supervisory-senior-officials-previous-specification De naam (bestaande uit de voorletters en achternaam) van de toezichthoudende topfunctionaris Enkelvoudig Commercial  {8}"}]
["",{"$f":"INDEX(labels!A693:C693,1,MATCH(PP_Language,labels!A1:C1,0))","v":"Toelichting op de jaarrekening - Bezoldiging van topfunctionarissen en degenen die nog 4 jaar als topfunctionaris worden aangemerkt met een bezoldiging van € 1.900 of minder: Specificatie"}]
["",null,null,{"$f":"INDEX(labels!A55:C55,1,MATCH(PP_Language,labels!A1:C1,0))","v":"Huidig"}]
[""]
["",null,null,{"$f":"\" \"  & INDEX(labels!A637:C637,1,MATCH(PP_Language,labels!A1:C1,0)) &  \"  \"  & INDEX(labels!A56:C56,1,MATCH(PP_Language,labels!A1:C1,0)) &  \" \"","v":" De naam (bestaande uit de voorletters en achternaam) van de topfunctionaris  Enkelvoudig "},{"$f":"\" \"  & INDEX(labels!A637:C637,1,MATCH(PP_Language,labels!A1:C1,0)) &  \"  \"  & INDEX(labels!A56:C56,1,MATCH(PP_Language,labels!A1:C1,0)) &  \" \"","v":" De naam (bestaande uit de voorletters en achternaam) van de topfunctionaris  Enkelvoudig "},{"$f":"\" \"  & INDEX(labels!A637:C637,1,MATCH(PP_Language,labels!A1:C1,0)) &  \"  \"  & INDEX(labels!A56:C56,1,MATCH(PP_Language,labels!A1:C1,0)) &  \" \"","v":" De naam (bestaande uit de voorletters en achternaam) van de topfunctionaris  Enkelvoudig "},{"$f":"\" \"  & INDEX(labels!A637:C637,1,MATCH(PP_Language,labels!A1:C1,0)) &  \"  \"  & INDEX(labels!A56:C56,1,MATCH(PP_Language,labels!A1:C1,0)) &  \" \"","v":" De naam (bestaande uit de voorletters en achternaam) van de topfunctionaris  Enkelvoudig "},{"$f":"\" \"  & INDEX(labels!A637:C637,1,MATCH(PP_Language,labels!A1:C1,0)) &  \"  \"  & INDEX(labels!A56:C56,1,MATCH(PP_Language,labels!A1:C1,0)) &  \" \"","v":" De naam (bestaande uit de voorletters en achternaam) van de topfunctionaris  Enkelvoudig "},null,null,null,null,null,null,null,null,null,null,null,null,null,null,null,null,null,{"$f":"\"/notes-remuneration-of-senior-officials1700or-less-specification label {\"&COLUMN(B1246)&\"}\"","v":"/notes-remuneration-of-senior-officials1700or-less-specification label {2}"},null,{"$f":"\"/notes-remuneration-of-senior-officials1700or-less-specification \" & INDEX(labels!A637:C637,1,MATCH(PP_Language,labels!A1:C1,0)) & \" \" & INDEX(labels!A56:C56,1,MATCH(PP_Language,labels!A1:C1,0)) & \" \" & BasisOfPreparationAxis & \"  {\"&COLUMN(D1246)&\"}\"","v":"/notes-remuneration-of-senior-officials1700or-less-specification De naam (bestaande uit de voorletters en achternaam) van de topfunctionaris Enkelvoudig Commercial  {4}"},{"$f":"\"/notes-remuneration-of-senior-officials1700or-less-specification \" & INDEX(labels!A637:C637,1,MATCH(PP_Language,labels!A1:C1,0)) & \" \" & INDEX(labels!A56:C56,1,MATCH(PP_Language,labels!A1:C1,0)) & \" \" & BasisOfPreparationAxis & \"  {\"&COLUMN(E1246)&\"}\"","v":"/notes-remuneration-of-senior-officials1700or-less-specification De naam (bestaande uit de voorletters en achternaam) van de topfunctionaris Enkelvoudig Commercial  {5}"},{"$f":"\"/notes-remuneration-of-senior-officials1700or-less-specification \" & INDEX(labels!A637:C637,1,MATCH(PP_Language,labels!A1:C1,0)) & \" \" & INDEX(labels!A56:C56,1,MATCH(PP_Language,labels!A1:C1,0)) & \" \" & BasisOfPreparationAxis & \"  {\"&COLUMN(F1246)&\"}\"","v":"/notes-remuneration-of-senior-officials1700or-less-specification De naam (bestaande uit de voorletters en achternaam) van de topfunctionaris Enkelvoudig Commercial  {6}"},{"$f":"\"/notes-remuneration-of-senior-officials1700or-less-specification \" & INDEX(labels!A637:C637,1,MATCH(PP_Language,labels!A1:C1,0)) & \" \" & INDEX(labels!A56:C56,1,MATCH(PP_Language,labels!A1:C1,0)) & \" \" & BasisOfPreparationAxis & \"  {\"&COLUMN(G1246)&\"}\"","v":"/notes-remuneration-of-senior-officials1700or-less-specification De naam (bestaande uit de voorletters en achternaam) van de topfunctionaris Enkelvoudig Commercial  {7}"},{"$f":"\"/notes-remuneration-of-senior-officials1700or-less-specification \" & INDEX(labels!A637:C637,1,MATCH(PP_Language,labels!A1:C1,0)) & \" \" & INDEX(labels!A56:C56,1,MATCH(PP_Language,labels!A1:C1,0)) & \" \" & BasisOfPreparationAxis & \"  {\"&COLUMN(H1246)&\"}\"","v":"/notes-remuneration-of-senior-officials1700or-less-specification De naam (bestaande uit de voorletters en achternaam) van de topfunctionaris Enkelvoudig Commercial  {8}"}]
["",{"$f":"INDEX(labels!A694:C694,1,MATCH(PP_Language,labels!A1:C1,0))","v":"Omschrijving De naam (bestaande uit de voorletters en achternaam) van de topfunctionaris"}]
["",{"$f":"INDEX(labels!A639:C639,1,MATCH(PP_Language,labels!A1:C1,0))","v":"Functie(s)"},""]
["",{"$f":"INDEX(labels!A141:C141,1,MATCH(PP_Language,labels!A1:C1,0))","v":"Presentatievolgorde"},""]
[""]
["",null,null,null,null,null,null,null,null,null,null,null,null,null,null,null,null,null,null,null,null,null,null,null,null,{"$f":"\"//notes-remuneration-of-senior-officials1700or-less-specification label {\"&COLUMN(B1251)&\"}\"","v":"//notes-remuneration-of-senior-officials1700or-less-specification label {2}"},null,{"$f":"\"//notes-remuneration-of-senior-officials1700or-less-specification \" & INDEX(labels!A637:C637,1,MATCH(PP_Language,labels!A1:C1,0)) & \" \" & INDEX(labels!A56:C56,1,MATCH(PP_Language,labels!A1:C1,0)) & \" \" & BasisOfPreparationAxis & \"  {\"&COLUMN(D1251)&\"}\"","v":"//notes-remuneration-of-senior-officials1700or-less-specification De naam (bestaande uit de voorletters en achternaam) van de topfunctionaris Enkelvoudig Commercial  {4}"},{"$f":"\"//notes-remuneration-of-senior-officials1700or-less-specification \" & INDEX(labels!A637:C637,1,MATCH(PP_Language,labels!A1:C1,0)) & \" \" & INDEX(labels!A56:C56,1,MATCH(PP_Language,labels!A1:C1,0)) & \" \" & BasisOfPreparationAxis & \"  {\"&COLUMN(E1251)&\"}\"","v":"//notes-remuneration-of-senior-officials1700or-less-specification De naam (bestaande uit de voorletters en achternaam) van de topfunctionaris Enkelvoudig Commercial  {5}"},{"$f":"\"//notes-remuneration-of-senior-officials1700or-less-specification \" & INDEX(labels!A637:C637,1,MATCH(PP_Language,labels!A1:C1,0)) & \" \" & INDEX(labels!A56:C56,1,MATCH(PP_Language,labels!A1:C1,0)) & \" \" & BasisOfPreparationAxis & \"  {\"&COLUMN(F1251)&\"}\"","v":"//notes-remuneration-of-senior-officials1700or-less-specification De naam (bestaande uit de voorletters en achternaam) van de topfunctionaris Enkelvoudig Commercial  {6}"},{"$f":"\"//notes-remuneration-of-senior-officials1700or-less-specification \" & INDEX(labels!A637:C637,1,MATCH(PP_Language,labels!A1:C1,0)) & \" \" & INDEX(labels!A56:C56,1,MATCH(PP_Language,labels!A1:C1,0)) & \" \" & BasisOfPreparationAxis & \"  {\"&COLUMN(G1251)&\"}\"","v":"//notes-remuneration-of-senior-officials1700or-less-specification De naam (bestaande uit de voorletters en achternaam) van de topfunctionaris Enkelvoudig Commercial  {7}"},{"$f":"\"//notes-remuneration-of-senior-officials1700or-less-specification \" & INDEX(labels!A637:C637,1,MATCH(PP_Language,labels!A1:C1,0)) & \" \" & INDEX(labels!A56:C56,1,MATCH(PP_Language,labels!A1:C1,0)) & \" \" & BasisOfPreparationAxis & \"  {\"&COLUMN(H1251)&\"}\"","v":"//notes-remuneration-of-senior-officials1700or-less-specification De naam (bestaande uit de voorletters en achternaam) van de topfunctionaris Enkelvoudig Commercial  {8}"}]
["",{"$f":"INDEX(labels!A695:C695,1,MATCH(PP_Language,labels!A1:C1,0))","v":"Toelichting op de jaarrekening - Totale bezoldiging van een topfunctionaris alsmede degene die op grond van zijn/haar voormalige functie nog 4 jaar als topfunctionaris wordt aangemerkt: Specificatie"}]
["",null,null,{"$f":"INDEX(labels!A55:C55,1,MATCH(PP_Language,labels!A1:C1,0))","v":"Huidig"}]
[""]
["",null,null,{"$f":"\" \"  & INDEX(labels!A637:C637,1,MATCH(PP_Language,labels!A1:C1,0)) &  \"  \"  & INDEX(labels!A56:C56,1,MATCH(PP_Language,labels!A1:C1,0)) &  \" \"","v":" De naam (bestaande uit de voorletters en achternaam) van de topfunctionaris  Enkelvoudig "},{"$f":"\" \"  & INDEX(labels!A637:C637,1,MATCH(PP_Language,labels!A1:C1,0)) &  \"  \"  & INDEX(labels!A56:C56,1,MATCH(PP_Language,labels!A1:C1,0)) &  \" \"","v":" De naam (bestaande uit de voorletters en achternaam) van de topfunctionaris  Enkelvoudig "},{"$f":"\" \"  & INDEX(labels!A637:C637,1,MATCH(PP_Language,labels!A1:C1,0)) &  \"  \"  & INDEX(labels!A56:C56,1,MATCH(PP_Language,labels!A1:C1,0)) &  \" \"","v":" De naam (bestaande uit de voorletters en achternaam) van de topfunctionaris  Enkelvoudig "},{"$f":"\" \"  & INDEX(labels!A637:C637,1,MATCH(PP_Language,labels!A1:C1,0)) &  \"  \"  & INDEX(labels!A56:C56,1,MATCH(PP_Language,labels!A1:C1,0)) &  \" \"","v":" De naam (bestaande uit de voorletters en achternaam) van de topfunctionaris  Enkelvoudig "},{"$f":"\" \"  & INDEX(labels!A637:C637,1,MATCH(PP_Language,labels!A1:C1,0)) &  \"  \"  & INDEX(labels!A56:C56,1,MATCH(PP_Language,labels!A1:C1,0)) &  \" \"","v":" De naam (bestaande uit de voorletters en achternaam) van de topfunctionaris  Enkelvoudig "},null,null,null,null,null,null,null,null,null,null,null,null,null,null,null,null,null,{"$f":"\"/notes-remuneration-of-executive-senior-officials-considered-four-years-specification label {\"&COLUMN(B1255)&\"}\"","v":"/notes-remuneration-of-executive-senior-officials-considered-four-years-specification label {2}"},null,{"$f":"\"/notes-remuneration-of-executive-senior-officials-considered-four-years-specification \" & INDEX(labels!A637:C637,1,MATCH(PP_Language,labels!A1:C1,0)) & \" \" & INDEX(labels!A56:C56,1,MATCH(PP_Language,labels!A1:C1,0)) & \" \" & BasisOfPreparationAxis & \"  {\"&COLUMN(D1255)&\"}\"","v":"/notes-remuneration-of-executive-senior-officials-considered-four-years-specification De naam (bestaande uit de voorletters en achternaam) van de topfunctionaris Enkelvoudig Commercial  {4}"},{"$f":"\"/notes-remuneration-of-executive-senior-officials-considered-four-years-specification \" & INDEX(labels!A637:C637,1,MATCH(PP_Language,labels!A1:C1,0)) & \" \" & INDEX(labels!A56:C56,1,MATCH(PP_Language,labels!A1:C1,0)) & \" \" & BasisOfPreparationAxis & \"  {\"&COLUMN(E1255)&\"}\"","v":"/notes-remuneration-of-executive-senior-officials-considered-four-years-specification De naam (bestaande uit de voorletters en achternaam) van de topfunctionaris Enkelvoudig Commercial  {5}"},{"$f":"\"/notes-remuneration-of-executive-senior-officials-considered-four-years-specification \" & INDEX(labels!A637:C637,1,MATCH(PP_Language,labels!A1:C1,0)) & \" \" & INDEX(labels!A56:C56,1,MATCH(PP_Language,labels!A1:C1,0)) & \" \" & BasisOfPreparationAxis & \"  {\"&COLUMN(F1255)&\"}\"","v":"/notes-remuneration-of-executive-senior-officials-considered-four-years-specification De naam (bestaande uit de voorletters en achternaam) van de topfunctionaris Enkelvoudig Commercial  {6}"},{"$f":"\"/notes-remuneration-of-executive-senior-officials-considered-four-years-specification \" & INDEX(labels!A637:C637,1,MATCH(PP_Language,labels!A1:C1,0)) & \" \" & INDEX(labels!A56:C56,1,MATCH(PP_Language,labels!A1:C1,0)) & \" \" & BasisOfPreparationAxis & \"  {\"&COLUMN(G1255)&\"}\"","v":"/notes-remuneration-of-executive-senior-officials-considered-four-years-specification De naam (bestaande uit de voorletters en achternaam) van de topfunctionaris Enkelvoudig Commercial  {7}"},{"$f":"\"/notes-remuneration-of-executive-senior-officials-considered-four-years-specification \" & INDEX(labels!A637:C637,1,MATCH(PP_Language,labels!A1:C1,0)) & \" \" & INDEX(labels!A56:C56,1,MATCH(PP_Language,labels!A1:C1,0)) & \" \" & BasisOfPreparationAxis & \"  {\"&COLUMN(H1255)&\"}\"","v":"/notes-remuneration-of-executive-senior-officials-considered-four-years-specification De naam (bestaande uit de voorletters en achternaam) van de topfunctionaris Enkelvoudig Commercial  {8}"}]
["",{"$f":"INDEX(labels!A696:C696,1,MATCH(PP_Language,labels!A1:C1,0))","v":"Omschrijving De naam (bestaande uit de voorletters en achternaam) van de topfunctionaris"}]
["",{"$f":"INDEX(labels!A697:C697,1,MATCH(PP_Language,labels!A1:C1,0))","v":"Bezoldiging voor de werkzaamheden als topfunctionaris"},"-"]
["",{"$f":"INDEX(labels!A698:C698,1,MATCH(PP_Language,labels!A1:C1,0))","v":"Bezoldiging voor andere werkzaamheden dan die als topfunctionaris"},"-"]
["",{"$f":"INDEX(labels!A699:C699,1,MATCH(PP_Language,labels!A1:C1,0))","v":"Bezoldiging voor de werkzaamheden bij gelieerde rechtspersonen"},"-"]
["",{"$f":"INDEX(labels!A700:C700,1,MATCH(PP_Language,labels!A1:C1,0))","v":"Dubbeltellingen door doorbelastingen"},"+"]
[""]
["",{"$f":"INDEX(labels!A701:C701,1,MATCH(PP_Language,labels!A1:C1,0))","v":"Subtotaal bezoldiging"},"-",{"$f":"IF(OR(NOT(Stamdata!D1262=\"\"),NOT(AND(Stamdata!D1259=\"\",Stamdata!D1260=\"\",Stamdata!D1261=\"\"))), - Stamdata!D1262+ SUM(Stamdata!D1259,Stamdata!D1260,Stamdata!D1261),\"\")","v":""},{"$f":"IF(OR(NOT(Stamdata!E1262=\"\"),NOT(AND(Stamdata!E1259=\"\",Stamdata!E1260=\"\",Stamdata!E1261=\"\"))), - Stamdata!E1262+ SUM(Stamdata!E1259,Stamdata!E1260,Stamdata!E1261),\"\")","v":""},{"$f":"IF(OR(NOT(Stamdata!F1262=\"\"),NOT(AND(Stamdata!F1259=\"\",Stamdata!F1260=\"\",Stamdata!F1261=\"\"))), - Stamdata!F1262+ SUM(Stamdata!F1259,Stamdata!F1260,Stamdata!F1261),\"\")","v":""},{"$f":"IF(OR(NOT(Stamdata!G1262=\"\"),NOT(AND(Stamdata!G1259=\"\",Stamdata!G1260=\"\",Stamdata!G1261=\"\"))), - Stamdata!G1262+ SUM(Stamdata!G1259,Stamdata!G1260,Stamdata!G1261),\"\")","v":""},{"$f":"IF(OR(NOT(Stamdata!H1262=\"\"),NOT(AND(Stamdata!H1259=\"\",Stamdata!H1260=\"\",Stamdata!H1261=\"\"))), - Stamdata!H1262+ SUM(Stamdata!H1259,Stamdata!H1260,Stamdata!H1261),\"\")","v":""}]
["",{"$f":"INDEX(labels!A702:C702,1,MATCH(PP_Language,labels!A1:C1,0))","v":"Naam WNT instelling met betrekking tot de werkzaamheden als topfunctionaris"},""]
["",{"$f":"INDEX(labels!A703:C703,1,MATCH(PP_Language,labels!A1:C1,0))","v":"Naam WNT instelling met betrekking tot andere werkzaamheden dan die als topfunctionaris"},""]
["",{"$f":"INDEX(labels!A704:C704,1,MATCH(PP_Language,labels!A1:C1,0))","v":"Naam WNT instelling met betrekking tot de werkzaamheden bij gelieerde rechtspersonen"},""]
["",{"$f":"INDEX(labels!A705:C705,1,MATCH(PP_Language,labels!A1:C1,0))","v":"Het voor de WNT-instelling geldende bezoldigingsmaximum dan wel een voor de individuele topfunctionaris toegestane hogere bezoldiging"},"-"]
["",{"$f":"INDEX(labels!A646:C646,1,MATCH(PP_Language,labels!A1:C1,0))","v":"Onverschuldigd betaald en nog niet terugontvangen bedrag"},"+"]
["",{"$f":"INDEX(labels!A682:C682,1,MATCH(PP_Language,labels!A1:C1,0))","v":"Totaal van bezoldiging"},"-"]
["",{"$f":"INDEX(labels!A647:C647,1,MATCH(PP_Language,labels!A1:C1,0))","v":"Het bedrag van de overschrijding"},"-"]
["",{"$f":"INDEX(labels!A648:C648,1,MATCH(PP_Language,labels!A1:C1,0))","v":"Reden waarom de overschrijding al dan niet is toegestaan"},""]
["",{"$f":"INDEX(labels!A649:C649,1,MATCH(PP_Language,labels!A1:C1,0))","v":"Toelichting op de vordering wegens onverschuldigde betaling"},""]
["",{"$f":"INDEX(labels!A650:C650,1,MATCH(PP_Language,labels!A1:C1,0))","v":"Foutenherstel in verantwoording WNT"},""]
["",{"$f":"INDEX(labels!A651:C651,1,MATCH(PP_Language,labels!A1:C1,0))","v":"Toelichting op verschil en oorzaak foutenherstel"},""]
["",{"$f":"INDEX(labels!A141:C141,1,MATCH(PP_Language,labels!A1:C1,0))","v":"Presentatievolgorde"},""]
[""]
["",null,null,null,null,null,null,null,null,null,null,null,null,null,null,null,null,null,null,null,null,null,null,null,null,{"$f":"\"//notes-remuneration-of-executive-senior-officials-considered-four-years-specification label {\"&COLUMN(B1276)&\"}\"","v":"//notes-remuneration-of-executive-senior-officials-considered-four-years-specification label {2}"},null,{"$f":"\"//notes-remuneration-of-executive-senior-officials-considered-four-years-specification \" & INDEX(labels!A637:C637,1,MATCH(PP_Language,labels!A1:C1,0)) & \" \" & INDEX(labels!A56:C56,1,MATCH(PP_Language,labels!A1:C1,0)) & \" \" & BasisOfPreparationAxis & \"  {\"&COLUMN(D1276)&\"}\"","v":"//notes-remuneration-of-executive-senior-officials-considered-four-years-specification De naam (bestaande uit de voorletters en achternaam) van de topfunctionaris Enkelvoudig Commercial  {4}"},{"$f":"\"//notes-remuneration-of-executive-senior-officials-considered-four-years-specification \" & INDEX(labels!A637:C637,1,MATCH(PP_Language,labels!A1:C1,0)) & \" \" & INDEX(labels!A56:C56,1,MATCH(PP_Language,labels!A1:C1,0)) & \" \" & BasisOfPreparationAxis & \"  {\"&COLUMN(E1276)&\"}\"","v":"//notes-remuneration-of-executive-senior-officials-considered-four-years-specification De naam (bestaande uit de voorletters en achternaam) van de topfunctionaris Enkelvoudig Commercial  {5}"},{"$f":"\"//notes-remuneration-of-executive-senior-officials-considered-four-years-specification \" & INDEX(labels!A637:C637,1,MATCH(PP_Language,labels!A1:C1,0)) & \" \" & INDEX(labels!A56:C56,1,MATCH(PP_Language,labels!A1:C1,0)) & \" \" & BasisOfPreparationAxis & \"  {\"&COLUMN(F1276)&\"}\"","v":"//notes-remuneration-of-executive-senior-officials-considered-four-years-specification De naam (bestaande uit de voorletters en achternaam) van de topfunctionaris Enkelvoudig Commercial  {6}"},{"$f":"\"//notes-remuneration-of-executive-senior-officials-considered-four-years-specification \" & INDEX(labels!A637:C637,1,MATCH(PP_Language,labels!A1:C1,0)) & \" \" & INDEX(labels!A56:C56,1,MATCH(PP_Language,labels!A1:C1,0)) & \" \" & BasisOfPreparationAxis & \"  {\"&COLUMN(G1276)&\"}\"","v":"//notes-remuneration-of-executive-senior-officials-considered-four-years-specification De naam (bestaande uit de voorletters en achternaam) van de topfunctionaris Enkelvoudig Commercial  {7}"},{"$f":"\"//notes-remuneration-of-executive-senior-officials-considered-four-years-specification \" & INDEX(labels!A637:C637,1,MATCH(PP_Language,labels!A1:C1,0)) & \" \" & INDEX(labels!A56:C56,1,MATCH(PP_Language,labels!A1:C1,0)) & \" \" & BasisOfPreparationAxis & \"  {\"&COLUMN(H1276)&\"}\"","v":"//notes-remuneration-of-executive-senior-officials-considered-four-years-specification De naam (bestaande uit de voorletters en achternaam) van de topfunctionaris Enkelvoudig Commercial  {8}"}]
["",{"$f":"INDEX(labels!A706:C706,1,MATCH(PP_Language,labels!A1:C1,0))","v":"Toelichting op de jaarrekening - Totale bezoldiging van een topfunctionaris alsmede degene die op grond van zijn/haar voormalige functie nog 4 jaar als topfunctionaris wordt aangemerkt, voorgaande periode: Specificatie"}]
["",null,null,{"$f":"INDEX(labels!A57:C57,1,MATCH(PP_Language,labels!A1:C1,0))","v":"Voorgaand"}]
[""]
["",null,null,{"$f":"\" \"  & INDEX(labels!A637:C637,1,MATCH(PP_Language,labels!A1:C1,0)) &  \"  \"  & INDEX(labels!A56:C56,1,MATCH(PP_Language,labels!A1:C1,0)) &  \" \"","v":" De naam (bestaande uit de voorletters en achternaam) van de topfunctionaris  Enkelvoudig "},{"$f":"\" \"  & INDEX(labels!A637:C637,1,MATCH(PP_Language,labels!A1:C1,0)) &  \"  \"  & INDEX(labels!A56:C56,1,MATCH(PP_Language,labels!A1:C1,0)) &  \" \"","v":" De naam (bestaande uit de voorletters en achternaam) van de topfunctionaris  Enkelvoudig "},{"$f":"\" \"  & INDEX(labels!A637:C637,1,MATCH(PP_Language,labels!A1:C1,0)) &  \"  \"  & INDEX(labels!A56:C56,1,MATCH(PP_Language,labels!A1:C1,0)) &  \" \"","v":" De naam (bestaande uit de voorletters en achternaam) van de topfunctionaris  Enkelvoudig "},{"$f":"\" \"  & INDEX(labels!A637:C637,1,MATCH(PP_Language,labels!A1:C1,0)) &  \"  \"  & INDEX(labels!A56:C56,1,MATCH(PP_Language,labels!A1:C1,0)) &  \" \"","v":" De naam (bestaande uit de voorletters en achternaam) van de topfunctionaris  Enkelvoudig "},{"$f":"\" \"  & INDEX(labels!A637:C637,1,MATCH(PP_Language,labels!A1:C1,0)) &  \"  \"  & INDEX(labels!A56:C56,1,MATCH(PP_Language,labels!A1:C1,0)) &  \" \"","v":" De naam (bestaande uit de voorletters en achternaam) van de topfunctionaris  Enkelvoudig "},null,null,null,null,null,null,null,null,null,null,null,null,null,null,null,null,null,{"$f":"\"/notes-remuneration-of-executive-senior-officials-considered-four-years-previous-specification label {\"&COLUMN(B1280)&\"}\"","v":"/notes-remuneration-of-executive-senior-officials-considered-four-years-previous-specification label {2}"},null,{"$f":"\"/notes-remuneration-of-executive-senior-officials-considered-four-years-previous-specification \" & INDEX(labels!A637:C637,1,MATCH(PP_Language,labels!A1:C1,0)) & \" \" & INDEX(labels!A56:C56,1,MATCH(PP_Language,labels!A1:C1,0)) & \" \" & BasisOfPreparationAxis & \"  {\"&COLUMN(D1280)&\"}\"","v":"/notes-remuneration-of-executive-senior-officials-considered-four-years-previous-specification De naam (bestaande uit de voorletters en achternaam) van de topfunctionaris Enkelvoudig Commercial  {4}"},{"$f":"\"/notes-remuneration-of-executive-senior-officials-considered-four-years-previous-specification \" & INDEX(labels!A637:C637,1,MATCH(PP_Language,labels!A1:C1,0)) & \" \" & INDEX(labels!A56:C56,1,MATCH(PP_Language,labels!A1:C1,0)) & \" \" & BasisOfPreparationAxis & \"  {\"&COLUMN(E1280)&\"}\"","v":"/notes-remuneration-of-executive-senior-officials-considered-four-years-previous-specification De naam (bestaande uit de voorletters en achternaam) van de topfunctionaris Enkelvoudig Commercial  {5}"},{"$f":"\"/notes-remuneration-of-executive-senior-officials-considered-four-years-previous-specification \" & INDEX(labels!A637:C637,1,MATCH(PP_Language,labels!A1:C1,0)) & \" \" & INDEX(labels!A56:C56,1,MATCH(PP_Language,labels!A1:C1,0)) & \" \" & BasisOfPreparationAxis & \"  {\"&COLUMN(F1280)&\"}\"","v":"/notes-remuneration-of-executive-senior-officials-considered-four-years-previous-specification De naam (bestaande uit de voorletters en achternaam) van de topfunctionaris Enkelvoudig Commercial  {6}"},{"$f":"\"/notes-remuneration-of-executive-senior-officials-considered-four-years-previous-specification \" & INDEX(labels!A637:C637,1,MATCH(PP_Language,labels!A1:C1,0)) & \" \" & INDEX(labels!A56:C56,1,MATCH(PP_Language,labels!A1:C1,0)) & \" \" & BasisOfPreparationAxis & \"  {\"&COLUMN(G1280)&\"}\"","v":"/notes-remuneration-of-executive-senior-officials-considered-four-years-previous-specification De naam (bestaande uit de voorletters en achternaam) van de topfunctionaris Enkelvoudig Commercial  {7}"},{"$f":"\"/notes-remuneration-of-executive-senior-officials-considered-four-years-previous-specification \" & INDEX(labels!A637:C637,1,MATCH(PP_Language,labels!A1:C1,0)) & \" \" & INDEX(labels!A56:C56,1,MATCH(PP_Language,labels!A1:C1,0)) & \" \" & BasisOfPreparationAxis & \"  {\"&COLUMN(H1280)&\"}\"","v":"/notes-remuneration-of-executive-senior-officials-considered-four-years-previous-specification De naam (bestaande uit de voorletters en achternaam) van de topfunctionaris Enkelvoudig Commercial  {8}"}]
["",{"$f":"INDEX(labels!A707:C707,1,MATCH(PP_Language,labels!A1:C1,0))","v":"Omschrijving De naam (bestaande uit de voorletters en achternaam) van de topfunctionaris"}]
["",{"$f":"INDEX(labels!A697:C697,1,MATCH(PP_Language,labels!A1:C1,0))","v":"Bezoldiging voor de werkzaamheden als topfunctionaris"},"-"]
["",{"$f":"INDEX(labels!A698:C698,1,MATCH(PP_Language,labels!A1:C1,0))","v":"Bezoldiging voor andere werkzaamheden dan die als topfunctionaris"},"-"]
["",{"$f":"INDEX(labels!A699:C699,1,MATCH(PP_Language,labels!A1:C1,0))","v":"Bezoldiging voor de werkzaamheden bij gelieerde rechtspersonen"},"-"]
["",{"$f":"INDEX(labels!A700:C700,1,MATCH(PP_Language,labels!A1:C1,0))","v":"Dubbeltellingen door doorbelastingen"},"+"]
[""]
["",{"$f":"INDEX(labels!A701:C701,1,MATCH(PP_Language,labels!A1:C1,0))","v":"Subtotaal bezoldiging"},"-"]
["",{"$f":"INDEX(labels!A702:C702,1,MATCH(PP_Language,labels!A1:C1,0))","v":"Naam WNT instelling met betrekking tot de werkzaamheden als topfunctionaris"},""]
["",{"$f":"INDEX(labels!A703:C703,1,MATCH(PP_Language,labels!A1:C1,0))","v":"Naam WNT instelling met betrekking tot andere werkzaamheden dan die als topfunctionaris"},""]
["",{"$f":"INDEX(labels!A704:C704,1,MATCH(PP_Language,labels!A1:C1,0))","v":"Naam WNT instelling met betrekking tot de werkzaamheden bij gelieerde rechtspersonen"},""]
["",{"$f":"INDEX(labels!A705:C705,1,MATCH(PP_Language,labels!A1:C1,0))","v":"Het voor de WNT-instelling geldende bezoldigingsmaximum dan wel een voor de individuele topfunctionaris toegestane hogere bezoldiging"},"-"]
["",{"$f":"INDEX(labels!A682:C682,1,MATCH(PP_Language,labels!A1:C1,0))","v":"Totaal van bezoldiging"},"-"]
["",{"$f":"INDEX(labels!A141:C141,1,MATCH(PP_Language,labels!A1:C1,0))","v":"Presentatievolgorde"},""]
[""]
["",null,null,null,null,null,null,null,null,null,null,null,null,null,null,null,null,null,null,null,null,null,null,null,null,{"$f":"\"//notes-remuneration-of-executive-senior-officials-considered-four-years-previous-specification label {\"&COLUMN(B1295)&\"}\"","v":"//notes-remuneration-of-executive-senior-officials-considered-four-years-previous-specification label {2}"},null,{"$f":"\"//notes-remuneration-of-executive-senior-officials-considered-four-years-previous-specification \" & INDEX(labels!A637:C637,1,MATCH(PP_Language,labels!A1:C1,0)) & \" \" & INDEX(labels!A56:C56,1,MATCH(PP_Language,labels!A1:C1,0)) & \" \" & BasisOfPreparationAxis & \"  {\"&COLUMN(D1295)&\"}\"","v":"//notes-remuneration-of-executive-senior-officials-considered-four-years-previous-specification De naam (bestaande uit de voorletters en achternaam) van de topfunctionaris Enkelvoudig Commercial  {4}"},{"$f":"\"//notes-remuneration-of-executive-senior-officials-considered-four-years-previous-specification \" & INDEX(labels!A637:C637,1,MATCH(PP_Language,labels!A1:C1,0)) & \" \" & INDEX(labels!A56:C56,1,MATCH(PP_Language,labels!A1:C1,0)) & \" \" & BasisOfPreparationAxis & \"  {\"&COLUMN(E1295)&\"}\"","v":"//notes-remuneration-of-executive-senior-officials-considered-four-years-previous-specification De naam (bestaande uit de voorletters en achternaam) van de topfunctionaris Enkelvoudig Commercial  {5}"},{"$f":"\"//notes-remuneration-of-executive-senior-officials-considered-four-years-previous-specification \" & INDEX(labels!A637:C637,1,MATCH(PP_Language,labels!A1:C1,0)) & \" \" & INDEX(labels!A56:C56,1,MATCH(PP_Language,labels!A1:C1,0)) & \" \" & BasisOfPreparationAxis & \"  {\"&COLUMN(F1295)&\"}\"","v":"//notes-remuneration-of-executive-senior-officials-considered-four-years-previous-specification De naam (bestaande uit de voorletters en achternaam) van de topfunctionaris Enkelvoudig Commercial  {6}"},{"$f":"\"//notes-remuneration-of-executive-senior-officials-considered-four-years-previous-specification \" & INDEX(labels!A637:C637,1,MATCH(PP_Language,labels!A1:C1,0)) & \" \" & INDEX(labels!A56:C56,1,MATCH(PP_Language,labels!A1:C1,0)) & \" \" & BasisOfPreparationAxis & \"  {\"&COLUMN(G1295)&\"}\"","v":"//notes-remuneration-of-executive-senior-officials-considered-four-years-previous-specification De naam (bestaande uit de voorletters en achternaam) van de topfunctionaris Enkelvoudig Commercial  {7}"},{"$f":"\"//notes-remuneration-of-executive-senior-officials-considered-four-years-previous-specification \" & INDEX(labels!A637:C637,1,MATCH(PP_Language,labels!A1:C1,0)) & \" \" & INDEX(labels!A56:C56,1,MATCH(PP_Language,labels!A1:C1,0)) & \" \" & BasisOfPreparationAxis & \"  {\"&COLUMN(H1295)&\"}\"","v":"//notes-remuneration-of-executive-senior-officials-considered-four-years-previous-specification De naam (bestaande uit de voorletters en achternaam) van de topfunctionaris Enkelvoudig Commercial  {8}"}]
["",{"$f":"INDEX(labels!A708:C708,1,MATCH(PP_Language,labels!A1:C1,0))","v":"Bezoldiging van niet toezichthoudende topfunctionarissen die reeds dienstbetrekking hebben bij andere WNT-instelling: Specificatie"}]
["",{"$f":"INDEX(labels!A709:C709,1,MATCH(PP_Language,labels!A1:C1,0))","v":"Toelichting op de jaarrekening - Bezoldiging van niet toezichthoudende topfunctionarissen die reeds dienstbetrekking hebben bij andere WNT-instelling: Specificatie"}]
["",null,null,{"$f":"INDEX(labels!A55:C55,1,MATCH(PP_Language,labels!A1:C1,0))","v":"Huidig"}]
[""]
["",null,null,{"$f":"\" \"  & INDEX(labels!A710:C710,1,MATCH(PP_Language,labels!A1:C1,0)) &  \"  \"  & INDEX(labels!A56:C56,1,MATCH(PP_Language,labels!A1:C1,0)) &  \" \"","v":" De naam (bestaande uit de voorletters en achternaam) van de niet toezichthoudende topfunctionaris  Enkelvoudig "},{"$f":"\" \"  & INDEX(labels!A710:C710,1,MATCH(PP_Language,labels!A1:C1,0)) &  \"  \"  & INDEX(labels!A56:C56,1,MATCH(PP_Language,labels!A1:C1,0)) &  \" \"","v":" De naam (bestaande uit de voorletters en achternaam) van de niet toezichthoudende topfunctionaris  Enkelvoudig "},{"$f":"\" \"  & INDEX(labels!A710:C710,1,MATCH(PP_Language,labels!A1:C1,0)) &  \"  \"  & INDEX(labels!A56:C56,1,MATCH(PP_Language,labels!A1:C1,0)) &  \" \"","v":" De naam (bestaande uit de voorletters en achternaam) van de niet toezichthoudende topfunctionaris  Enkelvoudig "},{"$f":"\" \"  & INDEX(labels!A710:C710,1,MATCH(PP_Language,labels!A1:C1,0)) &  \"  \"  & INDEX(labels!A56:C56,1,MATCH(PP_Language,labels!A1:C1,0)) &  \" \"","v":" De naam (bestaande uit de voorletters en achternaam) van de niet toezichthoudende topfunctionaris  Enkelvoudig "},{"$f":"\" \"  & INDEX(labels!A710:C710,1,MATCH(PP_Language,labels!A1:C1,0)) &  \"  \"  & INDEX(labels!A56:C56,1,MATCH(PP_Language,labels!A1:C1,0)) &  \" \"","v":" De naam (bestaande uit de voorletters en achternaam) van de niet toezichthoudende topfunctionaris  Enkelvoudig "},null,null,null,null,null,null,null,null,null,null,null,null,null,null,null,null,null,{"$f":"\"/notes-remuneration-non-supervisory-senior-officials-other-wnt-institution-specification label {\"&COLUMN(B1300)&\"}\"","v":"/notes-remuneration-non-supervisory-senior-officials-other-wnt-institution-specification label {2}"},null,{"$f":"\"/notes-remuneration-non-supervisory-senior-officials-other-wnt-institution-specification \" & INDEX(labels!A710:C710,1,MATCH(PP_Language,labels!A1:C1,0)) & \" \" & INDEX(labels!A56:C56,1,MATCH(PP_Language,labels!A1:C1,0)) & \" \" & BasisOfPreparationAxis & \"  {\"&COLUMN(D1300)&\"}\"","v":"/notes-remuneration-non-supervisory-senior-officials-other-wnt-institution-specification De naam (bestaande uit de voorletters en achternaam) van de niet toezichthoudende topfunctionaris Enkelvoudig Commercial  {4}"},{"$f":"\"/notes-remuneration-non-supervisory-senior-officials-other-wnt-institution-specification \" & INDEX(labels!A710:C710,1,MATCH(PP_Language,labels!A1:C1,0)) & \" \" & INDEX(labels!A56:C56,1,MATCH(PP_Language,labels!A1:C1,0)) & \" \" & BasisOfPreparationAxis & \"  {\"&COLUMN(E1300)&\"}\"","v":"/notes-remuneration-non-supervisory-senior-officials-other-wnt-institution-specification De naam (bestaande uit de voorletters en achternaam) van de niet toezichthoudende topfunctionaris Enkelvoudig Commercial  {5}"},{"$f":"\"/notes-remuneration-non-supervisory-senior-officials-other-wnt-institution-specification \" & INDEX(labels!A710:C710,1,MATCH(PP_Language,labels!A1:C1,0)) & \" \" & INDEX(labels!A56:C56,1,MATCH(PP_Language,labels!A1:C1,0)) & \" \" & BasisOfPreparationAxis & \"  {\"&COLUMN(F1300)&\"}\"","v":"/notes-remuneration-non-supervisory-senior-officials-other-wnt-institution-specification De naam (bestaande uit de voorletters en achternaam) van de niet toezichthoudende topfunctionaris Enkelvoudig Commercial  {6}"},{"$f":"\"/notes-remuneration-non-supervisory-senior-officials-other-wnt-institution-specification \" & INDEX(labels!A710:C710,1,MATCH(PP_Language,labels!A1:C1,0)) & \" \" & INDEX(labels!A56:C56,1,MATCH(PP_Language,labels!A1:C1,0)) & \" \" & BasisOfPreparationAxis & \"  {\"&COLUMN(G1300)&\"}\"","v":"/notes-remuneration-non-supervisory-senior-officials-other-wnt-institution-specification De naam (bestaande uit de voorletters en achternaam) van de niet toezichthoudende topfunctionaris Enkelvoudig Commercial  {7}"},{"$f":"\"/notes-remuneration-non-supervisory-senior-officials-other-wnt-institution-specification \" & INDEX(labels!A710:C710,1,MATCH(PP_Language,labels!A1:C1,0)) & \" \" & INDEX(labels!A56:C56,1,MATCH(PP_Language,labels!A1:C1,0)) & \" \" & BasisOfPreparationAxis & \"  {\"&COLUMN(H1300)&\"}\"","v":"/notes-remuneration-non-supervisory-senior-officials-other-wnt-institution-specification De naam (bestaande uit de voorletters en achternaam) van de niet toezichthoudende topfunctionaris Enkelvoudig Commercial  {8}"}]
["",{"$f":"INDEX(labels!A711:C711,1,MATCH(PP_Language,labels!A1:C1,0))","v":"Omschrijving De naam (bestaande uit de voorletters en achternaam) van de niet toezichthoudende topfunctionaris"}]
["",{"$f":"INDEX(labels!A712:C712,1,MATCH(PP_Language,labels!A1:C1,0))","v":"Datum aanvang dienstbetrekking"},""]
["",{"$f":"INDEX(labels!A713:C713,1,MATCH(PP_Language,labels!A1:C1,0))","v":"Totale bezoldiging per WNT-instelling bedragen x € 1"},"-"]
["",{"$f":"INDEX(labels!A141:C141,1,MATCH(PP_Language,labels!A1:C1,0))","v":"Presentatievolgorde"},""]
[""]
["",null,null,null,null,null,null,null,null,null,null,null,null,null,null,null,null,null,null,null,null,null,null,null,null,{"$f":"\"//notes-remuneration-non-supervisory-senior-officials-other-wnt-institution-specification label {\"&COLUMN(B1306)&\"}\"","v":"//notes-remuneration-non-supervisory-senior-officials-other-wnt-institution-specification label {2}"},null,{"$f":"\"//notes-remuneration-non-supervisory-senior-officials-other-wnt-institution-specification \" & INDEX(labels!A710:C710,1,MATCH(PP_Language,labels!A1:C1,0)) & \" \" & INDEX(labels!A56:C56,1,MATCH(PP_Language,labels!A1:C1,0)) & \" \" & BasisOfPreparationAxis & \"  {\"&COLUMN(D1306)&\"}\"","v":"//notes-remuneration-non-supervisory-senior-officials-other-wnt-institution-specification De naam (bestaande uit de voorletters en achternaam) van de niet toezichthoudende topfunctionaris Enkelvoudig Commercial  {4}"},{"$f":"\"//notes-remuneration-non-supervisory-senior-officials-other-wnt-institution-specification \" & INDEX(labels!A710:C710,1,MATCH(PP_Language,labels!A1:C1,0)) & \" \" & INDEX(labels!A56:C56,1,MATCH(PP_Language,labels!A1:C1,0)) & \" \" & BasisOfPreparationAxis & \"  {\"&COLUMN(E1306)&\"}\"","v":"//notes-remuneration-non-supervisory-senior-officials-other-wnt-institution-specification De naam (bestaande uit de voorletters en achternaam) van de niet toezichthoudende topfunctionaris Enkelvoudig Commercial  {5}"},{"$f":"\"//notes-remuneration-non-supervisory-senior-officials-other-wnt-institution-specification \" & INDEX(labels!A710:C710,1,MATCH(PP_Language,labels!A1:C1,0)) & \" \" & INDEX(labels!A56:C56,1,MATCH(PP_Language,labels!A1:C1,0)) & \" \" & BasisOfPreparationAxis & \"  {\"&COLUMN(F1306)&\"}\"","v":"//notes-remuneration-non-supervisory-senior-officials-other-wnt-institution-specification De naam (bestaande uit de voorletters en achternaam) van de niet toezichthoudende topfunctionaris Enkelvoudig Commercial  {6}"},{"$f":"\"//notes-remuneration-non-supervisory-senior-officials-other-wnt-institution-specification \" & INDEX(labels!A710:C710,1,MATCH(PP_Language,labels!A1:C1,0)) & \" \" & INDEX(labels!A56:C56,1,MATCH(PP_Language,labels!A1:C1,0)) & \" \" & BasisOfPreparationAxis & \"  {\"&COLUMN(G1306)&\"}\"","v":"//notes-remuneration-non-supervisory-senior-officials-other-wnt-institution-specification De naam (bestaande uit de voorletters en achternaam) van de niet toezichthoudende topfunctionaris Enkelvoudig Commercial  {7}"},{"$f":"\"//notes-remuneration-non-supervisory-senior-officials-other-wnt-institution-specification \" & INDEX(labels!A710:C710,1,MATCH(PP_Language,labels!A1:C1,0)) & \" \" & INDEX(labels!A56:C56,1,MATCH(PP_Language,labels!A1:C1,0)) & \" \" & BasisOfPreparationAxis & \"  {\"&COLUMN(H1306)&\"}\"","v":"//notes-remuneration-non-supervisory-senior-officials-other-wnt-institution-specification De naam (bestaande uit de voorletters en achternaam) van de niet toezichthoudende topfunctionaris Enkelvoudig Commercial  {8}"}]
["",{"$f":"INDEX(labels!A714:C714,1,MATCH(PP_Language,labels!A1:C1,0))","v":"Toelichting op de jaarrekening - Bezoldiging van topfunctionaris met een totale bezoldiging van meer dan € 1.900 waarop de anticumulatie bepaling van toepassing is - Gecumuleerd: Specificatie"}]
["",null,null,{"$f":"INDEX(labels!A55:C55,1,MATCH(PP_Language,labels!A1:C1,0))","v":"Huidig"}]
[""]
["",null,null,{"$f":"\" \"  & INDEX(labels!A710:C710,1,MATCH(PP_Language,labels!A1:C1,0)) &  \"  \"  & INDEX(labels!A56:C56,1,MATCH(PP_Language,labels!A1:C1,0)) &  \" \"","v":" De naam (bestaande uit de voorletters en achternaam) van de niet toezichthoudende topfunctionaris  Enkelvoudig "},{"$f":"\" \"  & INDEX(labels!A710:C710,1,MATCH(PP_Language,labels!A1:C1,0)) &  \"  \"  & INDEX(labels!A56:C56,1,MATCH(PP_Language,labels!A1:C1,0)) &  \" \"","v":" De naam (bestaande uit de voorletters en achternaam) van de niet toezichthoudende topfunctionaris  Enkelvoudig "},{"$f":"\" \"  & INDEX(labels!A710:C710,1,MATCH(PP_Language,labels!A1:C1,0)) &  \"  \"  & INDEX(labels!A56:C56,1,MATCH(PP_Language,labels!A1:C1,0)) &  \" \"","v":" De naam (bestaande uit de voorletters en achternaam) van de niet toezichthoudende topfunctionaris  Enkelvoudig "},{"$f":"\" \"  & INDEX(labels!A710:C710,1,MATCH(PP_Language,labels!A1:C1,0)) &  \"  \"  & INDEX(labels!A56:C56,1,MATCH(PP_Language,labels!A1:C1,0)) &  \" \"","v":" De naam (bestaande uit de voorletters en achternaam) van de niet toezichthoudende topfunctionaris  Enkelvoudig "},{"$f":"\" \"  & INDEX(labels!A710:C710,1,MATCH(PP_Language,labels!A1:C1,0)) &  \"  \"  & INDEX(labels!A56:C56,1,MATCH(PP_Language,labels!A1:C1,0)) &  \" \"","v":" De naam (bestaande uit de voorletters en achternaam) van de niet toezichthoudende topfunctionaris  Enkelvoudig "},null,null,null,null,null,null,null,null,null,null,null,null,null,null,null,null,null,{"$f":"\"/notes-senior-officials-remuneration1700or-more-accumulated label {\"&COLUMN(B1310)&\"}\"","v":"/notes-senior-officials-remuneration1700or-more-accumulated label {2}"},null,{"$f":"\"/notes-senior-officials-remuneration1700or-more-accumulated \" & INDEX(labels!A710:C710,1,MATCH(PP_Language,labels!A1:C1,0)) & \" \" & INDEX(labels!A56:C56,1,MATCH(PP_Language,labels!A1:C1,0)) & \" \" & BasisOfPreparationAxis & \"  {\"&COLUMN(D1310)&\"}\"","v":"/notes-senior-officials-remuneration1700or-more-accumulated De naam (bestaande uit de voorletters en achternaam) van de niet toezichthoudende topfunctionaris Enkelvoudig Commercial  {4}"},{"$f":"\"/notes-senior-officials-remuneration1700or-more-accumulated \" & INDEX(labels!A710:C710,1,MATCH(PP_Language,labels!A1:C1,0)) & \" \" & INDEX(labels!A56:C56,1,MATCH(PP_Language,labels!A1:C1,0)) & \" \" & BasisOfPreparationAxis & \"  {\"&COLUMN(E1310)&\"}\"","v":"/notes-senior-officials-remuneration1700or-more-accumulated De naam (bestaande uit de voorletters en achternaam) van de niet toezichthoudende topfunctionaris Enkelvoudig Commercial  {5}"},{"$f":"\"/notes-senior-officials-remuneration1700or-more-accumulated \" & INDEX(labels!A710:C710,1,MATCH(PP_Language,labels!A1:C1,0)) & \" \" & INDEX(labels!A56:C56,1,MATCH(PP_Language,labels!A1:C1,0)) & \" \" & BasisOfPreparationAxis & \"  {\"&COLUMN(F1310)&\"}\"","v":"/notes-senior-officials-remuneration1700or-more-accumulated De naam (bestaande uit de voorletters en achternaam) van de niet toezichthoudende topfunctionaris Enkelvoudig Commercial  {6}"},{"$f":"\"/notes-senior-officials-remuneration1700or-more-accumulated \" & INDEX(labels!A710:C710,1,MATCH(PP_Language,labels!A1:C1,0)) & \" \" & INDEX(labels!A56:C56,1,MATCH(PP_Language,labels!A1:C1,0)) & \" \" & BasisOfPreparationAxis & \"  {\"&COLUMN(G1310)&\"}\"","v":"/notes-senior-officials-remuneration1700or-more-accumulated De naam (bestaande uit de voorletters en achternaam) van de niet toezichthoudende topfunctionaris Enkelvoudig Commercial  {7}"},{"$f":"\"/notes-senior-officials-remuneration1700or-more-accumulated \" & INDEX(labels!A710:C710,1,MATCH(PP_Language,labels!A1:C1,0)) & \" \" & INDEX(labels!A56:C56,1,MATCH(PP_Language,labels!A1:C1,0)) & \" \" & BasisOfPreparationAxis & \"  {\"&COLUMN(H1310)&\"}\"","v":"/notes-senior-officials-remuneration1700or-more-accumulated De naam (bestaande uit de voorletters en achternaam) van de niet toezichthoudende topfunctionaris Enkelvoudig Commercial  {8}"}]
["",{"$f":"INDEX(labels!A715:C715,1,MATCH(PP_Language,labels!A1:C1,0))","v":"Omschrijving De naam (bestaande uit de voorletters en achternaam) van de niet toezichthoudende topfunctionaris"}]
["",{"$f":"INDEX(labels!A716:C716,1,MATCH(PP_Language,labels!A1:C1,0))","v":"Gecumuleerde totale bezoldigingen bij alle WNT-instellingen gezamenlijk i.v.m. anticumulatie bepaling"},"-"]
["",{"$f":"INDEX(labels!A717:C717,1,MATCH(PP_Language,labels!A1:C1,0))","v":"Het algemeen bezoldigingsmaximum dan wel een voor één van de dienstbetrekkingen van toepassing zijnde hoger bezoldigingsmaximum"},"-"]
["",{"$f":"INDEX(labels!A646:C646,1,MATCH(PP_Language,labels!A1:C1,0))","v":"Onverschuldigd betaald en nog niet terugontvangen bedrag"},"+"]
["",{"$f":"INDEX(labels!A647:C647,1,MATCH(PP_Language,labels!A1:C1,0))","v":"Het bedrag van de overschrijding"},"-"]
["",{"$f":"INDEX(labels!A648:C648,1,MATCH(PP_Language,labels!A1:C1,0))","v":"Reden waarom de overschrijding al dan niet is toegestaan"},""]
["",{"$f":"INDEX(labels!A649:C649,1,MATCH(PP_Language,labels!A1:C1,0))","v":"Toelichting op de vordering wegens onverschuldigde betaling"},""]
["",{"$f":"INDEX(labels!A650:C650,1,MATCH(PP_Language,labels!A1:C1,0))","v":"Foutenherstel in verantwoording WNT"},""]
["",{"$f":"INDEX(labels!A651:C651,1,MATCH(PP_Language,labels!A1:C1,0))","v":"Toelichting op verschil en oorzaak foutenherstel"},""]
["",{"$f":"INDEX(labels!A141:C141,1,MATCH(PP_Language,labels!A1:C1,0))","v":"Presentatievolgorde"},""]
[""]
["",null,null,null,null,null,null,null,null,null,null,null,null,null,null,null,null,null,null,null,null,null,null,null,null,{"$f":"\"//notes-senior-officials-remuneration1700or-more-accumulated label {\"&COLUMN(B1322)&\"}\"","v":"//notes-senior-officials-remuneration1700or-more-accumulated label {2}"},null,{"$f":"\"//notes-senior-officials-remuneration1700or-more-accumulated \" & INDEX(labels!A710:C710,1,MATCH(PP_Language,labels!A1:C1,0)) & \" \" & INDEX(labels!A56:C56,1,MATCH(PP_Language,labels!A1:C1,0)) & \" \" & BasisOfPreparationAxis & \"  {\"&COLUMN(D1322)&\"}\"","v":"//notes-senior-officials-remuneration1700or-more-accumulated De naam (bestaande uit de voorletters en achternaam) van de niet toezichthoudende topfunctionaris Enkelvoudig Commercial  {4}"},{"$f":"\"//notes-senior-officials-remuneration1700or-more-accumulated \" & INDEX(labels!A710:C710,1,MATCH(PP_Language,labels!A1:C1,0)) & \" \" & INDEX(labels!A56:C56,1,MATCH(PP_Language,labels!A1:C1,0)) & \" \" & BasisOfPreparationAxis & \"  {\"&COLUMN(E1322)&\"}\"","v":"//notes-senior-officials-remuneration1700or-more-accumulated De naam (bestaande uit de voorletters en achternaam) van de niet toezichthoudende topfunctionaris Enkelvoudig Commercial  {5}"},{"$f":"\"//notes-senior-officials-remuneration1700or-more-accumulated \" & INDEX(labels!A710:C710,1,MATCH(PP_Language,labels!A1:C1,0)) & \" \" & INDEX(labels!A56:C56,1,MATCH(PP_Language,labels!A1:C1,0)) & \" \" & BasisOfPreparationAxis & \"  {\"&COLUMN(F1322)&\"}\"","v":"//notes-senior-officials-remuneration1700or-more-accumulated De naam (bestaande uit de voorletters en achternaam) van de niet toezichthoudende topfunctionaris Enkelvoudig Commercial  {6}"},{"$f":"\"//notes-senior-officials-remuneration1700or-more-accumulated \" & INDEX(labels!A710:C710,1,MATCH(PP_Language,labels!A1:C1,0)) & \" \" & INDEX(labels!A56:C56,1,MATCH(PP_Language,labels!A1:C1,0)) & \" \" & BasisOfPreparationAxis & \"  {\"&COLUMN(G1322)&\"}\"","v":"//notes-senior-officials-remuneration1700or-more-accumulated De naam (bestaande uit de voorletters en achternaam) van de niet toezichthoudende topfunctionaris Enkelvoudig Commercial  {7}"},{"$f":"\"//notes-senior-officials-remuneration1700or-more-accumulated \" & INDEX(labels!A710:C710,1,MATCH(PP_Language,labels!A1:C1,0)) & \" \" & INDEX(labels!A56:C56,1,MATCH(PP_Language,labels!A1:C1,0)) & \" \" & BasisOfPreparationAxis & \"  {\"&COLUMN(H1322)&\"}\"","v":"//notes-senior-officials-remuneration1700or-more-accumulated De naam (bestaande uit de voorletters en achternaam) van de niet toezichthoudende topfunctionaris Enkelvoudig Commercial  {8}"}]
["",{"$f":"INDEX(labels!A718:C718,1,MATCH(PP_Language,labels!A1:C1,0))","v":"Bezoldiging van niet toezichthoudende topfunctionarissen die reeds dienstbetrekking hebben bij andere WNT-instelling: Specificatie, voorgaande periode"}]
["",{"$f":"INDEX(labels!A719:C719,1,MATCH(PP_Language,labels!A1:C1,0))","v":"Toelichting op de jaarrekening - Bezoldiging van niet toezichthoudende topfunctionarissen die reeds dienstbetrekking hebben bij andere WNT-instelling: Specificatie, voorgaande periode"}]
["",null,null,{"$f":"INDEX(labels!A57:C57,1,MATCH(PP_Language,labels!A1:C1,0))","v":"Voorgaand"}]
[""]
["",null,null,{"$f":"\" \"  & INDEX(labels!A710:C710,1,MATCH(PP_Language,labels!A1:C1,0)) &  \"  \"  & INDEX(labels!A56:C56,1,MATCH(PP_Language,labels!A1:C1,0)) &  \" \"","v":" De naam (bestaande uit de voorletters en achternaam) van de niet toezichthoudende topfunctionaris  Enkelvoudig "},{"$f":"\" \"  & INDEX(labels!A710:C710,1,MATCH(PP_Language,labels!A1:C1,0)) &  \"  \"  & INDEX(labels!A56:C56,1,MATCH(PP_Language,labels!A1:C1,0)) &  \" \"","v":" De naam (bestaande uit de voorletters en achternaam) van de niet toezichthoudende topfunctionaris  Enkelvoudig "},{"$f":"\" \"  & INDEX(labels!A710:C710,1,MATCH(PP_Language,labels!A1:C1,0)) &  \"  \"  & INDEX(labels!A56:C56,1,MATCH(PP_Language,labels!A1:C1,0)) &  \" \"","v":" De naam (bestaande uit de voorletters en achternaam) van de niet toezichthoudende topfunctionaris  Enkelvoudig "},{"$f":"\" \"  & INDEX(labels!A710:C710,1,MATCH(PP_Language,labels!A1:C1,0)) &  \"  \"  & INDEX(labels!A56:C56,1,MATCH(PP_Language,labels!A1:C1,0)) &  \" \"","v":" De naam (bestaande uit de voorletters en achternaam) van de niet toezichthoudende topfunctionaris  Enkelvoudig "},{"$f":"\" \"  & INDEX(labels!A710:C710,1,MATCH(PP_Language,labels!A1:C1,0)) &  \"  \"  & INDEX(labels!A56:C56,1,MATCH(PP_Language,labels!A1:C1,0)) &  \" \"","v":" De naam (bestaande uit de voorletters en achternaam) van de niet toezichthoudende topfunctionaris  Enkelvoudig "},null,null,null,null,null,null,null,null,null,null,null,null,null,null,null,null,null,{"$f":"\"/notes-remuneration-non-supervisory-senior-officials-other-wnt-institution-previous-specification label {\"&COLUMN(B1327)&\"}\"","v":"/notes-remuneration-non-supervisory-senior-officials-other-wnt-institution-previous-specification label {2}"},null,{"$f":"\"/notes-remuneration-non-supervisory-senior-officials-other-wnt-institution-previous-specification \" & INDEX(labels!A710:C710,1,MATCH(PP_Language,labels!A1:C1,0)) & \" \" & INDEX(labels!A56:C56,1,MATCH(PP_Language,labels!A1:C1,0)) & \" \" & BasisOfPreparationAxis & \"  {\"&COLUMN(D1327)&\"}\"","v":"/notes-remuneration-non-supervisory-senior-officials-other-wnt-institution-previous-specification De naam (bestaande uit de voorletters en achternaam) van de niet toezichthoudende topfunctionaris Enkelvoudig Commercial  {4}"},{"$f":"\"/notes-remuneration-non-supervisory-senior-officials-other-wnt-institution-previous-specification \" & INDEX(labels!A710:C710,1,MATCH(PP_Language,labels!A1:C1,0)) & \" \" & INDEX(labels!A56:C56,1,MATCH(PP_Language,labels!A1:C1,0)) & \" \" & BasisOfPreparationAxis & \"  {\"&COLUMN(E1327)&\"}\"","v":"/notes-remuneration-non-supervisory-senior-officials-other-wnt-institution-previous-specification De naam (bestaande uit de voorletters en achternaam) van de niet toezichthoudende topfunctionaris Enkelvoudig Commercial  {5}"},{"$f":"\"/notes-remuneration-non-supervisory-senior-officials-other-wnt-institution-previous-specification \" & INDEX(labels!A710:C710,1,MATCH(PP_Language,labels!A1:C1,0)) & \" \" & INDEX(labels!A56:C56,1,MATCH(PP_Language,labels!A1:C1,0)) & \" \" & BasisOfPreparationAxis & \"  {\"&COLUMN(F1327)&\"}\"","v":"/notes-remuneration-non-supervisory-senior-officials-other-wnt-institution-previous-specification De naam (bestaande uit de voorletters en achternaam) van de niet toezichthoudende topfunctionaris Enkelvoudig Commercial  {6}"},{"$f":"\"/notes-remuneration-non-supervisory-senior-officials-other-wnt-institution-previous-specification \" & INDEX(labels!A710:C710,1,MATCH(PP_Language,labels!A1:C1,0)) & \" \" & INDEX(labels!A56:C56,1,MATCH(PP_Language,labels!A1:C1,0)) & \" \" & BasisOfPreparationAxis & \"  {\"&COLUMN(G1327)&\"}\"","v":"/notes-remuneration-non-supervisory-senior-officials-other-wnt-institution-previous-specification De naam (bestaande uit de voorletters en achternaam) van de niet toezichthoudende topfunctionaris Enkelvoudig Commercial  {7}"},{"$f":"\"/notes-remuneration-non-supervisory-senior-officials-other-wnt-institution-previous-specification \" & INDEX(labels!A710:C710,1,MATCH(PP_Language,labels!A1:C1,0)) & \" \" & INDEX(labels!A56:C56,1,MATCH(PP_Language,labels!A1:C1,0)) & \" \" & BasisOfPreparationAxis & \"  {\"&COLUMN(H1327)&\"}\"","v":"/notes-remuneration-non-supervisory-senior-officials-other-wnt-institution-previous-specification De naam (bestaande uit de voorletters en achternaam) van de niet toezichthoudende topfunctionaris Enkelvoudig Commercial  {8}"}]
["",{"$f":"INDEX(labels!A720:C720,1,MATCH(PP_Language,labels!A1:C1,0))","v":"Omschrijving De naam (bestaande uit de voorletters en achternaam) van de niet toezichthoudende topfunctionaris"}]
["",{"$f":"INDEX(labels!A712:C712,1,MATCH(PP_Language,labels!A1:C1,0))","v":"Datum aanvang dienstbetrekking"},""]
["",{"$f":"INDEX(labels!A713:C713,1,MATCH(PP_Language,labels!A1:C1,0))","v":"Totale bezoldiging per WNT-instelling bedragen x € 1"},"-"]
["",{"$f":"INDEX(labels!A141:C141,1,MATCH(PP_Language,labels!A1:C1,0))","v":"Presentatievolgorde"},""]
[""]
["",null,null,null,null,null,null,null,null,null,null,null,null,null,null,null,null,null,null,null,null,null,null,null,null,{"$f":"\"//notes-remuneration-non-supervisory-senior-officials-other-wnt-institution-previous-specification label {\"&COLUMN(B1333)&\"}\"","v":"//notes-remuneration-non-supervisory-senior-officials-other-wnt-institution-previous-specification label {2}"},null,{"$f":"\"//notes-remuneration-non-supervisory-senior-officials-other-wnt-institution-previous-specification \" & INDEX(labels!A710:C710,1,MATCH(PP_Language,labels!A1:C1,0)) & \" \" & INDEX(labels!A56:C56,1,MATCH(PP_Language,labels!A1:C1,0)) & \" \" & BasisOfPreparationAxis & \"  {\"&COLUMN(D1333)&\"}\"","v":"//notes-remuneration-non-supervisory-senior-officials-other-wnt-institution-previous-specification De naam (bestaande uit de voorletters en achternaam) van de niet toezichthoudende topfunctionaris Enkelvoudig Commercial  {4}"},{"$f":"\"//notes-remuneration-non-supervisory-senior-officials-other-wnt-institution-previous-specification \" & INDEX(labels!A710:C710,1,MATCH(PP_Language,labels!A1:C1,0)) & \" \" & INDEX(labels!A56:C56,1,MATCH(PP_Language,labels!A1:C1,0)) & \" \" & BasisOfPreparationAxis & \"  {\"&COLUMN(E1333)&\"}\"","v":"//notes-remuneration-non-supervisory-senior-officials-other-wnt-institution-previous-specification De naam (bestaande uit de voorletters en achternaam) van de niet toezichthoudende topfunctionaris Enkelvoudig Commercial  {5}"},{"$f":"\"//notes-remuneration-non-supervisory-senior-officials-other-wnt-institution-previous-specification \" & INDEX(labels!A710:C710,1,MATCH(PP_Language,labels!A1:C1,0)) & \" \" & INDEX(labels!A56:C56,1,MATCH(PP_Language,labels!A1:C1,0)) & \" \" & BasisOfPreparationAxis & \"  {\"&COLUMN(F1333)&\"}\"","v":"//notes-remuneration-non-supervisory-senior-officials-other-wnt-institution-previous-specification De naam (bestaande uit de voorletters en achternaam) van de niet toezichthoudende topfunctionaris Enkelvoudig Commercial  {6}"},{"$f":"\"//notes-remuneration-non-supervisory-senior-officials-other-wnt-institution-previous-specification \" & INDEX(labels!A710:C710,1,MATCH(PP_Language,labels!A1:C1,0)) & \" \" & INDEX(labels!A56:C56,1,MATCH(PP_Language,labels!A1:C1,0)) & \" \" & BasisOfPreparationAxis & \"  {\"&COLUMN(G1333)&\"}\"","v":"//notes-remuneration-non-supervisory-senior-officials-other-wnt-institution-previous-specification De naam (bestaande uit de voorletters en achternaam) van de niet toezichthoudende topfunctionaris Enkelvoudig Commercial  {7}"},{"$f":"\"//notes-remuneration-non-supervisory-senior-officials-other-wnt-institution-previous-specification \" & INDEX(labels!A710:C710,1,MATCH(PP_Language,labels!A1:C1,0)) & \" \" & INDEX(labels!A56:C56,1,MATCH(PP_Language,labels!A1:C1,0)) & \" \" & BasisOfPreparationAxis & \"  {\"&COLUMN(H1333)&\"}\"","v":"//notes-remuneration-non-supervisory-senior-officials-other-wnt-institution-previous-specification De naam (bestaande uit de voorletters en achternaam) van de niet toezichthoudende topfunctionaris Enkelvoudig Commercial  {8}"}]
["",{"$f":"INDEX(labels!A721:C721,1,MATCH(PP_Language,labels!A1:C1,0))","v":"Toelichting op de jaarrekening - Topfunctionaris met een totale bezoldiging van € 1.900 of minder waarop de anticumulatiebepaling van toepassing is: Specificatie"}]
["",null,null,{"$f":"INDEX(labels!A55:C55,1,MATCH(PP_Language,labels!A1:C1,0))","v":"Huidig"}]
[""]
["",null,null,{"$f":"\" \"  & INDEX(labels!A637:C637,1,MATCH(PP_Language,labels!A1:C1,0)) &  \"  \"  & INDEX(labels!A56:C56,1,MATCH(PP_Language,labels!A1:C1,0)) &  \" \"","v":" De naam (bestaande uit de voorletters en achternaam) van de topfunctionaris  Enkelvoudig "},{"$f":"\" \"  & INDEX(labels!A637:C637,1,MATCH(PP_Language,labels!A1:C1,0)) &  \"  \"  & INDEX(labels!A56:C56,1,MATCH(PP_Language,labels!A1:C1,0)) &  \" \"","v":" De naam (bestaande uit de voorletters en achternaam) van de topfunctionaris  Enkelvoudig "},{"$f":"\" \"  & INDEX(labels!A637:C637,1,MATCH(PP_Language,labels!A1:C1,0)) &  \"  \"  & INDEX(labels!A56:C56,1,MATCH(PP_Language,labels!A1:C1,0)) &  \" \"","v":" De naam (bestaande uit de voorletters en achternaam) van de topfunctionaris  Enkelvoudig "},{"$f":"\" \"  & INDEX(labels!A637:C637,1,MATCH(PP_Language,labels!A1:C1,0)) &  \"  \"  & INDEX(labels!A56:C56,1,MATCH(PP_Language,labels!A1:C1,0)) &  \" \"","v":" De naam (bestaande uit de voorletters en achternaam) van de topfunctionaris  Enkelvoudig "},{"$f":"\" \"  & INDEX(labels!A637:C637,1,MATCH(PP_Language,labels!A1:C1,0)) &  \"  \"  & INDEX(labels!A56:C56,1,MATCH(PP_Language,labels!A1:C1,0)) &  \" \"","v":" De naam (bestaande uit de voorletters en achternaam) van de topfunctionaris  Enkelvoudig "},null,null,null,null,null,null,null,null,null,null,null,null,null,null,null,null,null,{"$f":"\"/notes-senior-official-remuneration1700or-less-anti-cumulation-approach label {\"&COLUMN(B1337)&\"}\"","v":"/notes-senior-official-remuneration1700or-less-anti-cumulation-approach label {2}"},null,{"$f":"\"/notes-senior-official-remuneration1700or-less-anti-cumulation-approach \" & INDEX(labels!A637:C637,1,MATCH(PP_Language,labels!A1:C1,0)) & \" \" & INDEX(labels!A56:C56,1,MATCH(PP_Language,labels!A1:C1,0)) & \" \" & BasisOfPreparationAxis & \"  {\"&COLUMN(D1337)&\"}\"","v":"/notes-senior-official-remuneration1700or-less-anti-cumulation-approach De naam (bestaande uit de voorletters en achternaam) van de topfunctionaris Enkelvoudig Commercial  {4}"},{"$f":"\"/notes-senior-official-remuneration1700or-less-anti-cumulation-approach \" & INDEX(labels!A637:C637,1,MATCH(PP_Language,labels!A1:C1,0)) & \" \" & INDEX(labels!A56:C56,1,MATCH(PP_Language,labels!A1:C1,0)) & \" \" & BasisOfPreparationAxis & \"  {\"&COLUMN(E1337)&\"}\"","v":"/notes-senior-official-remuneration1700or-less-anti-cumulation-approach De naam (bestaande uit de voorletters en achternaam) van de topfunctionaris Enkelvoudig Commercial  {5}"},{"$f":"\"/notes-senior-official-remuneration1700or-less-anti-cumulation-approach \" & INDEX(labels!A637:C637,1,MATCH(PP_Language,labels!A1:C1,0)) & \" \" & INDEX(labels!A56:C56,1,MATCH(PP_Language,labels!A1:C1,0)) & \" \" & BasisOfPreparationAxis & \"  {\"&COLUMN(F1337)&\"}\"","v":"/notes-senior-official-remuneration1700or-less-anti-cumulation-approach De naam (bestaande uit de voorletters en achternaam) van de topfunctionaris Enkelvoudig Commercial  {6}"},{"$f":"\"/notes-senior-official-remuneration1700or-less-anti-cumulation-approach \" & INDEX(labels!A637:C637,1,MATCH(PP_Language,labels!A1:C1,0)) & \" \" & INDEX(labels!A56:C56,1,MATCH(PP_Language,labels!A1:C1,0)) & \" \" & BasisOfPreparationAxis & \"  {\"&COLUMN(G1337)&\"}\"","v":"/notes-senior-official-remuneration1700or-less-anti-cumulation-approach De naam (bestaande uit de voorletters en achternaam) van de topfunctionaris Enkelvoudig Commercial  {7}"},{"$f":"\"/notes-senior-official-remuneration1700or-less-anti-cumulation-approach \" & INDEX(labels!A637:C637,1,MATCH(PP_Language,labels!A1:C1,0)) & \" \" & INDEX(labels!A56:C56,1,MATCH(PP_Language,labels!A1:C1,0)) & \" \" & BasisOfPreparationAxis & \"  {\"&COLUMN(H1337)&\"}\"","v":"/notes-senior-official-remuneration1700or-less-anti-cumulation-approach De naam (bestaande uit de voorletters en achternaam) van de topfunctionaris Enkelvoudig Commercial  {8}"}]
["",{"$f":"INDEX(labels!A722:C722,1,MATCH(PP_Language,labels!A1:C1,0))","v":"Omschrijving De naam (bestaande uit de voorletters en achternaam) van de topfunctionaris"}]
["",{"$f":"INDEX(labels!A639:C639,1,MATCH(PP_Language,labels!A1:C1,0))","v":"Functie(s)"},""]
["",{"$f":"INDEX(labels!A723:C723,1,MATCH(PP_Language,labels!A1:C1,0))","v":"Alle andere WNT-instellingen waarbij de leidinggevende topfunctionaris eveneens in dienstbetrekking is als leidinggevende topfunctionaris"},""]
["",{"$f":"INDEX(labels!A646:C646,1,MATCH(PP_Language,labels!A1:C1,0))","v":"Onverschuldigd betaald en nog niet terugontvangen bedrag"},"+"]
["",{"$f":"INDEX(labels!A647:C647,1,MATCH(PP_Language,labels!A1:C1,0))","v":"Het bedrag van de overschrijding"},"-"]
["",{"$f":"INDEX(labels!A648:C648,1,MATCH(PP_Language,labels!A1:C1,0))","v":"Reden waarom de overschrijding al dan niet is toegestaan"},""]
["",{"$f":"INDEX(labels!A649:C649,1,MATCH(PP_Language,labels!A1:C1,0))","v":"Toelichting op de vordering wegens onverschuldigde betaling"},""]
["",{"$f":"INDEX(labels!A650:C650,1,MATCH(PP_Language,labels!A1:C1,0))","v":"Foutenherstel in verantwoording WNT"},""]
["",{"$f":"INDEX(labels!A651:C651,1,MATCH(PP_Language,labels!A1:C1,0))","v":"Toelichting op verschil en oorzaak foutenherstel"},""]
["",{"$f":"INDEX(labels!A141:C141,1,MATCH(PP_Language,labels!A1:C1,0))","v":"Presentatievolgorde"},""]
[""]
["",null,null,null,null,null,null,null,null,null,null,null,null,null,null,null,null,null,null,null,null,null,null,null,null,{"$f":"\"//notes-senior-official-remuneration1700or-less-anti-cumulation-approach label {\"&COLUMN(B1349)&\"}\"","v":"//notes-senior-official-remuneration1700or-less-anti-cumulation-approach label {2}"},null,{"$f":"\"//notes-senior-official-remuneration1700or-less-anti-cumulation-approach \" & INDEX(labels!A637:C637,1,MATCH(PP_Language,labels!A1:C1,0)) & \" \" & INDEX(labels!A56:C56,1,MATCH(PP_Language,labels!A1:C1,0)) & \" \" & BasisOfPreparationAxis & \"  {\"&COLUMN(D1349)&\"}\"","v":"//notes-senior-official-remuneration1700or-less-anti-cumulation-approach De naam (bestaande uit de voorletters en achternaam) van de topfunctionaris Enkelvoudig Commercial  {4}"},{"$f":"\"//notes-senior-official-remuneration1700or-less-anti-cumulation-approach \" & INDEX(labels!A637:C637,1,MATCH(PP_Language,labels!A1:C1,0)) & \" \" & INDEX(labels!A56:C56,1,MATCH(PP_Language,labels!A1:C1,0)) & \" \" & BasisOfPreparationAxis & \"  {\"&COLUMN(E1349)&\"}\"","v":"//notes-senior-official-remuneration1700or-less-anti-cumulation-approach De naam (bestaande uit de voorletters en achternaam) van de topfunctionaris Enkelvoudig Commercial  {5}"},{"$f":"\"//notes-senior-official-remuneration1700or-less-anti-cumulation-approach \" & INDEX(labels!A637:C637,1,MATCH(PP_Language,labels!A1:C1,0)) & \" \" & INDEX(labels!A56:C56,1,MATCH(PP_Language,labels!A1:C1,0)) & \" \" & BasisOfPreparationAxis & \"  {\"&COLUMN(F1349)&\"}\"","v":"//notes-senior-official-remuneration1700or-less-anti-cumulation-approach De naam (bestaande uit de voorletters en achternaam) van de topfunctionaris Enkelvoudig Commercial  {6}"},{"$f":"\"//notes-senior-official-remuneration1700or-less-anti-cumulation-approach \" & INDEX(labels!A637:C637,1,MATCH(PP_Language,labels!A1:C1,0)) & \" \" & INDEX(labels!A56:C56,1,MATCH(PP_Language,labels!A1:C1,0)) & \" \" & BasisOfPreparationAxis & \"  {\"&COLUMN(G1349)&\"}\"","v":"//notes-senior-official-remuneration1700or-less-anti-cumulation-approach De naam (bestaande uit de voorletters en achternaam) van de topfunctionaris Enkelvoudig Commercial  {7}"},{"$f":"\"//notes-senior-official-remuneration1700or-less-anti-cumulation-approach \" & INDEX(labels!A637:C637,1,MATCH(PP_Language,labels!A1:C1,0)) & \" \" & INDEX(labels!A56:C56,1,MATCH(PP_Language,labels!A1:C1,0)) & \" \" & BasisOfPreparationAxis & \"  {\"&COLUMN(H1349)&\"}\"","v":"//notes-senior-official-remuneration1700or-less-anti-cumulation-approach De naam (bestaande uit de voorletters en achternaam) van de topfunctionaris Enkelvoudig Commercial  {8}"}]
["",{"$f":"INDEX(labels!A724:C724,1,MATCH(PP_Language,labels!A1:C1,0))","v":"Op aandelen gebaseerde betalingen"}]
["",{"$f":"INDEX(labels!A725:C725,1,MATCH(PP_Language,labels!A1:C1,0))","v":"Toelichting op de jaarrekening - Op aandelen gebaseerde betalingen"}]
[""]
[""]
["",{"$f":"INDEX(labels!A726:C726,1,MATCH(PP_Language,labels!A1:C1,0))","v":"Informatieverschaffing over op aandelen gebaseerde betalingen"},"",null,null,null,null,null,null,null,null,null,null,null,null,null,null,null,null,null,null,null,null,null,null,{"$f":"\"/notes-share-based-payments label {\"&COLUMN(B1354)&\"}\"","v":"/notes-share-based-payments label {2}"},null,{"$f":"\"/notes-share-based-payments \" & INDEX(labels!A56:C56,1,MATCH(PP_Language,labels!A1:C1,0)) & \" \" & BasisOfPreparationAxis & \"  {\"&COLUMN(D1354)&\"}\"","v":"/notes-share-based-payments Enkelvoudig Commercial  {4}"}]
["",{"$f":"INDEX(labels!A727:C727,1,MATCH(PP_Language,labels!A1:C1,0))","v":"Beschrijving van het beleid ter afdekking van verleende aandelenopties in het kader van op aandelen gebaseerde betalingen"},""]
["",{"$f":"INDEX(labels!A728:C728,1,MATCH(PP_Language,labels!A1:C1,0))","v":"Beschrijving van de positie van verleende en nog niet afgedekte aandelenopties in het kader van op aandelen gebaseerde betalingen"},""]
["",{"$f":"INDEX(labels!A729:C729,1,MATCH(PP_Language,labels!A1:C1,0))","v":"Gemiddelde prijs van ter afdekking ingekochte eigen aandelen in het kader van op aandelen gebaseerde betalingen"},""]
["",{"$f":"INDEX(labels!A730:C730,1,MATCH(PP_Language,labels!A1:C1,0))","v":"Beschrijving van verplichtingen tot aankoop uitstaande (certificaten van) aandelen in het kader van op aandelen gebaseerde betalingen"},""]
[""]
["",null,null,null,null,null,null,null,null,null,null,null,null,null,null,null,null,null,null,null,null,null,null,null,null,{"$f":"\"//notes-share-based-payments label {\"&COLUMN(B1360)&\"}\"","v":"//notes-share-based-payments label {2}"},null,{"$f":"\"//notes-share-based-payments \" & INDEX(labels!A56:C56,1,MATCH(PP_Language,labels!A1:C1,0)) & \" \" & BasisOfPreparationAxis & \"  {\"&COLUMN(D1360)&\"}\"","v":"//notes-share-based-payments Enkelvoudig Commercial  {4}"}]
["",{"$f":"INDEX(labels!A731:C731,1,MATCH(PP_Language,labels!A1:C1,0))","v":"Nog niet uitgeoefende verleende rechten"}]
["",{"$f":"INDEX(labels!A732:C732,1,MATCH(PP_Language,labels!A1:C1,0))","v":"Toelichting op de jaarrekening - Nog niet uitgeoefende verleende rechten"}]
[""]
[""]
["",{"$f":"INDEX(labels!A733:C733,1,MATCH(PP_Language,labels!A1:C1,0))","v":"Informatieverschaffing over nog niet uitgeoefende verleende rechten"},"",null,null,null,null,null,null,null,null,null,null,null,null,null,null,null,null,null,null,null,null,null,null,{"$f":"\"/notes-rights-granted-not-yet-exercised label {\"&COLUMN(B1365)&\"}\"","v":"/notes-rights-granted-not-yet-exercised label {2}"},null,{"$f":"\"/notes-rights-granted-not-yet-exercised \" & INDEX(labels!A56:C56,1,MATCH(PP_Language,labels!A1:C1,0)) & \" \" & BasisOfPreparationAxis & \"  {\"&COLUMN(D1365)&\"}\"","v":"/notes-rights-granted-not-yet-exercised Enkelvoudig Commercial  {4}"}]
["",{"$f":"INDEX(labels!A734:C734,1,MATCH(PP_Language,labels!A1:C1,0))","v":"Beschrijving van de redenen voor de toekenning van rechten aan commissarissen om (certificaten van) aandelen in het kapitaal van de vennootschap of dochtermaatschappij te nemen of te verkrijgen"},""]
["",{"$f":"INDEX(labels!A735:C735,1,MATCH(PP_Language,labels!A1:C1,0))","v":"Beschrijving van de gehanteerde criteria die gelden voor de toekenning of uitoefening van de rechten om (certificaten van) aandelen in het kapitaal van de vennootschap of dochtermaatschappij te nemen of te verkrijgen"},""]
["",{"$f":"INDEX(labels!A736:C736,1,MATCH(PP_Language,labels!A1:C1,0))","v":"Voorwaarden van in het boekjaar verleende rechten om (certificaten van) aandelen in het kapitaal van de vennootschap of dochtermaatschappij te nemen of te verkrijgen"},""]
["",{"$f":"INDEX(labels!A737:C737,1,MATCH(PP_Language,labels!A1:C1,0))","v":"Beschrijving van de belangrijkste voorwaarden die voor uitoefening van de aan het einde van het boekjaar nog niet uitgeoefende verleende rechten gelden"},""]
["",{"$f":"INDEX(labels!A738:C738,1,MATCH(PP_Language,labels!A1:C1,0))","v":"Beschrijving van de financieringsregelingen die bij de toekenning van de aan het einde van het boekjaar nog niet uitgeoefende verleende rechten gelden"},""]
["",{"$f":"INDEX(labels!A739:C739,1,MATCH(PP_Language,labels!A1:C1,0))","v":"Informatieverschaffing over de inkoop van eigen aandelen of plaatsing van nieuwe aandelen ten behoeve van uitoefening van de verleende rechten"},""]
["",{"$f":"INDEX(labels!A740:C740,1,MATCH(PP_Language,labels!A1:C1,0))","v":"Beschrijving van andere gegevens die voor de beoordeling van de waarde van de aan het einde van het boekjaar nog niet uitgeoefende verleende rechten van belang zijn"},""]
["",{"$f":"INDEX(labels!A741:C741,1,MATCH(PP_Language,labels!A1:C1,0))","v":"Informatieverschaffing over de afdekking van verleende rechten"},""]
["",{"$f":"INDEX(labels!A742:C742,1,MATCH(PP_Language,labels!A1:C1,0))","v":"Beschrijving van het beleid ter afdekking van verleende rechten"},""]
["",{"$f":"INDEX(labels!A743:C743,1,MATCH(PP_Language,labels!A1:C1,0))","v":"Beschrijving van verplichtingen tot aankoop uitstaande (certificaten van) aandelen in het kader van de verleende rechten"},""]
["",{"$f":"INDEX(labels!A744:C744,1,MATCH(PP_Language,labels!A1:C1,0))","v":"Soort aandelen of certificaten ervan waarop de aan het einde van het boekjaar nog niet uitgeoefende verleende rechten aanspraak geven"},""]
[""]
["",null,null,null,null,null,null,null,null,null,null,null,null,null,null,null,null,null,null,null,null,null,null,null,null,{"$f":"\"//notes-rights-granted-not-yet-exercised label {\"&COLUMN(B1378)&\"}\"","v":"//notes-rights-granted-not-yet-exercised label {2}"},null,{"$f":"\"//notes-rights-granted-not-yet-exercised \" & INDEX(labels!A56:C56,1,MATCH(PP_Language,labels!A1:C1,0)) & \" \" & BasisOfPreparationAxis & \"  {\"&COLUMN(D1378)&\"}\"","v":"//notes-rights-granted-not-yet-exercised Enkelvoudig Commercial  {4}"}]
["",{"$f":"INDEX(labels!A745:C745,1,MATCH(PP_Language,labels!A1:C1,0))","v":"Leningen, voorschotten en garanties ten behoeve van bestuurders en commissarissen"}]
["",{"$f":"INDEX(labels!A746:C746,1,MATCH(PP_Language,labels!A1:C1,0))","v":"Toelichting op de jaarrekening - Leningen, voorschotten en garanties: Ten behoeve van bestuurders en commissarissen"}]
[""]
[""]
["",{"$f":"INDEX(labels!A747:C747,1,MATCH(PP_Language,labels!A1:C1,0))","v":"Informatieverschaffing over leningen, voorschotten en garanties ten behoeve van bestuurders en commissarissen"},"",null,null,null,null,null,null,null,null,null,null,null,null,null,null,null,null,null,null,null,null,null,null,{"$f":"\"/notes-loans-advances-guarantees label {\"&COLUMN(B1383)&\"}\"","v":"/notes-loans-advances-guarantees label {2}"},null,{"$f":"\"/notes-loans-advances-guarantees \" & INDEX(labels!A56:C56,1,MATCH(PP_Language,labels!A1:C1,0)) & \" \" & BasisOfPreparationAxis & \"  {\"&COLUMN(D1383)&\"}\"","v":"/notes-loans-advances-guarantees Enkelvoudig Commercial  {4}"}]
["",{"$f":"INDEX(labels!A748:C748,1,MATCH(PP_Language,labels!A1:C1,0))","v":"Beschrijving van de belangrijkste overige bepalingen van leningen, voorschotten en garanties ten behoeve van bestuurders en commissarissen"},""]
[""]
["",null,null,null,null,null,null,null,null,null,null,null,null,null,null,null,null,null,null,null,null,null,null,null,null,{"$f":"\"//notes-loans-advances-guarantees label {\"&COLUMN(B1386)&\"}\"","v":"//notes-loans-advances-guarantees label {2}"},null,{"$f":"\"//notes-loans-advances-guarantees \" & INDEX(labels!A56:C56,1,MATCH(PP_Language,labels!A1:C1,0)) & \" \" & BasisOfPreparationAxis & \"  {\"&COLUMN(D1386)&\"}\"","v":"//notes-loans-advances-guarantees Enkelvoudig Commercial  {4}"}]
["",{"$f":"INDEX(labels!A749:C749,1,MATCH(PP_Language,labels!A1:C1,0))","v":"Toelichting op de jaarrekening - Overige toelichtingen"}]
[""]
[""]
["",{"$f":"INDEX(labels!A750:C750,1,MATCH(PP_Language,labels!A1:C1,0))","v":"Informatieverschaffing over afwijkingen van de voorschriften op basis van het inzichtvereiste"},"",null,null,null,null,null,null,null,null,null,null,null,null,null,null,null,null,null,null,null,null,null,null,{"$f":"\"/notes-other-notes label {\"&COLUMN(B1390)&\"}\"","v":"/notes-other-notes label {2}"},null,{"$f":"\"/notes-other-notes \" & INDEX(labels!A56:C56,1,MATCH(PP_Language,labels!A1:C1,0)) & \" \" & BasisOfPreparationAxis & \"  {\"&COLUMN(D1390)&\"}\"","v":"/notes-other-notes Enkelvoudig Commercial  {4}"}]
["",{"$f":"INDEX(labels!A751:C751,1,MATCH(PP_Language,labels!A1:C1,0))","v":"Opgave van de verschillen en redenen die tot aanpassing van de indeling van de balans en winst-en-verliesrekening hebben geleid"},""]
[""]
["",null,null,null,null,null,null,null,null,null,null,null,null,null,null,null,null,null,null,null,null,null,null,null,null,{"$f":"\"//notes-other-notes label {\"&COLUMN(B1393)&\"}\"","v":"//notes-other-notes label {2}"},null,{"$f":"\"//notes-other-notes \" & INDEX(labels!A56:C56,1,MATCH(PP_Language,labels!A1:C1,0)) & \" \" & BasisOfPreparationAxis & \"  {\"&COLUMN(D1393)&\"}\"","v":"//notes-other-notes Enkelvoudig Commercial  {4}"}]
["",{"$f":"INDEX(labels!A752:C752,1,MATCH(PP_Language,labels!A1:C1,0))","v":"Ondertekening van de jaarrekening"}]
["",null,null,{"$f":"INDEX(labels!A55:C55,1,MATCH(PP_Language,labels!A1:C1,0))","v":"Huidig"}]
[""]
["",null,null,{"$f":"\" \"  & INDEX(labels!A753:C753,1,MATCH(PP_Language,labels!A1:C1,0)) &  \" \"","v":" Naam bestuurder, commissaris en vertegenwoordiger "},{"$f":"\" \"  & INDEX(labels!A753:C753,1,MATCH(PP_Language,labels!A1:C1,0)) &  \" \"","v":" Naam bestuurder, commissaris en vertegenwoordiger "},{"$f":"\" \"  & INDEX(labels!A753:C753,1,MATCH(PP_Language,labels!A1:C1,0)) &  \" \"","v":" Naam bestuurder, commissaris en vertegenwoordiger "},{"$f":"\" \"  & INDEX(labels!A753:C753,1,MATCH(PP_Language,labels!A1:C1,0)) &  \" \"","v":" Naam bestuurder, commissaris en vertegenwoordiger "},{"$f":"\" \"  & INDEX(labels!A753:C753,1,MATCH(PP_Language,labels!A1:C1,0)) &  \" \"","v":" Naam bestuurder, commissaris en vertegenwoordiger "},null,null,null,null,null,null,null,null,null,null,null,null,null,null,null,null,null,{"$f":"\"/signing-financial-statements label {\"&COLUMN(B1397)&\"}\"","v":"/signing-financial-statements label {2}"},null,{"$f":"\"/signing-financial-statements \" & INDEX(labels!A753:C753,1,MATCH(PP_Language,labels!A1:C1,0)) & \"  {\"&COLUMN(D1397)&\"}\"","v":"/signing-financial-statements Naam bestuurder, commissaris en vertegenwoordiger  {4}"},{"$f":"\"/signing-financial-statements \" & INDEX(labels!A753:C753,1,MATCH(PP_Language,labels!A1:C1,0)) & \"  {\"&COLUMN(E1397)&\"}\"","v":"/signing-financial-statements Naam bestuurder, commissaris en vertegenwoordiger  {5}"},{"$f":"\"/signing-financial-statements \" & INDEX(labels!A753:C753,1,MATCH(PP_Language,labels!A1:C1,0)) & \"  {\"&COLUMN(F1397)&\"}\"","v":"/signing-financial-statements Naam bestuurder, commissaris en vertegenwoordiger  {6}"},{"$f":"\"/signing-financial-statements \" & INDEX(labels!A753:C753,1,MATCH(PP_Language,labels!A1:C1,0)) & \"  {\"&COLUMN(G1397)&\"}\"","v":"/signing-financial-statements Naam bestuurder, commissaris en vertegenwoordiger  {7}"},{"$f":"\"/signing-financial-statements \" & INDEX(labels!A753:C753,1,MATCH(PP_Language,labels!A1:C1,0)) & \"  {\"&COLUMN(H1397)&\"}\"","v":"/signing-financial-statements Naam bestuurder, commissaris en vertegenwoordiger  {8}"}]
["",{"$f":"INDEX(labels!A754:C754,1,MATCH(PP_Language,labels!A1:C1,0))","v":"Omschrijving Naam bestuurder, commissaris en vertegenwoordiger"}]
["",{"$f":"INDEX(labels!A755:C755,1,MATCH(PP_Language,labels!A1:C1,0))","v":"Soort bestuurder of commissaris"},""]
["",{"$f":"INDEX(labels!A756:C756,1,MATCH(PP_Language,labels!A1:C1,0))","v":"Naam van de rechtspersoon die optreedt als bestuurder of commissaris"},""]
["",{"$f":"INDEX(labels!A757:C757,1,MATCH(PP_Language,labels!A1:C1,0))","v":"Locatie van de ondertekening door bestuurders en commissarissen"},""]
["",{"$f":"INDEX(labels!A758:C758,1,MATCH(PP_Language,labels!A1:C1,0))","v":"Datum van de ondertekening door bestuurders en commissarissen"},""]
["",{"$f":"INDEX(labels!A759:C759,1,MATCH(PP_Language,labels!A1:C1,0))","v":"Ondertekend door bestuurder of commissaris (J/N)"},""]
["",{"$f":"INDEX(labels!A760:C760,1,MATCH(PP_Language,labels!A1:C1,0))","v":"Reden waarom de bestuurder of commissaris niet heeft ondertekend"},""]
["",{"$f":"INDEX(labels!A141:C141,1,MATCH(PP_Language,labels!A1:C1,0))","v":"Presentatievolgorde"},""]
[""]
["",null,null,null,null,null,null,null,null,null,null,null,null,null,null,null,null,null,null,null,null,null,null,null,null,{"$f":"\"//signing-financial-statements label {\"&COLUMN(B1407)&\"}\"","v":"//signing-financial-statements label {2}"},null,{"$f":"\"//signing-financial-statements \" & INDEX(labels!A753:C753,1,MATCH(PP_Language,labels!A1:C1,0)) & \"  {\"&COLUMN(D1407)&\"}\"","v":"//signing-financial-statements Naam bestuurder, commissaris en vertegenwoordiger  {4}"},{"$f":"\"//signing-financial-statements \" & INDEX(labels!A753:C753,1,MATCH(PP_Language,labels!A1:C1,0)) & \"  {\"&COLUMN(E1407)&\"}\"","v":"//signing-financial-statements Naam bestuurder, commissaris en vertegenwoordiger  {5}"},{"$f":"\"//signing-financial-statements \" & INDEX(labels!A753:C753,1,MATCH(PP_Language,labels!A1:C1,0)) & \"  {\"&COLUMN(F1407)&\"}\"","v":"//signing-financial-statements Naam bestuurder, commissaris en vertegenwoordiger  {6}"},{"$f":"\"//signing-financial-statements \" & INDEX(labels!A753:C753,1,MATCH(PP_Language,labels!A1:C1,0)) & \"  {\"&COLUMN(G1407)&\"}\"","v":"//signing-financial-statements Naam bestuurder, commissaris en vertegenwoordiger  {7}"},{"$f":"\"//signing-financial-statements \" & INDEX(labels!A753:C753,1,MATCH(PP_Language,labels!A1:C1,0)) & \"  {\"&COLUMN(H1407)&\"}\"","v":"//signing-financial-statements Naam bestuurder, commissaris en vertegenwoordiger  {8}"}]

{"sheet":"labels","index":1,"n_rows":760,"n_cols":3,"rows_kept":760,"cut":false,"hidden":true,"merged":[]}
["id","en","nl"]
[0,"Document and entity information","Informatie over de rapportage en de rechtspersoon"]
[1,"Entity information","Informatie over de rechtspersoon"]
[2,"Name of the legal entity","Naam van de rechtspersoon"]
[3,"Legal form of the legal entity","Rechtsvorm van de rechtspersoon"]
[4,"Registered office of the legal entity","Zetel van de rechtspersoon"]
[5,"Registration number at the Chamber of Commerce","Registratienummer bij de Kamer van Koophandel"]
[6,"Business names","Handelsnamen"]
[7,"Classification of the legal entity based on the legal size criteria small","Classificatie van de rechtspersoon op basis van de wettelijke groottecriteria klein"]
[8,"SBI-code","SBI-code"]
[9,"Address of the legal entity","Adres van de rechtspersoon"]
[10,"Description of location NL","Locatieomschrijving NL"]
[11,"Street name NL","Straatnaam NL"]
[12,"House number NL","Huisnummer NL"]
[13,"House number addition","Huisnummertoevoeging"]
[14,"PO box number","Postbusnummer"]
[15,"Postal code NL","Postcode NL"]
[16,"Place of residence NL","Vestigingsplaats NL"]
[17,"Description of location abroad","Locatieomschrijving buitenland"]
[18,"Street name abroad","Straatnaam buitenland"]
[19,"House number abroad","Huisnummer buitenland"]
[20,"Postal code abroad","Postcode buitenland"]
[21,"Place of residence abroad","Vestigingsplaats buitenland"]
[22,"Name region","Regionaam"]
[23,"Country name, ISO","Landnaam, ISO"]
[24,"Document information","Informatie over de rapportage"]
[25,"Title of the document","Titel van het document"]
[26,"Start date of the period concerning the financial statement","Startdatum van de periode waarop de jaarrekening betrekking heeft"]
[27,"End date of the period concerning the financial statement","Einddatum van de periode waarop de jaarrekening betrekking heeft"]
[28,"Start date of the previous period concerning the financial statement","Startdatum van de voorgaande periode waarop de jaarrekening betrekking heeft"]
[29,"End date of the previous period concerning the financial statement","Einddatum van de voorgaande periode waarop de jaarrekening betrekking heeft"]
[30,"Reporting period different than annual (Y/N)","Rapportageperiode afwijkend van een jaar (J/N)"]
[31,"Description of the reason for deviating from an annual reporting period","Beschrijving van de reden voor het afwijken van een rapportageperiode van een jaar"]
[32,"Description of the impact on comparative figures when deviating from an annual reporting period","Beschrijving van het effect op de vergelijkende cijfers bij het afwijken van rapportageperiode van een jaar"]
[33,"Basis of preparation","Type grondslag"]
[34,"Financial statement contains financial information of an individual legal entity or a group of companies","Jaarrekening bevat financiële informatie van een individuele rechtspersoon dan wel een groep van maatschappijen"]
[35,"Presentation currency of the document","Rapporteringsvaluta van het document"]
[36,"Units in which the figures in the financial statements are expressed","Geldeenheid waarin de cijfers in de jaarrekening zijn uitgedrukt"]
[37,"Type of income statement","Type winst-en-verliesrekening"]
[38,"Type of cash flow statement","Type kasstroomoverzicht"]
[39,"Date of preparation of the financial statements","Datum van opmaak van de jaarrekening"]
[40,"Financial statements adopted (Y/N)","Jaarrekening vastgesteld (J/N)"]
[41,"Date of adoption of the financial statements","Datum van vaststelling van de jaarrekening"]
[42,"Resubmission of document due to substantive and insurmountable inaccuracies (Y/N)","Heraanlevering van het document op basis van inhoudelijk en onoverkomelijke onjuistheden (J/N)"]
[43,"Explanation of resubmission of the document due to substantive and insurmountable inaccuracies","Toelichting op heraanlevering van het document op basis van inhoudelijk en onoverkomelijke onjuistheden"]
[44,"Resubmission of the document due to technical and/or process-related inaccuracies (Y/N)","Heraanlevering van het document op basis van technische en/of procesmatige onjuistheden (J/N)"]
[45,"Explanation of resubmission of document due to technical and/or process-related inaccuracies","Toelichting op heraanlevering van het document op basis van technische en/of procesmatige onjuistheden"]
[46,"Email address","E-mailadres"]
[47,"Publication WNT in the consolidated and / or statutory annual accounts or financial statements of one of the other legal entities within the group","Publicatie WNT in de geconsolideerde en/of enkelvoudige jaarrekening danwel jaarrekening van een van de andere rechtspersonen binnen de groep"]
[48,"Referral of responsible WNT data to senior official and affiliated legal person(s)","Verwijzing verantwoorde WNT gegevens naar topfunctionaris en gelieerde rechtsperso(o)n(en)"]
[49,"The applicable remuneration maximum for the institution","Het toepasselijke bezoldigingsmaximum voor de instelling"]
[50,"Financial statements","Jaarrekening"]
[51,"Company financial statements","Enkelvoudige jaarrekening"]
[52,"Balance sheet","Balans"]
[53,"Current","Huidig"]
[54,"Separate","Enkelvoudig"]
[55,"Previous","Voorgaand"]
[56,"Balance sheet before or after appropriation of results","Balans voor of na resultaatbestemming"]
[57,"Intangible assets","Immateriële vaste activa"]
[58,"Property, plant and equipment","Materiële vaste activa"]
[59,"Investment properties","Vastgoedbeleggingen"]
[60,"Financial assets","Financiële vaste activa"]
[61,"Total of non-current assets","Totaal van vaste activa"]
[62,"Inventories","Voorraden"]
[63,"Construction contracts","Onderhanden projecten"]
[64,"Receivables","Vorderingen"]
[65,"Securities","Effecten"]
[66,"Cash and cash equivalents","Liquide middelen"]
[67,"Total of current assets","Totaal van vlottende activa"]
[68,"Total of assets","Totaal van activa"]
[69,"Share capital paid called up","Gestort en opgevraagd aandelenkapitaal"]
[70,"Share premium","Agio"]
[71,"Revaluation reserves","Herwaarderingsreserves"]
[72,"Other legal reserves","Andere wettelijke reserves"]
[73,"Statutory reserves","Statutaire reserves"]
[74,"Reinvestment reserve","Herinvesteringsreserve"]
[75,"Other reserves","Overige reserves"]
[76,"Other fiscal reserves","Overige fiscale reserves"]
[77,"Result after taxes for the year","Resultaat na belastingen van het boekjaar"]
[78,"Undistributed profit","Niet verdeelde winsten"]
[79,"Total of equity","Totaal van eigen vermogen"]
[80,"Provisions","Voorzieningen"]
[81,"Non-current liabilities","Langlopende schulden"]
[82,"Current liabilities","Kortlopende schulden"]
[83,"Total of equity and liabilities","Totaal van passiva"]
[84,"Notes to the financial statements","Toelichting op de jaarrekening"]
[85,"General notes","Algemene toelichting"]
[86,"Notes to the financial statements - General notes","Toelichting op de jaarrekening - Algemene toelichting"]
[87,"Description of the most important activities of the entity","Beschrijving van de belangrijkste activiteiten van de rechtspersoon"]
[88,"Description of the location of the actual activities","Beschrijving van de locatie van de feitelijke activiteiten"]
[89,"Notes to the financial statements - General notes: Going concern","Toelichting op de jaarrekening - Algemene toelichting: Continuïteit"]
[90,"Disclosure of going concern","Informatieverschaffing over continuïteit"]
[91,"Description of the uncertainties relating to the ability of the entity to continue as going concern","Beschrijving van de ernstige onzekerheden omtrent de continuïteit van de organisatie"]
[92,"Description of the basis of preparation of the financial statements when not going concern basis","Beschrijving van de grondslag van waardering wanneer dit niet op continuïteitsbasis is"]
[93,"Description of the effect of not applying going concern basis on equity and results","Beschrijving van de invloed van het niet waarderen op continuïteitsbasis op het vermogen en resultaat"]
[94,"Notes to the financial statements - General notes: Group structure","Toelichting op de jaarrekening - Algemene toelichting: Groepsverhoudingen"]
[95,"Disclosure of group structure","Informatieverschaffing over groepsverhoudingen"]
[96,"Name of the entity which prepares the consolidated financial statements of the group to which the legal entity belongs","Naam van de maatschappij die de geconsolideerde jaarrekening opstelt van het groepsdeel waartoe de rechtspersoon behoort"]
[97,"Location of the entity which prepares the consolidated financial statements of the group to which the legal entity belongs","Woonplaats van de maatschappij die de geconsolideerde jaarrekening opstelt van het groepsdeel waartoe de rechtspersoon behoort"]
[98,"Notes to the financial statements - General notes: Estimates","Toelichting op de jaarrekening - Algemene toelichting: Schattingen"]
[99,"Disclosures about estimates, judgements, assumptions and uncertainties","Informatieverschaffing over schattingen, oordelen, veronderstellingen en onzekerheden"]
[100,"Notes to the financial statements - General notes: Consolidation","Toelichting op de jaarrekening - Algemene toelichting: Consolidatie"]
[101,"Disclosure of consolidation","Informatieverschaffing over consolidatie"]
[102,"Description of the exemption of consolidation in connection with the application of Section 2:408","Beschrijving van de vrijstelling van consolidatie in verband met toepassing van artikel 2:408"]
[103,"Description of the reason for not consolidating a subsidiary","Beschrijving van de reden voor het niet meeconsolideren van een dochtermaatschappij"]
[104,"Description of application and reason for application consolidation exemption for venture capital investment company","Beschrijving van toepassing en reden van toepassing consolidatievrijstelling voor participatiemaatschappij of beleggingsmaatschappij"]
[105,"Notification of legal entity for which legal entity issued a liability claim in accordance with article 403","Vermelding van de rechtspersonen waarvoor de rechtspersoon een aansprakelijkstelling overeenkomstig Art. 2:403 heeft afgegeven"]
[106,"Notes to the financial statements - General notes: Mergers and acquisitions","Toelichting op de jaarrekening - Algemene toelichting: Fusies en overnames"]
[107,"Disclosure of mergers and acquisitions","Informatieverschaffing over fusies en overnames"]
[108,"Notes to the financial statements - General notes: Business activities that are not continued sustainably","Toelichting op de jaarrekening - Algemene toelichting: Bedrijfsactiviteiten die niet duurzaam worden voortgezet"]
[109,"Disclosure of discontinued business activities that are not continued sustainably","Informatieverschaffing over beëindiging van bedrijfsactiviteiten"]
[110,"Description of the result before taxes that is achieved with the sale of assets of a business activity that is not continued on a sustainable basis","Beschrijving van het resultaat voor belastingen dat wordt behaald met de verkoop van activa van een bedrijfsactiviteit die niet duurzaam wordt voortgezet"]
[111,"Description of the nature of the initial event of business activities that are not continued sustainablys","Beschrijving van de aard van de initiële gebeurtenis bij de beëindiging van bedijfsactiviteiten"]
[112,"Description of the time of the initial event of business activities that are not continued sustainably","Beschrijving van het tijdstip van de initiële gebeurtenis bij de beëindiging van bedijfsactiviteiten"]
[113,"Description of the time or time period when the discontinuation of operations will be finalised","Beschrijving van het tijdstip waarop of de periode waarin de beëindiging van bedijfsactiviteiten zal zijn afgerond"]
[114,"Description of the expected time of receipt of net sales of assets for which the legal entity has entered into a binding agreement of an unsustainable business activity","Beschrijving van het verwachte tijdstip van ontvangst van nettoverkoopbrengst van activa waarvoor de rechtspersoon een bindende overeenkomst is aangegaan van een bedrijfsactiviteit die niet duurzaam wordt voortgezet"]
[115,"Description of expected time of receipt of net sales proceeds of debt for which the legal entity has entered into a binding agreement of a business that will not be continued on a sustainable basis","Beschrijving van verwachte tijdstip van ontvangst van nettoverkoopbrengst van vreemd vermogen waarvoor de rechtspersoon een bindende overeenkomst is aangegaan van een bedrijfsactiviteit die niet duurzaam wordt voortgezet"]
[116,"Description of the result before taxes that is achieved with the settlement of items of the loan capital of a business activity that is not continued sustainably","Beschrijving van het resultaat voor belastingen dat wordt behaald met de afwikkeling van posten van het vreemd vermogen van een bedrijfsactiviteit die niet duurzaam wordt voortgezet"]
[117,"General accounting principles","Algemene grondslagen voor verslaggeving"]
[118,"Notes to the financial statements - General accounting principles","Toelichting op de jaarrekening - Algemene grondslagen voor verslaggeving"]
[119,"Description of the accounting standards used to prepare the financial statements","Beschrijving van de standaarden op basis waarvan de jaarrekening is opgesteld"]
[120,"Description of the standards applied earlier than the latest entry dates according to the new Guidelines","Beschrijving van de standaarden die eerder worden toegepast dan de uiterste ingangsdata volgens de nieuwe Richtlijnen"]
[121,"Description of the differences and reasons that led to the revision of the classification and amounts compared to the previous year","Beschrijving van de verschillen en redenen die tot herziening van de indeling en bedragen ten opzichte van voorgaand jaar hebben geleid"]
[122,"Disclosure of fair value information when the report is prepared on historical cost basis","Informatieverschaffing over de actuele waarde bij toepassing van de historische prijsgrondslag"]
[123,"Disclosure of the differences in valuation between fiscal and commercial accounting principles","Informatieverschaffing over de verschillen tussen de waardering volgens fiscale en commerciële grondslagen"]
[124,"Description of the extent to which indirect costs have been taken into account when determining the manufacturing price","Beschrijving van de mate waarin bij de bepaling van de vervaardigingsprijs rekening is gehouden met indirecte kosten"]
[125,"Description of the functional currency","Beschrijving van de functionele valuta"]
[126,"Description of the reason why the presentation currency is different from the functional currency","Beschrijving van de reden waarom de presentatievaluta afwijkt van de functionele valuta"]
[127,"Description of the reason for changing the presentation currency","Beschrijving van de reden voor het wijzigen van de presentatievaluta"]
[128,"Disclosure of deviation in prior period figures due to a revision","Informatieverschaffing over afwijkingen in bedragen van het voorgaande boekjaar als gevolg van een herziening"]
[129,"Notes to the financial statements - General accounting principles: Changes in accounting estimates","Toelichting op de jaarrekening - Algemene grondslagen voor verslaggeving: Schattingswijzigingen"]
[130,"Notes to the types and quantitative effects of changes in accounting estimates if of importance in the reporting period or subsequent periods","Toelichting op de aard en de kwantitatieve effecten van een schattingswijziging indien deze van belang is voor de verslagperiode of toekomstige perioden"]
[131,"Notes to the financial statements - General accounting principles: Change in accounting estimates: Specification","Toelichting op de jaarrekening - Algemene grondslagen voor verslaggeving: Schattingswijzigingen: Specificatie"]
[132,"Change in accounting estimates","Schattingswijziging"]
[133,"Description Change in accounting estimates","Omschrijving Schattingswijziging"]
[134,"Description of the change in accounting estimates","Beschrijving van de schattingswijziging"]
[135,"Description of the change in accounting estimates on the current period","Beschrijving van het effect van de schattingswijziging op de huidige periode"]
[136,"Description of the indication of the effect of the estimate change on future periods","Beschrijving van de indicatie van het effect van de schattingswijzing op toekomstige periodes"]
[137,"Description of disclosure if the quantitative effect of a change in accounting estimates for the reporting period is impracticable","Beschrijving van de vermelding indien het kwantitatieve effect van een schattingswijziging voor de verslagperiode praktisch niet te bepalen is"]
[138,"Description of inability to determine numerical indication of change in accounting estimate on future periods","Beschrijving van het niet kunnen bepalen van een cijfermatige indicatie van de schattingswijzing op toekomstige periodes"]
[139,"Presentation order","Presentatievolgorde"]
[140,"Notes to the financial statements - General accounting principles: Changes in accounting policies","Toelichting op de jaarrekening - Algemene grondslagen voor verslaggeving: Stelselwijzigingen"]
[141,"Disclosure of changes in accounting policies","Informatieverschaffing over stelselwijzigingen"]
[142,"Description of the significance of the change in accounting policy if it is not practically possible to quantify the effect","Beschrijving van de betekenis van de stelselwijziging indien het praktisch niet mogelijk is om het effect te kwantificeren"]
[143,"Notes to the financial statements - General accounting principles: Change in accounting policies: Specification","Toelichting op de jaarrekening - Algemene grondslagen voor verslaggeving: Stelselwijzigingen: Specificatie"]
[144,"Change in accounting policies","Stelselwijziging"]
[145,"Description Change in accounting policies","Omschrijving Stelselwijziging"]
[146,"Description of the reason for change in accounting policies","Beschrijving van de reden tot het doorvoeren van een stelselwijziging"]
[147,"Description of the method of processing the effects of the change in accounting policies","Beschrijving van de wijze van verwerken van de effecten van de stelselwijziging"]
[148,"Description of the meaning of the system change for capital and result","Beschrijving van de betekenis van de stelselwijziging voor vermogen en resultaat"]
[149,"Description of the effect of the change in accounting policies on individual items","Beschrijving van de betekenis van de stelselwijziging op individuele posten"]
[150,"Description of the numerical influence of a system change on one or more subsequent financial years","Beschrijving van de cijfermatige invloed van een stelselwijziging op één of meer volgende boekjaren"]
[151,"Notes to the financial statements - General accounting principles: Prior period errors","Toelichting op de jaarrekening - Algemene grondslagen voor verslaggeving: Foutherstel"]
[152,"Disclosure of prior period errors","Informatieverschaffing over foutherstel"]
[153,"Notes to the financial statements - General accounting principles: Prior period errors: Specification","Toelichting op de jaarrekening - Algemene grondslagen voor verslaggeving: Foutherstel: Specificatie"]
[154,"Prior period errors","Foutenherstel"]
[155,"Description Prior period errors","Omschrijving Foutenherstel"]
[156,"Description of nature and extent of the material error","Beschrijving van de aard en omvang van de materiële fout"]
[157,"Description of the effect of the correction of the material error","Beschrijving van het effect van het herstel van de materiële fout"]
[158,"Notes to the financial statements - General accounting principles: Foreign currency translation","Toelichting op de jaarrekening - Algemene grondslagen voor verslaggeving: Omrekening van vreemde valuta"]
[159,"Policy of conversion of amounts denominated in foreign currency","Grondslag van omrekening van in vreemde valuta luidende bedragen"]
[160,"Basis of conversion and processing of exchange rate differences relating to foreign currency transactions for the balance sheet","Grondslag van de wijze van omrekening en de verwerking van valutakoersverschillen met betrekking tot transacties in vreemde valuta voor de balans"]
[161,"Policy of translation for hyperinflation in business operations abroad","Grondslag van omrekening inzake hyperinflatie bij bedrijfsuitoefening in het buitenland"]
[162,"Policy of foreign currency translation and the processing of foreign currency translation differences in foreign currency transactions","Grondslag van de wijze van omrekening en de verwerking van valutakoersverschillen met betrekking tot transacties in vreemde valuta"]
[163,"Policy of foreign currency translation and the processing of foreign currency translation differences with regard to business activities abroad","Grondslag van de wijze van omrekening en de verwerking van valutakoersverschillen met betrekking tot bedrijfsuitoefening in het buitenland"]
[164,"Policy of the method of conversion and the processing of exchange rate differences related to business activities abroad for the balance sheet","Grondslag van de wijze van omrekening en de verwerking van valutakoersverschillen met betrekking tot bedrijfsuitoefening in het buitenland voor de balans"]
[165,"Policy of the method of conversion and the processing of exchange rate differences relating to business activities abroad for the profit and loss account","Grondslag van de wijze van omrekening en de verwerking van valutakoersverschillen met betrekking tot bedrijfsuitoefening in het buitenland voor de winst-en-verliesrekening"]
[166,"Policy of principles for the conversion and recognition of exchange rate differences in respect of goodwill and the fair value adjustment for the acquisition of a foreign business activity for the balance sheet","Grondslag van de wijze van omrekening en de verwerking van valutakoersverschillen met betrekking tot goodwill en de aanpassing naar reële waarde voor de verwerving van een bedrijfsuitoefening in het buitenland voor de balans"]
[167,"Policy of the conversion and recognition of exchange differences in respect of goodwill and the fair value adjustment for the acquisition of a foreign business for the profit and loss account","Grondslag van de wijze van omrekening en de verwerking van valutakoersverschillen met betrekking tot goodwill en de aanpassing naar reële waarde voor de verwerving van een bedrijfsuitoefening in het buitenland voor de winst-en-verliesrekening"]
[168,"Policy of conversion and recognition of exchange rate differences in respect of goodwill and fair value adjustment for the acquisition of a foreign business","Grondslag van de wijze van omrekening en de verwerking van valutakoersverschillen met betrekking tot goodwill en de aanpassing naar reële waarde voor de verwerving van een bedrijfsuitoefening in het buitenland"]
[169,"Notes to the financial statements - General accounting principles: Leases","Toelichting op de jaarrekening - Algemene grondslagen voor verslaggeving: Leases"]
[170,"Policy of leases","Grondslag van leases"]
[171,"Policy of finance leases","Grondslag van financiële leases"]
[172,"Policy of operating leases","Grondslag van operationele leases"]
[173,"Notes to the financial statements - General accounting principles: Share based payments","Toelichting op de jaarrekening - Algemene grondslagen voor verslaggeving: Op aandelen gebaseerde betalingen"]
[174,"Policy of share based payments","Grondslag van op aandelen gebaseerde betalingen"]
[175,"Notes to the financial statements - General accounting principles: Exceptional items","Toelichting op de jaarrekening - Algemene grondslagen voor verslaggeving: Bijzondere posten"]
[176,"Policy of exceptional items","Grondslag van bijzondere posten"]
[177,"Notes to the financial statements - General accounting principles: Pension arrangements","Toelichting op de jaarrekening - Algemene grondslagen voor verslaggeving: Pensioenregelingen"]
[178,"Policy of pension arrangements","Grondslag van pensioenregelingen"]
[179,"Notes to the financial statements - General accounting principles: Financial instruments","Toelichting op de jaarrekening - Algemene grondslagen voor verslaggeving: Financiële instrumenten"]
[180,"Policy of financial instruments","Grondslag van financiële instrumenten"]
[181,"Policy of hedge accounting of financial instruments","Grondslag van hedge accounting van financiële instrumenten"]
[182,"Policy of current value of financial instruments","Grondslag van actuele waarde van financiële instrumenten"]
[183,"Accounting principles","Grondslagen"]
[184,"Notes to the financial statements - Accounting principles applied to the valuation of assets and liabilities","Toelichting op de jaarrekening - Grondslagen voor de waardering van activa en passiva"]
[185,"Policy of intangible assets","Grondslag van immateriële vaste activa"]
[186,"Policy of impairment of intangible assets","Grondslag van bijzondere waardeverminderingen van immateriële vaste activa"]
[187,"Policy of reversal of impairment of intangible assets","Grondslag van terugneming van bijzondere waardeverminderingen van immateriële vaste activa"]
[188,"Policy of costs relating to the incorporation and issuance of shares","Grondslag van kosten die verband houden met de oprichting en met de uitgifte van aandelen"]
[189,"Policy of development costs","Grondslag van kosten van ontwikkeling"]
[190,"Policy of costs of acquisition of patents, trademarks and other rights","Grondslag van kosten van verwerving ter zake van concessies, vergunningen en rechten van intellectuele eigendom"]
[191,"Policy of costs of goodwill acquired from third party","Grondslag van kosten van goodwill die van derden is verkregen"]
[192,"Policy of prepayments of intangible assets","Grondslag van vooruitbetalingen op immateriële vaste activa"]
[193,"Policy of intangible assets other","Grondslag van overige immateriële vaste activa"]
[194,"Policy of property, plant and equipment","Grondslag van materiële vaste activa"]
[195,"Policy of impairment of property, plant and equipment","Grondslag van bijzondere waardeverminderingen van materiële vaste activa"]
[196,"Policy of reversal of impairment of property, plant and equipment","Grondslag van terugneming van bijzondere waardeverminderingen van materiële vaste activa"]
[197,"Policy of land and buildings","Grondslag van bedrijfsgebouwen en -terreinen"]
[198,"Policy of machinery","Grondslag van machines en installaties"]
[199,"Policy of other tangible assets","Grondslag van andere vaste bedrijfsmiddelen"]
[200,"Policy of Property, plant and equipment in progress and prepayments of property, plant and equipment","Grondslag van materiële vaste bedrijfsactiva in uitvoering en vooruitbetalingen op materiële vaste activa"]
[201,"Policy of property, plant and equipment not used in the production process","Grondslag van niet aan het productieproces dienstbare materiële vaste activa"]
[202,"Policy of processing of repair and maintenance costs","Grondslag van de verwerking van kosten van herstel en groot onderhoud"]
[203,"Policy of investment properties","Grondslag van vastgoedbeleggingen"]
[204,"Policy of impairment of investment properties","Grondslag van bijzondere waardeverminderingen van vastgoedbeleggingen"]
[205,"Policy of investment properties in exploitation","Grondslag van vastgoedbeleggingen in exploitatie"]
[206,"Policy of concept property investment under development","Grondslag van vastgoedbeleggingen in ontwikkeling"]
[207,"Policy of financial assets","Grondslag van financiële vaste activa"]
[208,"Policy of impairment of financial assets","Grondslag van bijzondere waardeverminderingen van financiële vaste activa"]
[209,"Policy of reversal of impairment of financial assets","Grondslag van terugneming van bijzondere waardeverminderingen van financiële vaste activa"]
[210,"Policy of shares, certificates of shares and other types of participating interests in group companies","Grondslag van aandelen, certificaten van aandelen en andere vormen van deelneming in groepsmaatschappijen"]
[211,"Policy of investments in participating interests in other affiliated companies","Grondslag van deelnemingen in overige verbonden maatschappijen"]
[212,"Policy of receivables from group companies","Grondslag van vorderingen op groepsmaatschappijen"]
[213,"Policy of receivables from other affiliated companies","Grondslag van vorderingen op overige verbonden maatschappijen"]
[214,"Policy of other investments in participating interests","Grondslag van andere deelnemingen"]
[215,"Policy of receivables from other legal entities and companies with a participating interest in the legal entity or from participating interests of the legal entity","Grondslag van vorderingen op andere rechtspersonen en vennootschappen die een deelneming hebben in de rechtspersoon of waarin de rechtspersoon een deelneming heeft"]
[216,"Policy of receivables from loans and advances to participants or registered shareholders","Grondslag van vorderingen uit hoofde van leningen en voorschotten aan leden of houders van aandelen op naam"]
[217,"Policy of other securities","Grondslag van overige effecten"]
[218,"Policy of other receivables","Grondslag van overige vorderingen"]
[219,"Policy of deferred tax assets","Grondslag van latente belastingvorderingen"]
[220,"Policy of other financial assets","Grondslag van overige financiële vaste activa"]
[221,"Policy of non-current assets","Grondslag van vaste activa"]
[222,"Policy of impairment of non-current assets","Grondslag van bijzondere waardeverminderingen van vaste activa"]
[223,"Policy of reversal of impairment of non-current assets","Grondslag van terugneming van bijzondere waardeverminderingen van vaste activa"]
[224,"Policy of changes in value of non-current securities and investments in participating interests (debit)","Grondslag van waardeveranderingen van de tot de vaste activa behorende effecten en deelnemingen (debet)"]
[225,"Policy of inventories","Grondslag van voorraden"]
[226,"Policy of the realisable value of inventories","Grondslag van de opbrengstwaarde van voorraden"]
[227,"Policy of raw materials and consumables","Grondslag van grond- en hulpstoffen"]
[228,"Policy of work in progress","Grondslag van onderhanden werk"]
[229,"Policy of finished and trade goods","Grondslag van gereed product en handelsgoederen"]
[230,"Policy of prepayments of inventories","Grondslag van vooruitbetalingen op voorraden"]
[231,"Basis of the net realizable value of agricultural stocks","Grondslag van de opbrengstwaarde van agrarische voorraden"]
[232,"Policy of construction contracts","Grondslag van onderhanden projecten"]
[233,"Policy of receivables","Grondslag van vorderingen"]
[234,"Policy of trade receivables","Grondslag van vorderingen op handelsdebiteuren"]
[235,"Policy of called-up contributions for issued share capital","Grondslag van opgevraagde stortingen van geplaatst kapitaal"]
[236,"Policy of pension receivables","Grondslag van pensioenvordering"]
[237,"Policy of tax receivables","Grondslag van belastingvorderingen"]
[238,"Policy of receivables relating to income tax","Grondslag van vorderingen uit belastingen naar de winst"]
[239,"Policy of prepayments and accrued income","Grondslag van overlopende activa"]
[240,"Policy of current securities","Grondslag van kortlopende effecten"]
[241,"Policy of cash and cash equivalents","Grondslag van liquide middelen"]
[242,"Policy of current assets","Grondslag van vlottende activa"]
[243,"Policy of equity","Grondslag van eigen vermogen"]
[244,"Policy of share capital paid called up","Grondslag van gestort en opgevraagd aandelenkapitaal"]
[245,"Policy of share premium","Grondslag van agio"]
[246,"Policy of revaluation reserves","Grondslag van herwaarderingsreserves"]
[247,"Policy of other legal reserves, distinguished by their nature","Grondslag van andere wettelijke reserves, onderscheiden naar hun aard"]
[248,"Policy of statutory reserves","Grondslag van statutaire reserves"]
[249,"Policy of reinvestment reserve","Grondslag van herinvesteringsreserve"]
[250,"Policy of other reserves","Grondslag van overige reserves"]
[251,"Policy of other fiscal reserves","Grondslag van overige fiscale reserves"]
[252,"Policy of result after taxes for the year","Grondslag van resultaat na belastingen van het boekjaar"]
[253,"Policy of undistributed profit","Grondslag van niet verdeelde winsten"]
[254,"Policy of provisions","Grondslag van voorzieningen"]
[255,"Policy of provision for repair costs","Grondslag van voorziening voor herstelkosten"]
[256,"Policy of provision for tax liabilities","Grondslag van voorzieningen voor belastingverplichtingen"]
[257,"Policy of provisions for pension obligations","Grondslag van voorzieningen voor pensioenverplichtingen"]
[258,"Policy of provision of employee benefits","Grondslag van voorziening uit hoofde van personeelsbeloningen"]
[259,"Policy of environmental provision","Grondslag van voorziening voor opruiming van aanwezige milieuvervuiling"]
[260,"Policy of provision for legal proceedings","Grondslag van voorziening uit hoofde van claims, geschillen en rechtsgedingen"]
[261,"Policy of provision for major maintenance","Grondslag van voorziening voor groot onderhoud"]
[262,"Policy of provision for disposal obligations","Grondslag van voorziening voor verwijderingsverplichtingen"]
[263,"Policy of provision for onerous contracts","Grondslag van voorziening voor verlieslatende contracten"]
[264,"Policy of restructuring provision","Grondslag van voorziening in verband met reorganisaties"]
[265,"Policy of provision relating to participating interest","Grondslag van voorziening in verband met deelnemingen"]
[266,"Policy of deferred tax liabilities","Grondslag van latente belastingverplichtingen"]
[267,"Policy of warranty provision","Grondslag van garantievoorziening"]
[268,"Policy of provision for jubilee benefits","Grondslag van voorziening voor jubileumuitkeringen"]
[269,"Policy of provision for insurance of disability risks","Grondslag van voorziening voor verzekering van arbeidsongeschiktheidsrisico's"]
[270,"Policy of provision for obligations due to illness or disability","Grondslag van voorziening voor verplichtingen uit hoofde van ziekte of arbeidsongeschiktheid"]
[271,"Policy of provision for insurance of sickness or incapacity for work","Grondslag van voorziening voor verzekering van ziekte of arbeidsongeschiktheid"]
[272,"Policy of share-based payment provision","Grondslag van voorziening uit hoofde van op aandelen gebaseerde betalingen"]
[273,"Policy of other provisions","Grondslag van overige voorzieningen"]
[274,"Policy of non-current liabilities","Grondslag van langlopende schulden"]
[275,"Policy of subordinated liabilities","Grondslag van achtergestelde schulden"]
[276,"Policy of convertible borrowings","Grondslag van converteerbare leningen"]
[277,"Policy of debentures, mortgage bonds and other loans","Grondslag van obligatieleningen, pandbrieven en andere leningen"]
[278,"Policy of finance lease liabilities","Grondslag van financiële leaseverplichtingen"]
[279,"Policy of payables to banks","Grondslag van schulden aan banken"]
[280,"Policy of advances received on orders not yet deducted for asset items","Grondslag van ontvangen vooruitbetalingen op bestellingen voor zover niet reeds op actiefposten in mindering gebracht"]
[281,"Policy of trade payables","Grondslag van schulden aan leveranciers en handelskredieten"]
[282,"Policy of cheques and bills of exchange payables","Grondslag van te betalen wissels en cheques"]
[283,"Policy of payables to group companies","Grondslag van schulden aan groepsmaatschappijen"]
[284,"Policy of payables to other affiliated companies","Grondslag van schulden aan overige verbonden partijen"]
[285,"Policy of payables to other legal entities and companies with a participating interest in the legal entity or to participating interests of the legal entity","Grondslag van schulden aan rechtspersonen en vennootschappen die een deelneming hebben in de rechtspersoon of waarin de rechtspersoon een deelneming heeft"]
[286,"Policy of payables relating to taxes and social security contributions","Grondslag van schulden ter zake van belastingen en premies van sociale verzekeringen"]
[287,"Policy of tax payables","Grondslag van belastingverplichtingen"]
[288,"Policy of pension related payables","Grondslag van schulden ter zake van pensioenen"]
[289,"Policy of old-age obligation","Grondslag van oudedagsverplichting"]
[290,"Policy of negative goodwill","Grondslag van negatieve goodwill"]
[291,"Policy of other payables","Grondslag van overige schulden"]
[292,"Policy of accruals and deferred income","Grondslag van overlopende passiva"]
[293,"Policy of current liabilities","Grondslag van kortlopende schulden"]
[294,"Policy of payables relating to income taxes","Grondslag van schulden uit hoofde van belastingen naar de winst"]
[295,"Policy of repayment obligations of non-current borrowings","Grondslag van aflossingsverplichtingen van langlopende leningen"]
[296,"Policy of proposed amount of dividend payments to holders of equity instruments","Grondslag van voorgestelde bedrag aan dividenduitkeringen aan houders van eigenvermogensinstrumenten"]
[297,"Policy of construction contracts (liabilities)","Grondslag van onderhanden projecten (passiva)"]
[298,"Policy of payables relating to employee benefits","Grondslag van schulden uit hoofde van personeelsbeloningen"]
[299,"Policy of debts due to vacation days","Grondslag van schulden uit hoofde van vakantiedagen"]
[300,"Policy of debts due to holiday pay","Grondslag van schulden uit hoofde van vakantiegeld"]
[301,"Policy of dividend to be distributed to holders of preference shares","Grondslag van uit te keren dividend aan houders van preferente aandelen"]
[302,"Notes to the financial statements - Accounting principles for the determination of the result","Toelichting op de jaarrekening - Grondslagen voor de bepaling van het resultaat"]
[303,"Accounting principles for determining the result","Grondslagen voor de bepaling van het resultaat"]
[304,"Policy of revenue recognition","Grondslag van omzetverantwoording"]
[305,"Policy of gross operating result","Grondslag van bruto-bedrijfsresultaat"]
[306,"Policy of selling expenses","Grondslag van verkoopkosten"]
[307,"Policy of general and administrative expenses","Grondslag van algemene beheerskosten"]
[308,"Policy of government subsidies","Grondslag van overheidssubsidies"]
[309,"Policy of expenses of employee benefits","Grondslag van lasten uit hoofde van personeelsbeloningen"]
[310,"Policy of wages","Grondslag van lonen"]
[311,"Policy of social security contributions","Grondslag van sociale lasten"]
[312,"Applied policy of pension costs","Grondslag van pensioenlasten"]
[313,"Policy of other expenses of employee benefits","Grondslag van overige lasten uit hoofde van personeelsbeloningen"]
[314,"Basis for processing the compensation received under the NOW scheme","Grondslag van verwerking van de ontvangen tegemoetkoming uit hoofde van de NOW-regeling"]
[315,"Policy of amortisation of intangible assets and depreciation of property, plant and equipment","Grondslag van afschrijvingen op immateriële en materiële vaste activa"]
[316,"Policy of amortisation of intangible assets","Grondslag van afschrijvingen op immateriële vaste activa"]
[317,"Policy of depreciation of property, plant and equipment","Grondslag van afschrijvingen op materiële vaste activa"]
[318,"Policy of changes in the value of intangible asPolicy of sets and property, plant and equipment","Grondslag van waardeveranderingen van immateriële en materiële vaste activa"]
[319,"Policy of changes in the value of intangible assets","Grondslag van waardeveranderingen van immateriële vaste activa"]
[320,"Policy of changes in the fair value of real estate investments","Grondslag van wijziging in de reële waarde van vastgoedbeleggingen"]
[321,"Policy of changes in the value of financial assets and of securities that are part of the current assets","Grondslag van wijzigingen in de waarde van de financiële vaste activa en van de effecten die tot de vlottende activa behoren"]
[322,"Policy of decrease in the value of current assets","Grondslag van waardeverminderingen van vlottende activa"]
[323,"Policy of other operating expenses","Grondslag van overige bedrijfskosten"]
[324,"Policy of released from revaluation reserve","Grondslag van uit herwaarderingsreserve vrijgevallen bedragen"]
[325,"Policy of financial income and expenses","Grondslag van financiële baten en lasten"]
[326,"Policy of income of securities and receivables, that are part of non-current assets","Grondslag van opbrengsten van andere effecten en vorderingen, die tot de vaste activa behoren"]
[327,"Policy of other interest income and related income","Grondslag van overige rentebaten en soortgelijke opbrengsten"]
[328,"Policy of interest expenses and related expenses","Grondslag van rentelasten en soortgelijke kosten"]
[329,"Policy of income tax expense","Grondslag van belastingen over de winst of het verlies"]
[330,"Policy of other income tax expense","Grondslag van overige belastingen"]
[331,"Policy of share in results of participating interests","Grondslag van aandeel in resultaat van ondernemingen waarin wordt deelgenomen"]
[332,"Notes to the financial statements - Intangible assets: Breakdown","Toelichting op de jaarrekening - Immateriële vaste activa: Uitsplitsing"]
[333,"Costs relating to the incorporation and issuance of shares","Kosten die verband houden met de oprichting en met de uitgifte van aandelen"]
[334,"Other intangible assets","Overige immateriële vaste activa"]
[335,"Total of intangible assets","Totaal van immateriële vaste activa"]
[336,"Notes to the financial statements - Intangible assets","Toelichting op de jaarrekening - Immateriële vaste activa"]
[337,"Disclosure of intangible assets","Informatieverschaffing over immateriële vaste activa"]
[338,"Disclosure of the current value of intangible assets","Informatieverschaffing over de actuele waarde van immateriële vaste activa"]
[339,"Description of intangible assets with limited ownership","Beschrijving van immateriële vaste activa met beperkte eigendomsrechten"]
[340,"Description of intangible assets put up as collateral for debts","Beschrijving van immateriële vaste activa ter zekerheid gesteld voor schulden"]
[341,"Description of the impairment of intangible assets","Beschrijving van bijzondere waardeverminderingen van immateriële vaste activa"]
[342,"Disclosure of costs of goodwill acquired from third party","Informatieverschaffing over kosten van goodwill die van derden is verkregen"]
[343,"Description of the commitments relating to acquisitions of intangible assets","Beschrijving van verplichtingen uit hoofde van verwerving van immateriële vaste activa"]
[344,"Description of the capitalised interest on intangible assets during the period","Beschrijving van de geactiveerde rente op immateriële vaste activa gedurende de verslagperiode"]
[345,"Description of the reason and factors that played a significant part in determining that the amortisation term of intangible assets exceeds twenty years","Beschrijving van de reden en factoren die een significante rol hebben gespeeld bij de bepaling dat de afschrijvingstermijn van immateriële vaste activa langer dan twintig jaar bedraagt"]
[346,"Description of an individual intangible asset of importance","Beschrijving van een individueel immaterieel vast actief dat van groot belang is voor de rechtspersoon"]
[347,"Notes to the financial statements - Intangible assets: Other amounts: Breakdown","Toelichting op de jaarrekening - Immateriële vaste activa: Overige bedragen: Uitsplitsing"]
[348,"Intangible assets with limited ownership","Immateriële vaste activa met beperkte eigendomsrechten"]
[349,"Intangible assets put up as collateral for debts","Immateriële vaste activa ter zekerheid gesteld voor schulden"]
[350,"Notes to the financial statements - Intangible assets: Accumulated revaluations","Toelichting op de jaarrekening - Immateriële vaste activa: Cumulatieve herwaarderingen"]
[351,"Sum of the revaluations related to intangible assets","Som der herwaarderingen die betrekking hebben op de immateriële vaste activa"]
[352,"Notes to the financial statements - Intangible assets, previous period: Accumulated revaluations","Toelichting op de jaarrekening - Immateriële vaste activa, voorgaande periode: Cumulatieve herwaarderingen"]
[353,"Notes to the financial statements - Property, plant & equipment","Toelichting op de jaarrekening - Materiële vaste activa"]
[354,"Disclosure of property, plant and equipment","Informatieverschaffing over materiële vaste activa"]
[355,"Disclosure of the current value of property, plant and equipment","Informatieverschaffing over de actuele waarde van materiële vaste activa"]
[356,"Description of property, plant and equipment of which the legal entity does not have legal ownership","Beschrijving van materiële vaste activa waarvan de rechtspersoon niet de juridische eigendom bezit"]
[357,"Description of property, plant and equipment serving as collateral for commitments","Beschrijving van materiële vaste activa die als zekerheid dienen voor verplichtingen"]
[358,"Description of the impairment of property, plant and equipment","Beschrijving van bijzondere waardeverminderingen van materiële vaste activa"]
[359,"Description of the capitalised interest on property, plant and equipment during the period","Beschrijving van de geactiveerde rente op materiële vaste activa gedurende de verslagperiode"]
[360,"Disclosure of finance lease of property, plant and equipment","Informatieverschaffing over de financiële lease van materiële vaste activa"]
[361,"Description of the nature and extent of other important movements of property, plant and equipment","Beschrijving van de aard en omvang van overige mutaties van de materiële vaste activa die van belang zijn"]
[362,"Disclosure of property plant equipment of the deduction of the reinvestment reserve from the acquisition or production costs of an asset","Informatieverschaffing over materiële vaste activa van de fiscale herinvesteringsreserve in mindering gebracht op de aanschaffings- of voortbrengingskosten van een bedrijfsmiddel"]
[363,"Description of the application of the transitional provision regarding the change in accounting policy from current value to historical cost price","Beschrijving van de toepassing van de overgangsbepaling m.b.t. de stelselwijziging van waardering tegen actuele waarde naar historische kostprijs"]
[364,"Description of the size of the unrealized revaluation regarding the change in accounting policy from current value to historical cost price","Beschrijving van de omvang van de nog niet gerealiseerde herwaardering m.b.t. de stelselwijziging van waardering tegen actuele waarde naar historische kostprijs"]
[365,"Notes to the financial statements - Property, plant and equipment: Accumulated revaluations","Toelichting op de jaarrekening - Materiële vaste activa: Cumulatieve herwaarderingen"]
[366,"Sum of the revaluations concerning property, plant and equipment","Som der herwaarderingen die betrekking hebben op de materiële vaste activa"]
[367,"Notes to the financial statements - Investment properties","Toelichting op de jaarrekening - Vastgoedbeleggingen"]
[368,"Disclosure of investment properties","Informatieverschaffing over vastgoedbeleggingen"]
[369,"Disclosure of fair value of investment properties","Informatieverschaffing over de reële waarde van vastgoedbeleggingen"]
[370,"Description of restrictions with regard to the applicability of investment properties, as well as the extent of this restriction","Beschrijving van beperkingen met betrekking tot de aanwendbaarheid van vastgoedbeleggingen, alsmede de omvang van deze beperking"]
[371,"Description of limitations with regard to the collectability of revenues, as well as the extent of this restriction","Beschrijving van beperkingen met betrekking tot de inbaarheid van opbrengsten, alsmede de omvang van deze beperking"]
[372,"Description of the impairment of investment properties","Beschrijving van bijzondere waardeverminderingen van vastgoedbeleggingen"]
[373,"Description of contractual obligations to purchase, construct or develop investment properties or for repairs, maintenance or enhancements of investment properties","Beschrijving van contractuele verplichtingen tot aankoop, bouw of ontwikkeling van vastgoedbeleggingen of voor reparatie, onderhoud of verbeteringen van vastgoedbeleggingen"]
[374,"Notes to the financial statements - Financial assets","Toelichting op de jaarrekening - Financiële vaste activa"]
[375,"Disclosure of financial assets","Informatieverschaffing over financiële vaste activa"]
[376,"Description of the assumptions on which the present value of expected future cash flows is based for assets measured at current value that may yield income as an investment","Beschrijving van de aannames waarop de contante waarde van de verwachte toekomstige kasstromen zijn gebaseerd voor activa gewaardeerd tegen actuele waarde die opbrengsten kunnen opleveren als belegging"]
[377,"Description of the approximation method for assets valuation at current value that generates income as investment","Beschrijving van toegepaste benaderingsmethode voor activa gewaardeerd tegen actuele waarde die opbrengsten kunnen opleveren als belegging"]
[378,"Description of the impairment of financial assets","Beschrijving van bijzondere waardeverminderingen van financiële vaste activa"]
[379,"Disclosure of deferred tax assets","Informatieverschaffing over latente belastingvorderingen"]
[380,"Description of reasons for not applying Article 2: 389 of the Dutch Civil Code to the separate financial statements","Beschrijving van gegronde redenen waarom deelneming niet volgens de netto-vermogenswaardemethode gewaardeerd is"]
[381,"Notes to the financial statements - Financial assets: Accumulated revaluations","Toelichting op de jaarrekening - Financiële vaste activa: Cumulatieve herwaarderingen"]
[382,"Sum of the revaluations of financial assets","Som der herwaarderingen die betrekking hebben op de financiële vaste activa"]
[383,"Notes to the financial statements - Financial assets, previous period: Accumulated revaluations","Toelichting op de jaarrekening - Financiële vaste activa, voorgaande periode: Cumulatieve herwaarderingen"]
[384,"Notes to the financial statements - Inventories","Toelichting op de jaarrekening - Voorraden"]
[385,"Disclosure of inventories","Informatieverschaffing over voorraden"]
[386,"Description of the capitalised interest of inventories during the period","Beschrijving van de geactiveerde rente op voorraden gedurende de verslagperiode"]
[387,"Description of inventories of which the legal entity does not have legal ownership","Beschrijving van voorraden waarvan de rechtspersoon niet de juridische eigendom bezit"]
[388,"Description of commitments to purchase or sell inventories","Beschrijving van verplichtingen tot aan- of verkoop van voorraden"]
[389,"Disclosure of cost method of inventories","Beschrijving van kostprijsmethode van voorraden"]
[390,"Disclosure of the current value of agricultural inventories","Informatieverschaffing over de actuele waarde van agrarische voorraden"]
[391,"Disclosure of revaluations of agricultural inventories valued at current value","Informatieverschaffing over herwaarderingen van agrarische voorraden gewaardeerd tegen actuele waarde"]
[392,"Description of the extent to which the influence of taxes has been taken into account when valuing agricultural inventories at current value","Beschrijving van in hoeverre rekening is gehouden met de invloed van belastingen bij de waardering van agrarische voorraden tegen actuele waarde"]
[393,"Description of the book value of inventories that are valued at lower realizable value","Beschrijving van de boekwaarde van voorraden die worden gewaardeerd tegen lagere opbrengstwaarde"]
[394,"Notes to the financial statements - Inventories: Current value: Breakdown","Toelichting op de jaarrekening - Voorraden: Actuele waarde: Uitsplitsing"]
[395,"Amount of changes value of agricultural stocks valued at current value immediately recognized in the profit and loss account","Bedrag van waardeveranderingen van agrarische voorraden gewaardeerd tegen actuele waarde onmiddellijk verwerkt in de winst-en-verliesrekening"]
[396,"Current value of agricultural inventories","Actuele waarde van agrarische voorraden"]
[397,"Revaluation of agricultural inventories","Herwaardering van agrarische voorraden"]
[398,"Book value of inventories that are valued at lower realisable value","Boekwaarde van voorraden die worden gewaardeerd tegen lagere opbrengstwaarde"]
[399,"Notes to the financial statements - Construction contracts","Toelichting op de jaarrekening - Onderhanden projecten"]
[400,"Disclosure of construction contracts","Informatieverschaffing over onderhanden projecten"]
[401,"Notes to the financial statements - Receivables: Breakdown","Toelichting op de jaarrekening - Vorderingen: Uitsplitsing"]
[402,"Called-up contributions for issued share capital","Opgevraagde stortingen van geplaatst kapitaal"]
[403,"Other receivables","Overige vorderingen"]
[404,"Total of receivables","Totaal van vorderingen"]
[405,"Notes to the financial statements - Receivables","Toelichting op de jaarrekening - Vorderingen"]
[406,"Disclosure of receivables","Informatieverschaffing over vorderingen"]
[407,"Disclosure of prepayments and accrued income","Informatieverschaffing over overlopende activa"]
[408,"Description of receivables of which the legal entity does not have legal ownership","Beschrijving van vorderingen waarvan de rechtspersoon niet de juridische eigendom bezit"]
[409,"Disclosure of receivables with a maturity exceeding one year","Informatieverschaffing over vorderingen met een looptijd langer dan een jaar"]
[410,"Notes to the financial statements - Receivables: Breakdown maturity","Toelichting op de jaarrekening - Vorderingen: Uitsplitsing looptijd"]
[411,"Notes to the financial statements - Securities","Toelichting op de jaarrekening - Effecten"]
[412,"Disclosure of securities","Informatieverschaffing over effecten"]
[413,"Disclosure of fair value of securities","Informatieverschaffing over de reële waarde van effecten"]
[414,"Notes to the financial statements - Cash and cash equivalents","Toelichting op de jaarrekening - Liquide middelen"]
[415,"Disclosure of cash and cash equivalents","Informatieverschaffing over liquide middelen"]
[416,"Disclosure of cheques and bills of exchange","Informatieverschaffing over wissels en cheques"]
[417,"Equity","Eigen vermogen"]
[418,"Notes to the financial statements - Equity","Toelichting op de jaarrekening - Eigen vermogen"]
[419,"Disclosure of equity","Informatieverschaffing over eigen vermogen"]
[420,"Disclosure of continuity with impact on equity","Informatieverschaffing over de continuïteit met effect op het eigen vermogen"]
[421,"Disclosure of important subsequent events with an impact on equity","Informatieverschaffing over belangrijke mutaties na balansdatum met effect op het eigen vermogen"]
[422,"Disclosure of guaranteed equity","Informatieverschaffing over garantievermogen"]
[423,"Description of the withheld part of the result in equity","Beschrijving van het ingehouden deel van de jaarwinst binnen het eigen vermogen"]
[424,"Share capital","Aandelenkapitaal"]
[425,"Notes to the financial statements - Share capital: Statement of changes in number of shares: Specification","Toelichting op de jaarrekening - Aandelenkapitaal: Mutatieoverzicht in aantal aandelen: Specificatie"]
[426,"Share capital (number of shares)","Aandelenkapitaal (aantal aandelen)"]
[427,"Description Share capital (number of shares)","Omschrijving Aandelenkapitaal (aantal aandelen)"]
[428,"Number of shares at the beginning of the period","Aantal aandelen aan het begin van de periode"]
[429,"Shares issued","Aandelen uitgegeven"]
[430,"Shares purchased","Aandelen ingekocht"]
[431,"Shares granted","Aandelen toegekend"]
[432,"Shares sold","Aandelen verkocht"]
[433,"Shares withdrawn","Aandelen ingetrokken"]
[434,"Shares distributed as dividend","Aandelen verstrekt als dividend"]
[435,"Other movements","Overige mutaties"]
[436,"Total of movements during the period","Totaal van mutaties gedurende de periode"]
[437,"Number of shares at the end of the period","Aantal aandelen aan het einde van de periode"]
[438,"Notes to the financial statements - Share capital, previous period: Statement of changes in number of shares: Specification","Toelichting op de jaarrekening - Aandelenkapitaal, voorgaande periode: Mutatieoverzicht in aantal aandelen: Specificatie"]
[439,"Description Share capital (number of shares)","Omschrijving Aandelenkapitaal (aantal aandelen)"]
[440,"Notes to the financial statements - Share capital","Toelichting op de jaarrekening - Aandelenkapitaal"]
[441,"Disclosure of share capital paid called up","Informatieverschaffing over gestort en opgevraagd aandelenkapitaal"]
[442,"Disclosure of treasury shares","Informatieverschaffing over eigen aandelen"]
[443,"Description of the purchase or sale of treasury shares or certificates thereof","Beschrijving van de verwerving en vervreemding van eigen aandelen en certificaten daarvan"]
[444,"Description of the way in which payments are made on shares that became due in the financial year or were made voluntarily","Beschrijving van de opgave van de wijze waarop stortingen op aandelen zijn verricht die in het boekjaar opeisbaar werden of vrijwillig zijn verricht"]
[445,"Notes to the financial statements - Share capital: Other amounts: Breakdown","Toelichting op de jaarrekening - Aandelenkapitaal: Overige bedragen: Uitsplitsing"]
[446,"Share capital issued","Geplaatst aandelenkapitaal"]
[447,"Share capital paid","Gestort aandelenkapitaal"]
[448,"Registered capital","Maatschappelijk kapitaal"]
[449,"Notes to the financial statements - Share capital: Specification","Toelichting op de jaarrekening - Aandelenkapitaal: Specificatie"]
[450,"Description Share capital","Omschrijving Aandelenkapitaal"]
[451,"Notes to the financial statements - Share premium","Toelichting op de jaarrekening - Agio"]
[452,"Disclosure of share premium","Informatieverschaffing over agio"]
[453,"Revaluation reserve","Herwaarderingsreserve"]
[454,"Notes to the financial statements - Revaluation reserve: Statement of changes","Toelichting op de jaarrekening - Herwaarderingsreserve: Mutatieoverzicht"]
[455,"Changes in value of assets, except for financial instruments, recognised directly through equity","Waardeveranderingen voor activa, niet zijnde financiële instrumenten, rechtstreeks in eigen vermogen"]
[456,"Changes in value of financial instruments recognised directly through equity","Waardeveranderingen voor financiële instrumenten rechtstreeks in eigen vermogen"]
[457,"Total of recognised directly through equity","Totaal van rechtstreeks in eigen vermogen"]
[458,"Hedged","Afgedekt"]
[459,"No price quotation in active market","Geen frequente marktnotering"]
[460,"Total of revaluation reserves","Totaal van herwaarderingsreserves"]
[461,"Revaluation reserve at the beginning of the period","Herwaarderingsreserve aan het begin van de periode"]
[462,"Movement of revaluation reserve as a result of change in accounting policies","Mutatie in herwaarderingsreserve als gevolg van stelselwijzigingen"]
[463,"Movement of revaluation reserve as a result of tax impact of change in accounting policies","Mutatie in herwaarderingsreserve als gevolg van belastingeffect van stelselwijzigingen"]
[464,"Adjusted revaluation reserve after recalculation due to change in accounting policies","Aangepaste herwaarderingsreserve na herrekening als gevolg van stelselwijziging"]
[465,"Realised revaluations through the income statement","Gerealiseerde herwaarderingen via winst-en-verliesrekening"]
[466,"Realised revaluations through the other reserves","Gerealiseerde herwaarderingen via overige reserves"]
[467,"Realised revaluations through hedged assets and liabilities","Gerealiseerde herwaarderingen via afgedekte activa of passiva"]
[468,"Tax impact of realised revaluations","Belastingeffecten op gerealiseerde herwaarderingen"]
[469,"Revaluations through the income statement","Gevormde herwaarderingen via winst-en-verliesrekening"]
[470,"Revaluations through the other reserves","Gevormde herwaarderingen via overige reserves"]
[471,"Revaluations through hedged assets and liabilities","Gevormde herwaarderingen via afgedekt activa of passiva"]
[472,"Tax impact of revaluations","Belastingeffecten op gevormde herwaarderingen"]
[473,"Revaluation reserve at the end of the period","Herwaarderingsreserve aan het einde van de periode"]
[474,"Notes to the financial statements - Revaluation reserve, previous period: Statement of changes","Toelichting op de jaarrekening - Herwaarderingsreserve, voorgaande periode: Mutatieoverzicht"]
[475,"Notes to the financial statements - Revaluation reserve","Toelichting op de jaarrekening - Herwaarderingsreserve"]
[476,"Disclosure of revaluation reserve","Informatieverschaffing over herwaarderingsreserve"]
[477,"Description of how, in conjunction with the revaluation, the impact of taxes on capital and income is taken into account","Beschrijving van op welke wijze in samenhang met de herwaardering rekening wordt gehouden met de invloed van belastingen op vermogen en resultaat"]
[478,"Notes to the financial statements - Other legal reserves: Breakdown","Toelichting op de jaarrekening - Andere wettelijke reserves: Uitsplitsing"]
[479,"Legal reserve for the negative translation of the share capital of a public limited liability company into euros","Negatieve bijschrijvingsreserve als gevolg van de omrekening van het aandelenkapitaal van een naamloze vennootschap naar de euro"]
[480,"Legal reserve for the translation of the share capital of a public limited liability company into euros","Niet-uitkeerbare reserve als gevolg van de omrekening van het aandelenkapitaal van een naamloze vennootschap naar de euro"]
[481,"Reserve for contribution on shares other than cash","Reserve voor inbreng op aandelen anders dan in geld"]
[482,"Non-distributable reserve for granted loan to obtain by others shares in the capital of the company or of depositary receipts thereof","Niet-uitkeerbare reserve voor verstrekte lening ter verkrijging door anderen van aandelen in het kapitaal van de vennootschap of van certificaten daarvan"]
[483,"Legal reserve that account for incorporation and share issue","Wettelijke reserve voor kosten die verband houden met de oprichting en met de uitgifte van aandelen"]
[484,"Legal reserve for capitalised development costs","Wettelijke reserve voor geactiveerde kosten van ontwikkeling"]
[485,"Legal reserve participating interests","Wettelijke reserve deelnemingen"]
[486,"Legal reserve for conversion differences for the conversion of the invested capital and the result of participating interests","Wettelijke reserve omrekeningsverschillen voor omrekening van het geïnvesteerde vermogen en het resultaat van deelnemingen"]
[487,"Foreign currency translation reserve","Reserve omrekeningsverschillen"]
[488,"Total of other legal reserves","Totaal van andere wettelijke reserves"]
[489,"Notes to the financial statements - Other legal reserves","Toelichting op de jaarrekening - Andere wettelijke reserves"]
[490,"Disclosure of other legal reserves, distinguished by their nature","Informatieverschaffing over andere wettelijke reserves, onderscheiden naar hun aard"]
[491,"Notes to the financial statements - Statutory reserves","Toelichting op de jaarrekening - Statutaire reserves"]
[492,"Disclosure of statutory reserves","Informatieverschaffing over statutaire reserves"]
[493,"Notes to the financial statements - Fiscal reinvestment reserve","Toelichting op de jaarrekening - Fiscale herinvesteringsreserve"]
[494,"Disclosure of reinvestment reserve","Informatieverschaffing over herinvesteringsreserve"]
[495,"Notes to the financial statements - Other reserves","Toelichting op de jaarrekening - Overige reserves"]
[496,"Disclosure of other reserves","Informatieverschaffing over overige reserves"]
[497,"Notes to the financial statements - Other tax reserves","Toelichting op de jaarrekening - Overige fiscale reserves"]
[498,"Disclosure of other fiscal reserves","Informatieverschaffing over de overige fiscale reserves"]
[499,"Result for the year","Resultaat van het boekjaar"]
[500,"Notes to the financial statements - Result for the year","Toelichting op de jaarrekening - Resultaat van het boekjaar"]
[501,"Disclosure of result after tax for the year","Informatieverschaffing over resultaat na belastingen van het boekjaar"]
[502,"Notes to the financial statements - Undistributed profit","Toelichting op de jaarrekening - Niet verdeelde winsten"]
[503,"Disclosure of undistributed profit","Informatieverschaffing over niet verdeelde winsten"]
[504,"Notes to the financial statements - Provisions","Toelichting op de jaarrekening - Voorzieningen"]
[505,"Disclosure of provisions","Informatieverschaffing over voorzieningen"]
[506,"Disclosure of provision for repair costs","Informatieverschaffing over voorziening voor herstelkosten"]
[507,"Disclosure of provision for tax liabilities","Informatieverschaffing over voorziening voor belastingverplichtingen"]
[508,"Disclosure of provision for pension obligations","Informatieverschaffing over voorzieningen voor pensioenverplichtingen"]
[509,"Disclosure of provision for employee benefits","Informatieverschaffing over voorziening uit hoofde van personeelsbeloningen"]
[510,"Disclosure of environmental provision","Informatieverschaffing over voorziening voor opruiming van aanwezige milieuvervuiling"]
[511,"Disclosure of provision for legal proceedings","Informatieverschaffing over voorziening uit hoofde van claims, geschillen en rechtsgedingen"]
[512,"Disclosure of provision for major maintenance","Informatieverschaffing over voorziening voor groot onderhoud"]
[513,"Disclosure of information on the application of the transitional provision - major maintenance provision","Informatieverschaffing over de toepassing van de overgangsbepaling - voorziening groot onderhoud"]
[514,"Disclosure of provision for disposal obligations","Informatieverschaffing over voorziening voor verwijderingsverplichtingen"]
[515,"Disclosure of provision for onerous contracts","Informatieverschaffing over voorziening voor verlieslatende contracten"]
[516,"Description of the actuarial assumptions used for the provision for pension obligations","Beschrijving van de actuariële grondslagen gehanteerd voor de voorziening voor pensioenverplichtingen"]
[517,"Description of obligations per balance sheet date that have pension provisions","Beschrijving van de per balansdatum bestaande verplichtingen waarvoor een pensioenvoorziening is opgenomen"]
[518,"Disclosure of restructuring provision","Informatieverschaffing over voorziening in verband met reorganisaties"]
[519,"Disclosure of provision relating to participating interest","Informatieverschaffing over voorziening in verband met deelnemingen"]
[520,"Description of the valuation methods of the provision for pension obligations","Beschrijving van de methode van waardering van de opgenomen pensioenvoorziening"]
[521,"Disclosure of deferred tax liabilities","Informatieverschaffing over latente belastingverplichtingen"]
[522,"Disclosure of warranty provision","Informatieverschaffing over garantievoorziening"]
[523,"Notes to the financial statements - Provisions: Other amounts: Breakdown","Toelichting op de jaarrekening - Voorzieningen: Overige bedragen: Uitsplitsing"]
[524,"Long-term part of provisions","Langlopend deel van de voorzieningen"]
[525,"Notes to the financial statements - Non-current liabilities: Breakdown","Toelichting op de jaarrekening - Langlopende schulden: Uitsplitsing"]
[526,"Old age obligation","Oudedagsverplichting"]
[527,"Other payables","Overige schulden"]
[528,"Total of non-current liabilities","Totaal van langlopende schulden"]
[529,"Notes to the financial statements - Non-current liabilities","Toelichting op de jaarrekening - Langlopende schulden"]
[530,"Disclosure of non-current liabilities","Informatieverschaffing over langlopende schulden"]
[531,"Disclosure of subordinated liabilities","Informatieverschaffing over achtergestelde schulden"]
[532,"Disclosure of finance lease liabilities","Informatieverschaffing over financiële leaseverplichtingen"]
[533,"Disclosure of old age obligation","Informatieverschaffing over oudedagsverplichting"]
[534,"Disclosure of negative goodwill","Informatieverschaffing over negatieve goodwill"]
[535,"Description of the period where negative goodwill is recognised in income statement","Beschrijving van de periode waarin de negatieve goodwill ten gunste van de winst-en-verliesrekening wordt gebracht"]
[536,"Disclosure of accruals and deferred income","Informatieverschaffing over overlopende passiva"]
[537,"Specification of secured liabilities and form of separation","Opgave van de schulden waarvoor zakelijke zekerheid is gesteld en in welke vorm dat is geschied"]
[538,"Disclosure of the maturity of non-current liabilities","Informatieverschaffing over de looptijd van langlopende schulden"]
[539,"Disclosure of the liabilities to which the legal person has committed itself, whether or not conditionally, to encumber or not to encumber assets","Informatieverschaffing over de schulden waarvoor de rechtspersoon zich, al dan niet voorwaardelijk, heeft verbonden tot het bezwaren of niet bezwaren van goederen"]
[540,"Notes to the financial statements - Non-current liabilities: Other amounts: Breakdown","Toelichting op de jaarrekening - Langlopende schulden: Overige bedragen: Uitsplitsing"]
[541,"Non-current liabilities with a maturity exceeding five years","Langlopende schulden met een looptijd langer dan vijf jaar"]
[542,"Amount of secured non-current liabilities","Bedrag aan langlopende schulden waarvoor zakelijke zekerheid is gesteld"]
[543,"Negative goodwill","Negatieve goodwill"]
[544,"Notes to the financial statements - Current liabilities","Toelichting op de jaarrekening - Kortlopende schulden"]
[545,"Disclosure of current liabilities","Informatieverschaffing over kortlopende schulden"]
[546,"Notes to the financial statements - Current liabilities: Other amounts: Breakdown","Toelichting op de jaarrekening - Kortlopende schulden: Overige bedragen: Uitsplitsing"]
[547,"Amount of secured current liabilities","Bedrag aan kortlopende schulden waarvoor zakelijke zekerheid is gesteld"]
[548,"Off-balance sheet commitments","Niet in de balans opgenomen verplichtingen"]
[549,"Notes to the financial statements - Assets and liabilities not recognised in balance sheet","Toelichting op de jaarrekening - Niet in de balans opgenomen activa en verplichtingen"]
[550,"Description of off-balance sheet commitments relating to payments to obtain usage rights","Beschrijving van niet in de balans opgenomen verplichtingen inzake betalingen ter verkrijging van (gebruiks)rechten"]
[551,"Disclosure of off-balance sheet commitments","Informatieverschaffing over niet in de balans opgenomen verplichtingen"]
[552,"Description of the nature of off-balance sheet liabilities","Beschrijving van de aard van niet uit de balans blijkende verplichtingen"]
[553,"Description of the financial consequences of the contingent arrangements","Beschrijving van de financiële gevolgen van de niet in de balans opgenomen regelingen"]
[554,"Description of the business objectives of the contingent arrangements","Beschrijving van het zakelijk doel van de niet in de balans opgenomen regelingen"]
[555,"Description of the nature of the contingent arrangements","Beschrijving van de aard van de niet in de balans opgenomen regelingen"]
[556,"Description of the indication of uncertainties regarding the amount or moment of outflow relating to off-balance sheet liabilities","Beschrijving van de indicatie van de onzekerheden met betrekking tot het bedrag of het moment van uitstroom in het kader van niet uit de balans blijkende verplichtingen"]
[557,"Description of the possibility of any reimbursement relating to off-balance sheet liabilities","Beschrijving van de mogelijkheid van enigerlei vergoeding in het kader van niet uit de balans blijkende verplichtingen"]
[558,"Disclosure of contingent liabilities on behalf of group companies","Informatieverschaffing over niet uit de balans blijkende verplichtingen ten behoeve van groepsmaatschappijen"]
[559,"Description of off-balance sheet commitments relating to liability claims","Beschrijving van niet in de balans opgenomen verplichtingen inzake aansprakelijkheidsstellingen"]
[560,"Description of the off-balance sheet liabilities relating to the fiscal unity","Beschrijving van de niet in de balans opgenomen verplichtingen inzake de fiscale eenheid"]
[561,"Description of off-balance sheet liabilities relating to purchase commitments","Beschrijving van niet in de balans opgenomen verplichtingen inzake investeringsverplichtingen"]
[562,"Description of off-balance sheet commitments relating to guarantees","Beschrijving van niet in de balans opgenomen verplichtingen inzake garanties"]
[563,"Description of guarantees for the joint supervisory directors of the legal person, as provided by the legal entity, are subsidiaries and the companies of which he consolidates the data","Beschrijving van garanties ten behoeve van de gezamenlijke commissarissen van de rechtspersoon, zoals verstrekt door de rechtspersoon, zijn dochtermaatschappijen en de maatschappijen waarvan hij de gegevens consolideert"]
[564,"Disclosure of contingent assets","Informatieverschaffing over niet in de balans opgenomen activa"]
[565,"Description of the estimate of financial impact of off-balance sheet liabilities","Beschrijving van de schatting van het financiële effect van niet uit de balans blijkende verplichtingen"]
[566,"Disclosure of operating leases","Informatieverschaffing over operationele leases"]
[567,"Description of the average maturity of the operational lease commitments","Beschrijving van de gemiddelde looptijd van de operationele leaseverplichtingen"]
[568,"Description of the size and duration of obligations to purchase or sell stocks of special significance","Beschrijving van omvang en looptijd van verplichtingen tot aan- of verkoop van voorraden van bijzondere betekenis"]
[569,"Notes to the financial statements - Assets and liabilities not recognised in balance sheet: Other amounts: Breakdown","Toelichting op de jaarrekening - Niet in de balans opgenomen activa en verplichtingen: Overige bedragen: Uitsplitsing"]
[570,"Contingent assets to which the legal entity committed","Voorwaardelijke activa waartoe de rechtspersoon zich heeft verbonden"]
[571,"Contingent liabilities to which the legal entity committed","Voorwaardelijke verplichtingen waartoe de rechtspersoon zich heeft verbonden"]
[572,"Liabilities to which the legal entity committed","Verplichtingen waartoe de rechtspersoon zich heeft verbonden"]
[573,"Not recorded liabilities to which the legal entity committed","Niet verwerkte verplichtingen waartoe de rechtspersoon zich heeft verbonden"]
[574,"Contingent liabilities on behalf of group companies","Verplichtingen voortkomend uit aansprakelijkheid voor schulden van groepsmaatschappijen"]
[575,"Contingent liabilities from discounted exchanges or chèques on behalf of group companies","Verplichtingen voortkomend uit verdisconteerde wissels of chèques van groepsmaatschappijen"]
[576,"Contingent assets to which the legal entity committed on behalf of group companies","Voorwaardelijke activa waartoe de rechtspersoon zich ten behoeve van groepsmaatschappijen heeft verbonden"]
[577,"Contingent liabilities to which the legal entity committed on behalf of group companies","Voorwaardelijke verplichtingen waartoe de rechtspersoon zich ten behoeve van groepsmaatschappijen heeft verbonden"]
[578,"Liabilities to which the legal entity committed on behalf of group companies","Verplichtingen waartoe de rechtspersoon zich ten behoeve van groepsmaatschappijen heeft verbonden"]
[579,"Not recorded liabilities to which the legal entity committed on behalf of group companies","Niet verwerkte verplichtingen waartoe de rechtspersoon zich ten behoeve van groepsmaatschappijen heeft verbonden"]
[580,"Notes to the financial statements - Assets and liabilities not recognised in balance sheets: Payments to obtain usage rights: Breakdown maturity","Toelichting op de jaarrekening - Niet in de balans opgenomen activa en verplichtingen: Betalingen ter verkrijging van rechten: Uitsplitsing looptijd"]
[581,"Off-balance sheet liabilities relating to payments to obtain usage rights","Niet in de balans opgenomen verplichtingen inzake betalingen ter verkrijging van (gebruiks)rechten"]
[582,"Off-balance sheet commitments relating to payments to obtain usage rights with a maturity exceeding one year","Niet in de balans opgenomen verplichtingen inzake betalingen ter verkrijging van (gebruiks)rechten met een looptijd langer dan een jaar"]
[583,"Off-balance sheet commitments relating to payments to obtain usage rights with a maturity exceeding five years","Niet in de balans opgenomen verplichtingen inzake betalingen ter verkrijging van (gebruiks)rechten met een looptijd langer dan vijf jaar"]
[584,"Income statement","Winst-en-verliesrekening"]
[585,"Depreciation of property, plant and equipment and amortisation of intangible assets","Afschrijvingen op immateriële en materiële vaste activa"]
[586,"Notes to the financial statements - Amortisation of intangible assets and depreciation of property, plant and equipment","Toelichting op de jaarrekening - Afschrijvingen op immateriële en materiële vaste activa"]
[587,"Disclosure of amortisation of intangible assets and depreciation of property, plant and equipment","Informatieverschaffing over afschrijvingen op immateriële en materiële vaste activa"]
[588,"Disclosure of amortisation of intangible assets","Informatieverschaffing over afschrijvingen op immateriële vaste activa"]
[589,"Disclosure of depreciation of property, plant and equipment","Informatieverschaffing over afschrijvingen op materiële vaste activa"]
[590,"Disclosure of amortisation and depreciation of the amount of arbitrary depreciation and amortisation that exceeds the amount of regular depreciation and amortisation","Informatieverschaffing over afschrijvingen van het bedrag aan willekeurige afschrijving dat uitgaat boven het bedrag van de reguliere afschrijving wanneer niet willekeurig zou zijn afgeschreven"]
[591,"Notes to the financial statements - Impairment loss of individual asset of material importance: Specification","Toelichting op de jaarrekening - Bijzonder waardeverminderingsverlies van individueel actief welke van materieel belang is: Specificatie"]
[592,"Individual asset","Individueel actief"]
[593,"Description Individual asset","Omschrijving Individueel actief"]
[594,"Description of the nature of the individual asset for which an impairment loss, or reversal thereof, is recognized which is material","Beschrijving van de aard van het individueel actief waarvoor een bijzondere waardeverminderingsverlies, of terugneming hiervan, is verantwoord welke van materieel belang is"]
[595,"Description of the segment to be reported to which it is individually active, for which an impairment loss, or reversal thereof, is justified which is material","Beschrijving van het te rapporteren segment waartoe het individueel actief behoort waarvoor een bijzondere waardeverminderingsverlies, of terugneming hiervan, is verantwoord welke van materieel belang is"]
[596,"Description of whether the current value or the value in use is applicable","Beschrijving van of de opbrengstwaarde of de bedrijfswaarde van toepassing is"]
[597,"Income tax expense","Belastingen"]
[598,"Notes to the financial statements - Income tax expense","Toelichting op de jaarrekening - Belastingen"]
[599,"Disclosure of income tax expense","Informatieverschaffing over belastingen over de winst of het verlies"]
[600,"Disclosure of income tax expense from ordinary activities","Informatieverschaffing over belastingen over resultaat uit gewone bedrijfsuitoefening"]
[601,"Disclosure of the reconciliation of the income tax expense to the corporate tax return","Informatieverschaffing over de aansluiting van belastingen met de aangifte vennootschapsbelasting"]
[602,"Disclosure of fiscal adjustments for prior years relating to income tax","Informatieverschaffing over fiscale correcties over eerdere jaren inzake belastingen"]
[603,"Disclosure of income tax recognised directly in equity","Informatieverschaffing over belastingen rechtstreeks in het eigen vermogen verwerkt"]
[604,"Notes to the financial statements - Income tax expense: Other amounts: Breakdown","Toelichting op de jaarrekening - Belastingen: Overige bedragen: Uitsplitsing"]
[605,"Limited deductible expenses","Beperkte aftrekbare kosten"]
[606,"Non deductible expenses","Niet aftrekbare kosten"]
[607,"Other notes","Overige toelichtingen"]
[608,"Licensing agreements","Concessies"]
[609,"Notes to the financial statements - Licensing agreements","Toelichting op de jaarrekening - Concessies"]
[610,"Policy of public-private concession agreements","Grondslag van publiek-private concessieovereenkomsten"]
[611,"Disclosure of licensing agreements","Informatieverschaffing over concessies"]
[612,"Description of the main licensing agreements","Beschrijving van de afspraken omtrent concessies in hoofdlijnen"]
[613,"Description of the most important conditions in the agreements concerning concessions that influence the size, the moment and the certainty of the future cash flows","Beschrijving van de belangrijkste voorwaarden in de afspraken omtrent concessies die van invloed zijn op de grootte, het moment en de zekerheid van de toekomstige kasstromen"]
[614,"Description of the nature and extent of the rights to the use of specific assets","Beschrijving van de aard en omvang van de rechten op het gebruik van specifieke activa"]
[615,"Description of the nature and extent of service obligations or the rights to expected services","Beschrijving van de aard en omvang van de verplichtingen tot dienstverlening of de rechten op verwachte dienstverlening"]
[616,"Description of the nature and extent of the obligations for the purchase or construction of property, plant and equipment","Beschrijving van de aard en omvang van de verplichtingen tot koop of bouw van materiële vaste activa"]
[617,"Description of the nature and extent of the obligations to transfer specific assets at the end of the concession period or the rights to receive these assets","Beschrijving van de aard en omvang van de verplichtingen tot overdracht van specifieke activa aan het einde van de concessieperiode of de rechten op ontvangst van deze activa"]
[618,"Description of the nature and extent of the options for extension or termination","Beschrijving van de aard en omvang van de opties tot verlenging of beëindiging"]
[619,"Description of the nature and extent of other rights and obligations","Beschrijving van de aard en omvang van andere rechten en verplichtingen"]
[620,"Description of the changes of the agreements during the period if applicable; and the manner in which the concession agreement is classified","Beschrijving van de veranderingen van de afspraken gedurende de periode indien van toepassing; en de wijze waarop de concessieovereenkomst is geclassificeerd"]
[621,"Average number of employees","Gemiddeld aantal werknemers"]
[622,"Notes to the financial statements - Average number of employees: Breakdown","Toelichting op de jaarrekening - Gemiddeld aantal werknemers: Uitsplitsing"]
[623,"Average number of employees over the period working in the Netherlands","Gemiddeld aantal werknemers over de periode werkzaam binnen Nederland"]
[624,"Average number of employees over the period working outside the Netherlands","Gemiddeld aantal werknemers over de periode werkzaam buiten Nederland"]
[625,"Total of average number of employees over the period","Totaal van gemiddeld aantal werknemers over de periode"]
[626,"Notes to the financial statements - Average number of employees","Toelichting op de jaarrekening - Gemiddeld aantal werknemers"]
[627,"Disclosure of average number of employees during the period","Informatieverschaffing over gemiddeld aantal werknemers over de periode"]
[628,"Financial instruments","Financiële instrumenten"]
[629,"Notes to the financial statements - Financial instruments","Toelichting op de jaarrekening - Financiële instrumenten"]
[630,"Disclosure of financial instruments","Informatieverschaffing over financiële instrumenten"]
[631,"Disclosure of financial assets of book value higher than current value","Informatieverschaffing over financiële vaste activa met de boekwaarde die hoger is dan de actuele waarde"]
[632,"Description of the nature and size of the derivative financial instruments","Beschrijving van de aard en omvang van de afgeleide financiële instrumenten"]
[633,"Terms and conditions that may affect the amount, timing and certainty of future cash flows of derivative financial instruments","Voorwaarden die op het bedrag, het tijdstip en de zekerheid van toekomstige kasstromen van afgeleide financiële instrumenten van invloed kunnen zijn"]
[634,"Notes to the financial statements - Payments due to termination of the employment to senior officials with or without employment: Specification","Toelichting op de jaarrekening - Uitkeringen wegens beëindiging van het dienstverband aan topfunctionarissen met of zonder dienstbetrekking: Specificatie"]
[635,"The name (consisting of the initials and last name) of the senior official","De naam (bestaande uit de voorletters en achternaam) van de topfunctionaris"]
[636,"Description The name (consisting of the initials and last name) of the senior official","Omschrijving De naam (bestaande uit de voorletters en achternaam) van de topfunctionaris"]
[637,"Position(s)","Functie(s)"]
[638,"Extent of employment as a part-time factor in FTE","Omvang van het dienstverband uitgedrukt als deeltijdfactor in FTE"]
[639,"Year of termination of the employment","Jaar waarin het dienstverband is beëindigd"]
[640,"Agreed payments due to termination","Overeengekomen uitkeringen wegens beëindiging dienstverband"]
[641,"Individual maximum remuneration","Individueel toepasselijk maximum"]
[642,"Total of payments due to termination of the employment","Totaal van uitkeringen wegens beëindiging van het dienstverband"]
[643,"Payments made in the financial year due to termination of the employment","In het boekjaar gedane uitkeringen wegens beëindiging van het dienstverband"]
[644,"Undue payments and amounts not yet received","Onverschuldigd betaald en nog niet terugontvangen bedrag"]
[645,"Amount exceeding maximum remuneration","Het bedrag van de overschrijding"]
[646,"Reasons for exceeding the maximum amount of remuneration","Reden waarom de overschrijding al dan niet is toegestaan"]
[647,"Description of the claim for undue payment","Toelichting op de vordering wegens onverschuldigde betaling"]
[648,"Error recovery in WNT accountability","Foutenherstel in verantwoording WNT"]
[649,"Explanation of the difference and cause of error recovery","Toelichting op verschil en oorzaak foutenherstel"]
[650,"Remuneration of managing and supervisory directors","Bezoldiging van bestuurders en commissarissen"]
[651,"Notes to the financial statements - Remuneration of executive senior officials with employment and without employment from the 13th month: Specification","Toelichting op de jaarrekening - Bezoldiging van leidinggevende topfunctionarissen met dienstbetrekking en zonder dienstbetrekking vanaf de 13e maand: Specificatie"]
[652,"Description The name (consisting of the initials and last name) of the senior official","Omschrijving De naam (bestaande uit de voorletters en achternaam) van de topfunctionaris"]
[653,"Start of employment","Aanvang functievervulling"]
[654,"End of employment","Einde functievervulling"]
[655,"Employment relationship?","Dienstbetrekking?"]
[656,"Consideration plus taxable expense allowances","Beloning plus belastbare onkostenvergoedingen"]
[657,"Post-employment benefits","Beloningen betaalbaar op termijn"]
[658,"Subtotal","Subtotaal"]
[659,"Individual applicable remuneration maximum","Individueel toepasselijke bezoldigingsmaximum"]
[660,"Remuneration","Bezoldiging"]
[661,"Notes to the financial statements - Remuneration of executive senior officials with employment and without employment from the 13th month, previous period: Specification","Toelichting op de jaarrekening - Bezoldiging van leidinggevende topfunctionarissen met dienstbetrekking en zonder dienstbetrekking vanaf de 13e maand, voorgaande periode: Specificatie"]
[662,"Description The name (consisting of the initials and last name) of the senior official","Omschrijving De naam (bestaande uit de voorletters en achternaam) van de topfunctionaris"]
[663,"Notes to the financial statements - Remuneration of executive senior officials without employment in the period up to and including the 12th month: Specification","Toelichting op de jaarrekening - Bezoldiging van leidinggevende topfunctionarissen zonder dienstbetrekking in periode tot en met de 12e maand: Specificatie"]
[664,"Description The name (consisting of the initials and last name) of the senior official","Omschrijving De naam (bestaande uit de voorletters en achternaam) van de topfunctionaris"]
[665,"Calendar year","Kalenderjaar"]
[666,"Start of the duration of the employment during the calender year","Aanvang functievervulling in het kalenderjaar"]
[667,"End of the employment during the calender year","Einde functievervulling in het kalenderjaar"]
[668,"Number of months of employment during the calendar year","Aantal maanden van functievervulling in het kalenderjaar"]
[669,"Extent of employment in hours per calendar year","Omvang van het dienstverband in uren per kalenderjaar"]
[670,"Maximum remuneration per hour during the calender year","Maximum uurtarief in het kalenderjaar"]
[671,"Maxima on the basis of the standard amounts per month","Maxima op basis van de normbedragen per maand"]
[672,"Individual applicable maximum entire period calendar month 1 to 12","Individueel toepasselijke maximum gehele periode kalendermaand 1 t/m 12"]
[673,"Remuneration in the relevant period","Bezoldiging in de betreffende periode"]
[674,"Total remuneration for entire period calendar month 1 to 12","Totale bezoldiging gehele periode kalendermaand 1 t/m 12"]
[675,"Notes to the financial statements - Remuneration of executive senior officials without employment in the period up to and including the 12th month, previous period: Specification","Toelichting op de jaarrekening - Bezoldiging van leidinggevende topfunctionarissen zonder dienstbetrekking in periode tot en met de 12e maand, voorgaande periode: Specificatie"]
[676,"Description The name (consisting of the initials and last name) of the senior official","Omschrijving De naam (bestaande uit de voorletters en achternaam) van de topfunctionaris"]
[677,"Notes to the financial statements - Remuneration of non-senior officials: Specification","Toelichting op de jaarrekening - Bezoldiging van niet-topfunctionarissen: Specificatie"]
[678,"Description of the position of the non-senior official","Beschrijving van de functie van de niet-topfunctionaris"]
[679,"Description Description of the position of the non-senior official","Omschrijving Beschrijving van de functie van de niet-topfunctionaris"]
[680,"Total of remuneration","Totaal van bezoldiging"]
[681,"Individual applicable threshold remuneration","Individueel toepasselijk drempelbedrag bezoldiging"]
[682,"Justification of exceeding the maximum remuneration","Motivering van de overschrijding van de maximale bezoldiging"]
[683,"Notes to the financial statements - Remuneration of non-senior officials, previous period: Specification","Toelichting op de jaarrekening - Bezoldiging van niet-topfunctionarissen, voorgaande periode: Specificatie"]
[684,"Description Description of the position of the non-senior official","Omschrijving Beschrijving van de functie van de niet-topfunctionaris"]
[685,"Notes to the financial statements - Remuneration of supervisory senior officials: Specification","Toelichting op de jaarrekening - Bezoldiging van toezichthoudende topfunctionarissen: Specificatie"]
[686,"The name (consisting of the initials and last name) of the supervisory senior official","De naam (bestaande uit de voorletters en achternaam) van de toezichthoudende topfunctionaris"]
[687,"Description The name (consisting of the initials and last name) of the supervisory senior official","Omschrijving De naam (bestaande uit de voorletters en achternaam) van de toezichthoudende topfunctionaris"]
[688,"Remuneration including undue payments","Bezoldiging inclusief onverschuldigde betalingen"]
[689,"Notes to the financial statements - Remuneration of supervisory senior officials, previous period: Specification","Toelichting op de jaarrekening - Bezoldiging van toezichthoudende topfunctionarissen, voorgaande periode: Specificatie"]
[690,"Description The name (consisting of the initials and last name) of the supervisory senior official","Omschrijving De naam (bestaande uit de voorletters en achternaam) van de toezichthoudende topfunctionaris"]
[691,"Notes to the financial statements - Executive senior officials and those who are regarded as executive senior official for another 4 years with a remuneration of € 1.900 or less: Specification","Toelichting op de jaarrekening - Bezoldiging van topfunctionarissen en degenen die nog 4 jaar als topfunctionaris worden aangemerkt met een bezoldiging van € 1.900 of minder: Specificatie"]
[692,"Description The name (consisting of the initials and last name) of the senior official","Omschrijving De naam (bestaande uit de voorletters en achternaam) van de topfunctionaris"]
[693,"Notes to the financial statements - Total remuneration of a senior official as well as the person who is regarded as a senior official for another 4 years based on his / her former position: Specification","Toelichting op de jaarrekening - Totale bezoldiging van een topfunctionaris alsmede degene die op grond van zijn/haar voormalige functie nog 4 jaar als topfunctionaris wordt aangemerkt: Specificatie"]
[694,"Description The name (consisting of the initials and last name) of the senior official","Omschrijving De naam (bestaande uit de voorletters en achternaam) van de topfunctionaris"]
[695,"Remuneration in respect to activities as senior officer","Bezoldiging voor de werkzaamheden als topfunctionaris"]
[696,"Remuneration in respect to other activities as senior officer","Bezoldiging voor andere werkzaamheden dan die als topfunctionaris"]
[697,"Remuneration in respect to activities of affiliated companies","Bezoldiging voor de werkzaamheden bij gelieerde rechtspersonen"]
[698,"Double counting caused by charges","Dubbeltellingen door doorbelastingen"]
[699,"Subtotal remuneration","Subtotaal bezoldiging"]
[700,"Name WNT institution in respect to activities as senior officer","Naam WNT instelling met betrekking tot de werkzaamheden als topfunctionaris"]
[701,"Name WNT institution in respect to other activities as senior officer","Naam WNT instelling met betrekking tot andere werkzaamheden dan die als topfunctionaris"]
[702,"Name WNT institution in respect to activities of affiliated companies","Naam WNT instelling met betrekking tot de werkzaamheden bij gelieerde rechtspersonen"]
[703,"Remuneration maximum of the institution or allowed higher individual remuneration senior officer","Het voor de WNT-instelling geldende bezoldigingsmaximum dan wel een voor de individuele topfunctionaris toegestane hogere bezoldiging"]
[704,"Notes to the financial statements - Total remuneration of a senior official as well as the person who is regarded as a senior official for another 4 years based on his / her former position, previous period: Specification","Toelichting op de jaarrekening - Totale bezoldiging van een topfunctionaris alsmede degene die op grond van zijn/haar voormalige functie nog 4 jaar als topfunctionaris wordt aangemerkt, voorgaande periode: Specificatie"]
[705,"Description The name (consisting of the initials and last name) of the senior official","Omschrijving De naam (bestaande uit de voorletters en achternaam) van de topfunctionaris"]
[706,"Remuneration of non-supervising senior officials who already have employment with another WNT institution: Specification","Bezoldiging van niet toezichthoudende topfunctionarissen die reeds dienstbetrekking hebben bij andere WNT-instelling: Specificatie"]
[707,"Notes to the financial statements - Remuneration of non-supervising senior officials who already have employment with another WNT institution: Specification","Toelichting op de jaarrekening - Bezoldiging van niet toezichthoudende topfunctionarissen die reeds dienstbetrekking hebben bij andere WNT-instelling: Specificatie"]
[708,"The name (consisting of the initials and last name) of the non supervisory senior official","De naam (bestaande uit de voorletters en achternaam) van de niet toezichthoudende topfunctionaris"]
[709,"Description The name (consisting of the initials and last name) of the non supervisory senior official","Omschrijving De naam (bestaande uit de voorletters en achternaam) van de niet toezichthoudende topfunctionaris"]
[710,"Start date employment","Datum aanvang dienstbetrekking"]
[711,"Total remuneration per institution amounts x € 1","Totale bezoldiging per WNT-instelling bedragen x € 1"]
[712,"Notes to the financial statements - Remuneration of a senior official with a total remuneration of € 1.900 or more concerning anti cumulation - Cumulated: Specification","Toelichting op de jaarrekening - Bezoldiging van topfunctionaris met een totale bezoldiging van meer dan € 1.900 waarop de anticumulatie bepaling van toepassing is - Gecumuleerd: Specificatie"]
[713,"Description The name (consisting of the initials and last name) of the non supervisory senior official","Omschrijving De naam (bestaande uit de voorletters en achternaam) van de niet toezichthoudende topfunctionaris"]
[714,"Cumulated total remuneration at all institutions concerning anti cumalation approach","Gecumuleerde totale bezoldigingen bij alle WNT-instellingen gezamenlijk i.v.m. anticumulatie bepaling"]
[715,"The remuneration maximum or higher individual remuneration than the remuneration maximum","Het algemeen bezoldigingsmaximum dan wel een voor één van de dienstbetrekkingen van toepassing zijnde hoger bezoldigingsmaximum"]
[716,"Remuneration of non-supervising senior officials who already have employment with another WNT institution: Specification, previous period","Bezoldiging van niet toezichthoudende topfunctionarissen die reeds dienstbetrekking hebben bij andere WNT-instelling: Specificatie, voorgaande periode"]
[717,"Notes to the financial statements - Remuneration of non-supervising senior officials who already have employment with another WNT institution: Specification, previous period","Toelichting op de jaarrekening - Bezoldiging van niet toezichthoudende topfunctionarissen die reeds dienstbetrekking hebben bij andere WNT-instelling: Specificatie, voorgaande periode"]
[718,"Description The name (consisting of the initials and last name) of the non supervisory senior official","Omschrijving De naam (bestaande uit de voorletters en achternaam) van de niet toezichthoudende topfunctionaris"]
[719,"Notes to the financial statements - Senior officer with a total salary of € 1.900 or less to which the anti-cumulation provision applies: Specification","Toelichting op de jaarrekening - Topfunctionaris met een totale bezoldiging van € 1.900 of minder waarop de anticumulatiebepaling van toepassing is: Specificatie"]
[720,"Description The name (consisting of the initials and last name) of the senior official","Omschrijving De naam (bestaande uit de voorletters en achternaam) van de topfunctionaris"]
[721,"All other WNT Institutions where the employed managing senior officials is also a managing senior official","Alle andere WNT-instellingen waarbij de leidinggevende topfunctionaris eveneens in dienstbetrekking is als leidinggevende topfunctionaris"]
[722,"Share based payments","Op aandelen gebaseerde betalingen"]
[723,"Notes to the financial statements - Share based payments","Toelichting op de jaarrekening - Op aandelen gebaseerde betalingen"]
[724,"Disclosure of share based payments","Informatieverschaffing over op aandelen gebaseerde betalingen"]
[725,"Description of the policy for hedging of granted share options of share based payments","Beschrijving van het beleid ter afdekking van verleende aandelenopties in het kader van op aandelen gebaseerde betalingen"]
[726,"Description of the position of granted not yet exercised options relating to share based payments","Beschrijving van de positie van verleende en nog niet afgedekte aandelenopties in het kader van op aandelen gebaseerde betalingen"]
[727,"Average price of purchased treasury shares relating to share based payments","Gemiddelde prijs van ter afdekking ingekochte eigen aandelen in het kader van op aandelen gebaseerde betalingen"]
[728,"Description of purchase commitments of shares(certificates) relating to share based payments","Beschrijving van verplichtingen tot aankoop uitstaande (certificaten van) aandelen in het kader van op aandelen gebaseerde betalingen"]
[729,"Rights granted not yet exercised","Nog niet uitgeoefende verleende rechten"]
[730,"Notes to the financial statements - Rights granted not yet exercised","Toelichting op de jaarrekening - Nog niet uitgeoefende verleende rechten"]
[731,"Disclosure of rights granted, not yet exercised","Informatieverschaffing over nog niet uitgeoefende verleende rechten"]
[732,"Description of reasons for granting rights to supervisory directors to take or obtain (certificates of) shares in the capital of the company or subsidiary","Beschrijving van de redenen voor de toekenning van rechten aan commissarissen om (certificaten van) aandelen in het kapitaal van de vennootschap of dochtermaatschappij te nemen of te verkrijgen"]
[733,"Description of the criteria for granting or exercising rights (certificates of) to acquire or receive shares in capital of company or daughter company","Beschrijving van de gehanteerde criteria die gelden voor de toekenning of uitoefening van de rechten om (certificaten van) aandelen in het kapitaal van de vennootschap of dochtermaatschappij te nemen of te verkrijgen"]
[734,"Conditions applying to number of granted rights (certificates of) to acquire or receive shares in capital of company or daughter company in the financial year","Voorwaarden van in het boekjaar verleende rechten om (certificaten van) aandelen in het kapitaal van de vennootschap of dochtermaatschappij te nemen of te verkrijgen"]
[735,"Description of the main conditions that apply to the exercise of the rights not yet exercised at the end of the financial year","Beschrijving van de belangrijkste voorwaarden die voor uitoefening van de aan het einde van het boekjaar nog niet uitgeoefende verleende rechten gelden"]
[736,"Description of the financing arrangements that apply to the granting of the rights not yet exercised at the end of the financial year","Beschrijving van de financieringsregelingen die bij de toekenning van de aan het einde van het boekjaar nog niet uitgeoefende verleende rechten gelden"]
[737,"Disclosure of the purchase of treasury shares or issuance of new shares on behalf of exercising the rights granted","Informatieverschaffing over de inkoop van eigen aandelen of plaatsing van nieuwe aandelen ten behoeve van uitoefening van de verleende rechten"]
[738,"Description of other data that are important for the assessment of the value of the granted rights not yet exercised at the end of the financial year","Beschrijving van andere gegevens die voor de beoordeling van de waarde van de aan het einde van het boekjaar nog niet uitgeoefende verleende rechten van belang zijn"]
[739,"Disclosure of hedging of rights granted","Informatieverschaffing over de afdekking van verleende rechten"]
[740,"Description of the policy for hedging of rights granted","Beschrijving van het beleid ter afdekking van verleende rechten"]
[741,"Description of purchase commitments of shares or certificates of shares on behalf of rights granted","Beschrijving van verplichtingen tot aankoop uitstaande (certificaten van) aandelen in het kader van de verleende rechten"]
[742,"Type of shares or certificates that the rights granted not yet exercised by the end of the financial year claim rights provides","Soort aandelen of certificaten ervan waarop de aan het einde van het boekjaar nog niet uitgeoefende verleende rechten aanspraak geven"]
[743,"Loans, advances and guarantees on behalf of managing and supervisory directors","Leningen, voorschotten en garanties ten behoeve van bestuurders en commissarissen"]
[744,"Notes to the financial statements - Loans, advances and guarantees: On behalf of managing and supervisory directors","Toelichting op de jaarrekening - Leningen, voorschotten en garanties: Ten behoeve van bestuurders en commissarissen"]
[745,"Disclosure of loans, advances and guarantees on behalf of managing and supervisory directors","Informatieverschaffing over leningen, voorschotten en garanties ten behoeve van bestuurders en commissarissen"]
[746,"Description of other significant conditions of loans, advances and guarantees on behalf of managing and supervisory directors","Beschrijving van de belangrijkste overige bepalingen van leningen, voorschotten en garanties ten behoeve van bestuurders en commissarissen"]
[747,"Notes to the financial statements - Other notes","Toelichting op de jaarrekening - Overige toelichtingen"]
[748,"Disclosure of deviations from regulations based on true and fair view requirements","Informatieverschaffing over afwijkingen van de voorschriften op basis van het inzichtvereiste"]
[749,"Notification of differences and reasons that resulted in changes in the grouping of balance sheet items or income statement items","Opgave van de verschillen en redenen die tot aanpassing van de indeling van de balans en winst-en-verliesrekening hebben geleid"]
[750,"Signing of the financial statements","Ondertekening van de jaarrekening"]
[751,"Name of managing, supervisory directors and representative","Naam bestuurder, commissaris en vertegenwoordiger"]
[752,"Description Name of managing, supervisory directors and representative","Omschrijving Naam bestuurder, commissaris en vertegenwoordiger"]
[753,"Type of director","Soort bestuurder of commissaris"]
[754,"Name of the legal entity which functions as managing or supervisory director","Naam van de rechtspersoon die optreedt als bestuurder of commissaris"]
[755,"Location of signing by managing and supervisory directors","Locatie van de ondertekening door bestuurders en commissarissen"]
[756,"Date of signing by managing and supervisory directors","Datum van de ondertekening door bestuurders en commissarissen"]
[757,"Signed by director (Y/N)","Ondertekend door bestuurder of commissaris (J/N)"]
[758,"Reason why the director did not sign","Reden waarom de bestuurder of commissaris niet heeft ondertekend"]

{"sheet":"Enumerations","index":2,"n_rows":934,"n_cols":161,"rows_kept":934,"cut":false,"hidden":true,"merged":[]}
["Besloten vennootschap met beperkte aansprakelijkheid",null,"Klein",null,"Micro",null,"0111",null,"Ja",null,"Commercieel",null,"Enkelvoudig",null,"AED",null,"Categoriaal",null,"Direct",null,"Ja",null,"Ja",null,"Ja",null,"Enkelvoudig",null,"Na",null,"Na",null,"Ja",null,"Ja",null,"Ja",null,"Ja",null,"Ja",null,"Ja",null,"Ja",null,"Ja",null,"Ja",null,"Ja",null,"Ja",null,"Ja",null,"Ja",null,"Ja",null,"Ja",null,"Ja",null,"Ja",null,"Ja",null,"Ja",null,"Ja",null,"Ja",null,"Ja",null,"Ja",null,"Ja",null,"Ja",null,"Ja",null,"Ja",null,"Ja",null,"Ja",null,"Ja",null,"Ja",null,"Ja",null,"Ja",null,"Ja",null,"Ja",null,"Ja",null,"Ja",null,"Ja",null,"Ja",null,"Ja",null,"Ja",null,"Ja",null,"Ja",null,"Ja",null,"Ja",null,"Ja",null,"Ja",null,"Ja",null,"Ja",null,"Ja",null,"Ja",null,"Ja",null,"Ja",null,"Ja",null,"Ja",null,"Bestuurder (huidig)",null,"Bestuurder (huidig)",null,"Bestuurder (huidig)",null,"Bestuurder (huidig)",null,"Bestuurder (huidig)",null,"Ja",null,"Ja",null,"Ja",null,"Ja",null,"Ja"]
["Commanditaire vennootschap",null,"Micro",null,null,null,"0116",null,"Nee",null,"Fiscaal",null,"Geconsolideerd en enkelvoudig",null,"AFN",null,"Functioneel",null,"Indirect",null,"Nee",null,"Nee",null,"Nee",null,"Geconsolideerd en enkelvoudig",null,"Voor",null,"Voor",null,"Nee",null,"Nee",null,"Nee",null,"Nee",null,"Nee",null,"Nee",null,"Nee",null,"Nee",null,"Nee",null,"Nee",null,"Nee",null,"Nee",null,"Nee",null,"Nee",null,"Nee",null,"Nee",null,"Nee",null,"Nee",null,"Nee",null,"Nee",null,"Nee",null,"Nee",null,"Nee",null,"Nee",null,"Nee",null,"Nee",null,"Nee",null,"Nee",null,"Nee",null,"Nee",null,"Nee",null,"Nee",null,"Nee",null,"Nee",null,"Nee",null,"Nee",null,"Nee",null,"Nee",null,"Nee",null,"Nee",null,"Nee",null,"Nee",null,"Nee",null,"Nee",null,"Nee",null,"Nee",null,"Nee",null,"Nee",null,"Nee",null,"Nee",null,"Nee",null,"Nee",null,"Nee",null,"Nee",null,"Nee",null,"Bestuurder (voormalig)",null,"Bestuurder (voormalig)",null,"Bestuurder (voormalig)",null,"Bestuurder (voormalig)",null,"Bestuurder (voormalig)",null,"Nee",null,"Nee",null,"Nee",null,"Nee",null,"Nee"]
["Cooperatie",null,null,null,null,null,"0121",null,null,null,null,null,"Geconsolideerd",null,"ALL",null,"Niet van toepassing",null,"Niet van toepassing",null,null,null,null,null,null,null,"Geconsolideerd",null,null,null,null,null,null,null,null,null,null,null,null,null,null,null,null,null,null,null,null,null,null,null,null,null,null,null,null,null,null,null,null,null,null,null,null,null,null,null,null,null,null,null,null,null,null,null,null,null,null,null,null,null,null,null,null,null,null,null,null,null,null,null,null,null,null,null,null,null,null,null,null,null,null,null,null,null,null,null,null,null,null,null,null,null,null,null,null,null,null,null,null,null,null,null,null,null,null,null,null,null,null,null,null,null,null,null,null,null,null,null,null,null,null,null,"Commissaris (huidig)",null,"Commissaris (huidig)",null,"Commissaris (huidig)",null,"Commissaris (huidig)",null,"Commissaris (huidig)"]
["Naamloze vennootschap",null,null,null,null,null,"0127",null,null,null,null,null,null,null,"AMD",null,null,null,null,null,null,null,null,null,null,null,"Jaarrekening andere rechtspersoon",null,null,null,null,null,null,null,null,null,null,null,null,null,null,null,null,null,null,null,null,null,null,null,null,null,null,null,null,null,null,null,null,null,null,null,null,null,null,null,null,null,null,null,null,null,null,null,null,null,null,null,null,null,null,null,null,null,null,null,null,null,null,null,null,null,null,null,null,null,null,null,null,null,null,null,null,null,null,null,null,null,null,null,null,null,null,null,null,null,null,null,null,null,null,null,null,null,null,null,null,null,null,null,null,null,null,null,null,null,null,null,null,null,null,null,"Commissaris (voormalig)",null,"Commissaris (voormalig)",null,"Commissaris (voormalig)",null,"Commissaris (voormalig)",null,"Commissaris (voormalig)"]
["Onderlinge waarborgmaatschappij",null,null,null,null,null,"0128",null,null,null,null,null,null,null,"ANG"]
["Stichting",null,null,null,null,null,"0129",null,null,null,null,null,null,null,"AOA"]
["Vennootschap onder firma",null,null,null,null,null,"0143",null,null,null,null,null,null,null,"ARS"]
["Vereniging",null,null,null,null,null,"0150",null,null,null,null,null,null,null,"AUD"]
[null,null,null,null,null,null,"0161",null,null,null,null,null,null,null,"AWG"]
[null,null,null,null,null,null,"0162",null,null,null,null,null,null,null,"AZN"]
[null,null,null,null,null,null,"0163",null,null,null,null,null,null,null,"BAM"]
[null,null,null,null,null,null,"0164",null,null,null,null,null,null,null,"BBD"]
[null,null,null,null,null,null,"0170",null,null,null,null,null,null,null,"BDT"]
[null,null,null,null,null,null,"0210",null,null,null,null,null,null,null,"BGN"]
[null,null,null,null,null,null,"0220",null,null,null,null,null,null,null,"BHD"]
[null,null,null,null,null,null,"0240",null,null,null,null,null,null,null,"BIF"]
[null,null,null,null,null,null,"0311",null,null,null,null,null,null,null,"BMD"]
[null,null,null,null,null,null,"0312",null,null,null,null,null,null,null,"BND"]
[null,null,null,null,null,null,"0321",null,null,null,null,null,null,null,"BOB"]
[null,null,null,null,null,null,"0322",null,null,null,null,null,null,null,"BOV"]
[null,null,null,null,null,null,"0610",null,null,null,null,null,null,null,"BRL"]
[null,null,null,null,null,null,"0620",null,null,null,null,null,null,null,"BSD"]
[null,null,null,null,null,null,"0812",null,null,null,null,null,null,null,"BTN"]
[null,null,null,null,null,null,"0892",null,null,null,null,null,null,null,"BWP"]
[null,null,null,null,null,null,"0893",null,null,null,null,null,null,null,"BYN"]
[null,null,null,null,null,null,"0899",null,null,null,null,null,null,null,"BZD"]
[null,null,null,null,null,null,"0910",null,null,null,null,null,null,null,"CAD"]
[null,null,null,null,null,null,"0990",null,null,null,null,null,null,null,"CDF"]
[null,null,null,null,null,null,"1011",null,null,null,null,null,null,null,"CHE"]
[null,null,null,null,null,null,"1012",null,null,null,null,null,null,null,"CHF"]
[null,null,null,null,null,null,"1013",null,null,null,null,null,null,null,"CHW"]
[null,null,null,null,null,null,"1020",null,null,null,null,null,null,null,"CLF"]
[null,null,null,null,null,null,"1031",null,null,null,null,null,null,null,"CLP"]
[null,null,null,null,null,null,"1032",null,null,null,null,null,null,null,"CNY"]
[null,null,null,null,null,null,"1039",null,null,null,null,null,null,null,"COP"]
[null,null,null,null,null,null,"1041",null,null,null,null,null,null,null,"COU"]
[null,null,null,null,null,null,"1042",null,null,null,null,null,null,null,"CRC"]
[null,null,null,null,null,null,"1051",null,null,null,null,null,null,null,"CUC"]
[null,null,null,null,null,null,"1052",null,null,null,null,null,null,null,"CUP"]
[null,null,null,null,null,null,"1061",null,null,null,null,null,null,null,"CVE"]
[null,null,null,null,null,null,"1062",null,null,null,null,null,null,null,"CZK"]
[null,null,null,null,null,null,"1071",null,null,null,null,null,null,null,"DJF"]
[null,null,null,null,null,null,"1072",null,null,null,null,null,null,null,"DKK"]
[null,null,null,null,null,null,"1073",null,null,null,null,null,null,null,"DOP"]
[null,null,null,null,null,null,"1081",null,null,null,null,null,null,null,"DZD"]
[null,null,null,null,null,null,"1083",null,null,null,null,null,null,null,"EGP"]
[null,null,null,null,null,null,"1084",null,null,null,null,null,null,null,"ERN"]
[null,null,null,null,null,null,"1085",null,null,null,null,null,null,null,"ETB"]
[null,null,null,null,null,null,"1086",null,null,null,null,null,null,null,"EUR"]
[null,null,null,null,null,null,"1089",null,null,null,null,null,null,null,"FJD"]
[null,null,null,null,null,null,"1091",null,null,null,null,null,null,null,"FKP"]
[null,null,null,null,null,null,"1092",null,null,null,null,null,null,null,"GBP"]
[null,null,null,null,null,null,"1101",null,null,null,null,null,null,null,"GEL"]
[null,null,null,null,null,null,"1102",null,null,null,null,null,null,null,"GHS"]
[null,null,null,null,null,null,"1103",null,null,null,null,null,null,null,"GIP"]
[null,null,null,null,null,null,"1104",null,null,null,null,null,null,null,"GMD"]
[null,null,null,null,null,null,"1105",null,null,null,null,null,null,null,"GNF"]
[null,null,null,null,null,null,"1106",null,null,null,null,null,null,null,"GTQ"]
[null,null,null,null,null,null,"1107",null,null,null,null,null,null,null,"GYD"]
[null,null,null,null,null,null,"1200",null,null,null,null,null,null,null,"HKD"]
[null,null,null,null,null,null,"1310",null,null,null,null,null,null,null,"HNL"]
[null,null,null,null,null,null,"1320",null,null,null,null,null,null,null,"HTG"]
[null,null,null,null,null,null,"1330",null,null,null,null,null,null,null,"HUF"]
[null,null,null,null,null,null,"1391",null,null,null,null,null,null,null,"IDR"]
[null,null,null,null,null,null,"1392",null,null,null,null,null,null,null,"ILS"]
[null,null,null,null,null,null,"1393",null,null,null,null,null,null,null,"INR"]
[null,null,null,null,null,null,"1394",null,null,null,null,null,null,null,"IQD"]
[null,null,null,null,null,null,"1395",null,null,null,null,null,null,null,"IRR"]
[null,null,null,null,null,null,"1396",null,null,null,null,null,null,null,"ISK"]
[null,null,null,null,null,null,"1399",null,null,null,null,null,null,null,"JMD"]
[null,null,null,null,null,null,"1411",null,null,null,null,null,null,null,"JOD"]
[null,null,null,null,null,null,"1412",null,null,null,null,null,null,null,"JPY"]
[null,null,null,null,null,null,"1413",null,null,null,null,null,null,null,"KES"]
[null,null,null,null,null,null,"1414",null,null,null,null,null,null,null,"KGS"]
[null,null,null,null,null,null,"1419",null,null,null,null,null,null,null,"KHR"]
[null,null,null,null,null,null,"1420",null,null,null,null,null,null,null,"KMF"]
[null,null,null,null,null,null,"1431",null,null,null,null,null,null,null,"KPW"]
[null,null,null,null,null,null,"1439",null,null,null,null,null,null,null,"KRW"]
[null,null,null,null,null,null,"1511",null,null,null,null,null,null,null,"KWD"]
[null,null,null,null,null,null,"1512",null,null,null,null,null,null,null,"KYD"]
[null,null,null,null,null,null,"1520",null,null,null,null,null,null,null,"KZT"]
[null,null,null,null,null,null,"1621",null,null,null,null,null,null,null,"LAK"]
[null,null,null,null,null,null,"1622",null,null,null,null,null,null,null,"LBP"]
[null,null,null,null,null,null,"1624",null,null,null,null,null,null,null,"LKR"]
[null,null,null,null,null,null,"1629",null,null,null,null,null,null,null,"LRD"]
[null,null,null,null,null,null,"1711",null,null,null,null,null,null,null,"LSL"]
[null,null,null,null,null,null,"1722",null,null,null,null,null,null,null,"LYD"]
[null,null,null,null,null,null,"1723",null,null,null,null,null,null,null,"MAD"]
[null,null,null,null,null,null,"1724",null,null,null,null,null,null,null,"MDL"]
[null,null,null,null,null,null,"1729",null,null,null,null,null,null,null,"MGA"]
[null,null,null,null,null,null,"1811",null,null,null,null,null,null,null,"MKD"]
[null,null,null,null,null,null,"1813",null,null,null,null,null,null,null,"MMK"]
[null,null,null,null,null,null,"1814",null,null,null,null,null,null,null,"MNT"]
[null,null,null,null,null,null,"1820",null,null,null,null,null,null,null,"MOP"]
[null,null,null,null,null,null,"1910",null,null,null,null,null,null,null,"MRU"]
[null,null,null,null,null,null,"2011",null,null,null,null,null,null,null,"MUR"]
[null,null,null,null,null,null,"2012",null,null,null,null,null,null,null,"MVR"]
[null,null,null,null,null,null,"2013",null,null,null,null,null,null,null,"MWK"]
[null,null,null,null,null,null,"2015",null,null,null,null,null,null,null,"MXN"]
[null,null,null,null,null,null,"2016",null,null,null,null,null,null,null,"MXV"]
[null,null,null,null,null,null,"2017",null,null,null,null,null,null,null,"MYR"]
[null,null,null,null,null,null,"2020",null,null,null,null,null,null,null,"MZN"]
[null,null,null,null,null,null,"2030",null,null,null,null,null,null,null,"NAD"]
[null,null,null,null,null,null,"2041",null,null,null,null,null,null,null,"NGN"]
[null,null,null,null,null,null,"2042",null,null,null,null,null,null,null,"NIO"]
[null,null,null,null,null,null,"2051",null,null,null,null,null,null,null,"NOK"]
[null,null,null,null,null,null,"2052",null,null,null,null,null,null,null,"NPR"]
[null,null,null,null,null,null,"2053",null,null,null,null,null,null,null,"NZD"]
[null,null,null,null,null,null,"2059",null,null,null,null,null,null,null,"OMR"]
[null,null,null,null,null,null,"2060",null,null,null,null,null,null,null,"PAB"]
[null,null,null,null,null,null,"2110",null,null,null,null,null,null,null,"PEN"]
[null,null,null,null,null,null,"2120",null,null,null,null,null,null,null,"PGK"]
[null,null,null,null,null,null,"2211",null,null,null,null,null,null,null,"PHP"]
[null,null,null,null,null,null,"2219",null,null,null,null,null,null,null,"PKR"]
[null,null,null,null,null,null,"2221",null,null,null,null,null,null,null,"PLN"]
[null,null,null,null,null,null,"2222",null,null,null,null,null,null,null,"PYG"]
[null,null,null,null,null,null,"2223",null,null,null,null,null,null,null,"QAR"]
[null,null,null,null,null,null,"2229",null,null,null,null,null,null,null,"RON"]
[null,null,null,null,null,null,"2311",null,null,null,null,null,null,null,"RSD"]
[null,null,null,null,null,null,"2312",null,null,null,null,null,null,null,"RUB"]
[null,null,null,null,null,null,"2313",null,null,null,null,null,null,null,"RWF"]
[null,null,null,null,null,null,"2314",null,null,null,null,null,null,null,"SAR"]
[null,null,null,null,null,null,"2319",null,null,null,null,null,null,null,"SBD"]
[null,null,null,null,null,null,"2320",null,null,null,null,null,null,null,"SCR"]
[null,null,null,null,null,null,"2331",null,null,null,null,null,null,null,"SDG"]
[null,null,null,null,null,null,"2332",null,null,null,null,null,null,null,"SEK"]
[null,null,null,null,null,null,"2341",null,null,null,null,null,null,null,"SGD"]
[null,null,null,null,null,null,"2342",null,null,null,null,null,null,null,"SHP"]
[null,null,null,null,null,null,"2343",null,null,null,null,null,null,null,"SLL"]
[null,null,null,null,null,null,"2344",null,null,null,null,null,null,null,"SOS"]
[null,null,null,null,null,null,"2349",null,null,null,null,null,null,null,"SRD"]
[null,null,null,null,null,null,"2351",null,null,null,null,null,null,null,"SSP"]
[null,null,null,null,null,null,"2352",null,null,null,null,null,null,null,"STN"]
[null,null,null,null,null,null,"2362",null,null,null,null,null,null,null,"SVC"]
[null,null,null,null,null,null,"2363",null,null,null,null,null,null,null,"SYP"]
[null,null,null,null,null,null,"2364",null,null,null,null,null,null,null,"SZL"]
[null,null,null,null,null,null,"2365",null,null,null,null,null,null,null,"THB"]
[null,null,null,null,null,null,"2369",null,null,null,null,null,null,null,"TJS"]
[null,null,null,null,null,null,"2370",null,null,null,null,null,null,null,"TMT"]
[null,null,null,null,null,null,"2391",null,null,null,null,null,null,null,"TND"]
[null,null,null,null,null,null,"2399",null,null,null,null,null,null,null,"TOP"]
[null,null,null,null,null,null,"2410",null,null,null,null,null,null,null,"TRY"]
[null,null,null,null,null,null,"2420",null,null,null,null,null,null,null,"TTD"]
[null,null,null,null,null,null,"2431",null,null,null,null,null,null,null,"TWD"]
[null,null,null,null,null,null,"2432",null,null,null,null,null,null,null,"TZS"]
[null,null,null,null,null,null,"2433",null,null,null,null,null,null,null,"UAH"]
[null,null,null,null,null,null,"2434",null,null,null,null,null,null,null,"UGX"]
[null,null,null,null,null,null,"2441",null,null,null,null,null,null,null,"USD"]
[null,null,null,null,null,null,"2442",null,null,null,null,null,null,null,"USN"]
[null,null,null,null,null,null,"2443",null,null,null,null,null,null,null,"UYI"]
[null,null,null,null,null,null,"2444",null,null,null,null,null,null,null,"UYU"]
[null,null,null,null,null,null,"2445",null,null,null,null,null,null,null,"UYW"]
[null,null,null,null,null,null,"2446",null,null,null,null,null,null,null,"UZS"]
[null,null,null,null,null,null,"2451",null,null,null,null,null,null,null,"VES"]
[null,null,null,null,null,null,"2452",null,null,null,null,null,null,null,"VND"]
[null,null,null,null,null,null,"2453",null,null,null,null,null,null,null,"VUV"]
[null,null,null,null,null,null,"2454",null,null,null,null,null,null,null,"WST"]
[null,null,null,null,null,null,"2511",null,null,null,null,null,null,null,"XAF"]
[null,null,null,null,null,null,"2512",null,null,null,null,null,null,null,"XAG"]
[null,null,null,null,null,null,"2521",null,null,null,null,null,null,null,"XAU"]
[null,null,null,null,null,null,"2529",null,null,null,null,null,null,null,"XBA"]
[null,null,null,null,null,null,"2530",null,null,null,null,null,null,null,"XBB"]
[null,null,null,null,null,null,"2540",null,null,null,null,null,null,null,"XBC"]
[null,null,null,null,null,null,"2550",null,null,null,null,null,null,null,"XBD"]
[null,null,null,null,null,null,"2561",null,null,null,null,null,null,null,"XCD"]
[null,null,null,null,null,null,"2562",null,null,null,null,null,null,null,"XDR"]
[null,null,null,null,null,null,"2571",null,null,null,null,null,null,null,"XOF"]
[null,null,null,null,null,null,"2572",null,null,null,null,null,null,null,"XPD"]
[null,null,null,null,null,null,"2573",null,null,null,null,null,null,null,"XPF"]
[null,null,null,null,null,null,"2591",null,null,null,null,null,null,null,"XPT"]
[null,null,null,null,null,null,"2592",null,null,null,null,null,null,null,"XSU"]
[null,null,null,null,null,null,"2593",null,null,null,null,null,null,null,"XTS"]
[null,null,null,null,null,null,"2594",null,null,null,null,null,null,null,"XUA"]
[null,null,null,null,null,null,"2599",null,null,null,null,null,null,null,"XXX"]
[null,null,null,null,null,null,"2611",null,null,null,null,null,null,null,"YER"]
[null,null,null,null,null,null,"2612",null,null,null,null,null,null,null,"ZAR"]
[null,null,null,null,null,null,"2620",null,null,null,null,null,null,null,"ZMW"]
[null,null,null,null,null,null,"2630",null,null,null,null,null,null,null,"ZWL"]
[null,null,null,null,null,null,"2640"]
[null,null,null,null,null,null,"2651"]
[null,null,null,null,null,null,"2652"]
[null,null,null,null,null,null,"2660"]
[null,null,null,null,null,null,"2670"]
[null,null,null,null,null,null,"2680"]
[null,null,null,null,null,null,"2711"]
[null,null,null,null,null,null,"2712"]
[null,null,null,null,null,null,"2720"]
[null,null,null,null,null,null,"2731"]
[null,null,null,null,null,null,"2732"]
[null,null,null,null,null,null,"2733"]
[null,null,null,null,null,null,"2740"]
[null,null,null,null,null,null,"2751"]
[null,null,null,null,null,null,"2752"]
[null,null,null,null,null,null,"2790"]
[null,null,null,null,null,null,"2811"]
[null,null,null,null,null,null,"2812"]
[null,null,null,null,null,null,"2813"]
[null,null,null,null,null,null,"2814"]
[null,null,null,null,null,null,"2815"]
[null,null,null,null,null,null,"2821"]
[null,null,null,null,null,null,"2822"]
[null,null,null,null,null,null,"2823"]
[null,null,null,null,null,null,"2824"]
[null,null,null,null,null,null,"2825"]
[null,null,null,null,null,null,"2829"]
[null,null,null,null,null,null,"2830"]
[null,null,null,null,null,null,"2841"]
[null,null,null,null,null,null,"2849"]
[null,null,null,null,null,null,"2891"]
[null,null,null,null,null,null,"2892"]
[null,null,null,null,null,null,"2893"]
[null,null,null,null,null,null,"2894"]
[null,null,null,null,null,null,"2895"]
[null,null,null,null,null,null,"2896"]
[null,null,null,null,null,null,"2899"]
[null,null,null,null,null,null,"2910"]
[null,null,null,null,null,null,"2931"]
[null,null,null,null,null,null,"2932"]
[null,null,null,null,null,null,"3011"]
[null,null,null,null,null,null,"3012"]
[null,null,null,null,null,null,"3020"]
[null,null,null,null,null,null,"3030"]
[null,null,null,null,null,null,"3040"]
[null,null,null,null,null,null,"3091"]
[null,null,null,null,null,null,"3092"]
[null,null,null,null,null,null,"3099"]
[null,null,null,null,null,null,"3102"]
[null,null,null,null,null,null,"3103"]
[null,null,null,null,null,null,"3109"]
[null,null,null,null,null,null,"3211"]
[null,null,null,null,null,null,"3212"]
[null,null,null,null,null,null,"3213"]
[null,null,null,null,null,null,"3220"]
[null,null,null,null,null,null,"3230"]
[null,null,null,null,null,null,"3240"]
[null,null,null,null,null,null,"3291"]
[null,null,null,null,null,null,"3311"]
[null,null,null,null,null,null,"3313"]
[null,null,null,null,null,null,"3314"]
[null,null,null,null,null,null,"3315"]
[null,null,null,null,null,null,"3316"]
[null,null,null,null,null,null,"3317"]
[null,null,null,null,null,null,"3319"]
[null,null,null,null,null,null,"3321"]
[null,null,null,null,null,null,"3323"]
[null,null,null,null,null,null,"3324"]
[null,null,null,null,null,null,"3329"]
[null,null,null,null,null,null,"3512"]
[null,null,null,null,null,null,"3513"]
[null,null,null,null,null,null,"3514"]
[null,null,null,null,null,null,"3520"]
[null,null,null,null,null,null,"3530"]
[null,null,null,null,null,null,"3600"]
[null,null,null,null,null,null,"3700"]
[null,null,null,null,null,null,"3811"]
[null,null,null,null,null,null,"3812"]
[null,null,null,null,null,null,"3821"]
[null,null,null,null,null,null,"3822"]
[null,null,null,null,null,null,"3831"]
[null,null,null,null,null,null,"3832"]
[null,null,null,null,null,null,"3900"]
[null,null,null,null,null,null,"4110"]
[null,null,null,null,null,null,"4120"]
[null,null,null,null,null,null,"4212"]
[null,null,null,null,null,null,"4213"]
[null,null,null,null,null,null,"4221"]
[null,null,null,null,null,null,"4222"]
[null,null,null,null,null,null,"4291"]
[null,null,null,null,null,null,"4299"]
[null,null,null,null,null,null,"4311"]
[null,null,null,null,null,null,"4312"]
[null,null,null,null,null,null,"4313"]
[null,null,null,null,null,null,"4321"]
[null,null,null,null,null,null,"4329"]
[null,null,null,null,null,null,"4331"]
[null,null,null,null,null,null,"4332"]
[null,null,null,null,null,null,"4333"]
[null,null,null,null,null,null,"4334"]
[null,null,null,null,null,null,"4339"]
[null,null,null,null,null,null,"4391"]
[null,null,null,null,null,null,"4532"]
[null,null,null,null,null,null,"4611"]
[null,null,null,null,null,null,"4612"]
[null,null,null,null,null,null,"4613"]
[null,null,null,null,null,null,"4614"]
[null,null,null,null,null,null,"4615"]
[null,null,null,null,null,null,"4616"]
[null,null,null,null,null,null,"4617"]
[null,null,null,null,null,null,"4618"]
[null,null,null,null,null,null,"4619"]
[null,null,null,null,null,null,"4622"]
[null,null,null,null,null,null,"4632"]
[null,null,null,null,null,null,"4634"]
[null,null,null,null,null,null,"4635"]
[null,null,null,null,null,null,"4636"]
[null,null,null,null,null,null,"4637"]
[null,null,null,null,null,null,"4639"]
[null,null,null,null,null,null,"4645"]
[null,null,null,null,null,null,"4648"]
[null,null,null,null,null,null,"4651"]
[null,null,null,null,null,null,"4652"]
[null,null,null,null,null,null,"4661"]
[null,null,null,null,null,null,"4662"]
[null,null,null,null,null,null,"4663"]
[null,null,null,null,null,null,"4664"]
[null,null,null,null,null,null,"4665"]
[null,null,null,null,null,null,"4666"]
[null,null,null,null,null,null,"4711"]
[null,null,null,null,null,null,"4721"]
[null,null,null,null,null,null,"4723"]
[null,null,null,null,null,null,"4725"]
[null,null,null,null,null,null,"4726"]
[null,null,null,null,null,null,"4730"]
[null,null,null,null,null,null,"4741"]
[null,null,null,null,null,null,"4742"]
[null,null,null,null,null,null,"4753"]
[null,null,null,null,null,null,"4761"]
[null,null,null,null,null,null,"4762"]
[null,null,null,null,null,null,"4763"]
[null,null,null,null,null,null,"4765"]
[null,null,null,null,null,null,"4773"]
[null,null,null,null,null,null,"4775"]
[null,null,null,null,null,null,"4777"]
[null,null,null,null,null,null,"4782"]
[null,null,null,null,null,null,"4910"]
[null,null,null,null,null,null,"4920"]
[null,null,null,null,null,null,"4931"]
[null,null,null,null,null,null,"4932"]
[null,null,null,null,null,null,"4941"]
[null,null,null,null,null,null,"4942"]
[null,null,null,null,null,null,"4950"]
[null,null,null,null,null,null,"5010"]
[null,null,null,null,null,null,"5030"]
[null,null,null,null,null,null,"5110"]
[null,null,null,null,null,null,"5121"]
[null,null,null,null,null,null,"5221"]
[null,null,null,null,null,null,"5222"]
[null,null,null,null,null,null,"5223"]
[null,null,null,null,null,null,"5310"]
[null,null,null,null,null,null,"5530"]
[null,null,null,null,null,null,"5590"]
[null,null,null,null,null,null,"5621"]
[null,null,null,null,null,null,"5629"]
[null,null,null,null,null,null,"5630"]
[null,null,null,null,null,null,"5811"]
[null,null,null,null,null,null,"5812"]
[null,null,null,null,null,null,"5813"]
[null,null,null,null,null,null,"5814"]
[null,null,null,null,null,null,"5819"]
[null,null,null,null,null,null,"5821"]
[null,null,null,null,null,null,"5829"]
[null,null,null,null,null,null,"5912"]
[null,null,null,null,null,null,"5913"]
[null,null,null,null,null,null,"5914"]
[null,null,null,null,null,null,"5920"]
[null,null,null,null,null,null,"6010"]
[null,null,null,null,null,null,"6020"]
[null,null,null,null,null,null,"6110"]
[null,null,null,null,null,null,"6120"]
[null,null,null,null,null,null,"6130"]
[null,null,null,null,null,null,"6190"]
[null,null,null,null,null,null,"6201"]
[null,null,null,null,null,null,"6202"]
[null,null,null,null,null,null,"6203"]
[null,null,null,null,null,null,"6209"]
[null,null,null,null,null,null,"6311"]
[null,null,null,null,null,null,"6312"]
[null,null,null,null,null,null,"6391"]
[null,null,null,null,null,null,"6399"]
[null,null,null,null,null,null,"6411"]
[null,null,null,null,null,null,"6420"]
[null,null,null,null,null,null,"6491"]
[null,null,null,null,null,null,"6499"]
[null,null,null,null,null,null,"6520"]
[null,null,null,null,null,null,"6611"]
[null,null,null,null,null,null,"6612"]
[null,null,null,null,null,null,"6621"]
[null,null,null,null,null,null,"6622"]
[null,null,null,null,null,null,"6630"]
[null,null,null,null,null,null,"6810"]
[null,null,null,null,null,null,"6831"]
[null,null,null,null,null,null,"6832"]
[null,null,null,null,null,null,"7021"]
[null,null,null,null,null,null,"7112"]
[null,null,null,null,null,null,"7220"]
[null,null,null,null,null,null,"7311"]
[null,null,null,null,null,null,"7312"]
[null,null,null,null,null,null,"7320"]
[null,null,null,null,null,null,"7430"]
[null,null,null,null,null,null,"7490"]
[null,null,null,null,null,null,"7500"]
[null,null,null,null,null,null,"7712"]
[null,null,null,null,null,null,"7721"]
[null,null,null,null,null,null,"7722"]
[null,null,null,null,null,null,"7731"]
[null,null,null,null,null,null,"7732"]
[null,null,null,null,null,null,"7733"]
[null,null,null,null,null,null,"7734"]
[null,null,null,null,null,null,"7735"]
[null,null,null,null,null,null,"7740"]
[null,null,null,null,null,null,"7810"]
[null,null,null,null,null,null,"7830"]
[null,null,null,null,null,null,"7911"]
[null,null,null,null,null,null,"7912"]
[null,null,null,null,null,null,"7990"]
[null,null,null,null,null,null,"8010"]
[null,null,null,null,null,null,"8020"]
[null,null,null,null,null,null,"8030"]
[null,null,null,null,null,null,"8110"]
[null,null,null,null,null,null,"8121"]
[null,null,null,null,null,null,"8129"]
[null,null,null,null,null,null,"8130"]
[null,null,null,null,null,null,"8211"]
[null,null,null,null,null,null,"8219"]
[null,null,null,null,null,null,"8220"]
[null,null,null,null,null,null,"8230"]
[null,null,null,null,null,null,"8291"]
[null,null,null,null,null,null,"8292"]
[null,null,null,null,null,null,"8411"]
[null,null,null,null,null,null,"8412"]
[null,null,null,null,null,null,"8413"]
[null,null,null,null,null,null,"8421"]
[null,null,null,null,null,null,"8422"]
[null,null,null,null,null,null,"8424"]
[null,null,null,null,null,null,"8425"]
[null,null,null,null,null,null,"8430"]
[null,null,null,null,null,null,"8541"]
[null,null,null,null,null,null,"8542"]
[null,null,null,null,null,null,"8553"]
[null,null,null,null,null,null,"8560"]
[null,null,null,null,null,null,"8621"]
[null,null,null,null,null,null,"8710"]
[null,null,null,null,null,null,"8720"]
[null,null,null,null,null,null,"8891"]
[null,null,null,null,null,null,"9002"]
[null,null,null,null,null,null,"9003"]
[null,null,null,null,null,null,"9103"]
[null,null,null,null,null,null,"9313"]
[null,null,null,null,null,null,"9411"]
[null,null,null,null,null,null,"9412"]
[null,null,null,null,null,null,"9420"]
[null,null,null,null,null,null,"9492"]
[null,null,null,null,null,null,"9511"]
[null,null,null,null,null,null,"9512"]
[null,null,null,null,null,null,"9521"]
[null,null,null,null,null,null,"9522"]
[null,null,null,null,null,null,"9523"]
[null,null,null,null,null,null,"9524"]
[null,null,null,null,null,null,"9525"]
[null,null,null,null,null,null,"9529"]
[null,null,null,null,null,null,"9604"]
[null,null,null,null,null,null,"9609"]
[null,null,null,null,null,null,"9700"]
[null,null,null,null,null,null,"9810"]
[null,null,null,null,null,null,"9820"]
[null,null,null,null,null,null,"9900"]
[null,null,null,null,null,null,"01131"]
[null,null,null,null,null,null,"01132"]
[null,null,null,null,null,null,"01133"]
[null,null,null,null,null,null,"01134"]
[null,null,null,null,null,null,"01191"]
[null,null,null,null,null,null,"01192"]
[null,null,null,null,null,null,"01193"]
[null,null,null,null,null,null,"01199"]
[null,null,null,null,null,null,"01241"]
[null,null,null,null,null,null,"01242"]
[null,null,null,null,null,null,"01251"]
[null,null,null,null,null,null,"01252"]
[null,null,null,null,null,null,"01253"]
[null,null,null,null,null,null,"01254"]
[null,null,null,null,null,null,"01301"]
[null,null,null,null,null,null,"01302"]
[null,null,null,null,null,null,"01303"]
[null,null,null,null,null,null,"01304"]
[null,null,null,null,null,null,"01305"]
[null,null,null,null,null,null,"01309"]
[null,null,null,null,null,null,"01411"]
[null,null,null,null,null,null,"01412"]
[null,null,null,null,null,null,"01421"]
[null,null,null,null,null,null,"01422"]
[null,null,null,null,null,null,"01451"]
[null,null,null,null,null,null,"01452"]
[null,null,null,null,null,null,"01461"]
[null,null,null,null,null,null,"01462"]
[null,null,null,null,null,null,"01463"]
[null,null,null,null,null,null,"01471"]
[null,null,null,null,null,null,"01472"]
[null,null,null,null,null,null,"01473"]
[null,null,null,null,null,null,"01479"]
[null,null,null,null,null,null,"01491"]
[null,null,null,null,null,null,"01499"]
[null,null,null,null,null,null,"10821"]
[null,null,null,null,null,null,"10822"]
[null,null,null,null,null,null,"16101"]
[null,null,null,null,null,null,"16102"]
[null,null,null,null,null,null,"16231"]
[null,null,null,null,null,null,"16239"]
[null,null,null,null,null,null,"17121"]
[null,null,null,null,null,null,"17122"]
[null,null,null,null,null,null,"17129"]
[null,null,null,null,null,null,"17211"]
[null,null,null,null,null,null,"17212"]
[null,null,null,null,null,null,"18121"]
[null,null,null,null,null,null,"18122"]
[null,null,null,null,null,null,"18123"]
[null,null,null,null,null,null,"18124"]
[null,null,null,null,null,null,"18125"]
[null,null,null,null,null,null,"18129"]
[null,null,null,null,null,null,"19201"]
[null,null,null,null,null,null,"19202"]
[null,null,null,null,null,null,"20141"]
[null,null,null,null,null,null,"20149"]
[null,null,null,null,null,null,"23611"]
[null,null,null,null,null,null,"23612"]
[null,null,null,null,null,null,"29201"]
[null,null,null,null,null,null,"29202"]
[null,null,null,null,null,null,"31011"]
[null,null,null,null,null,null,"31012"]
[null,null,null,null,null,null,"32501"]
[null,null,null,null,null,null,"32502"]
[null,null,null,null,null,null,"32991"]
[null,null,null,null,null,null,"32999"]
[null,null,null,null,null,null,"33121"]
[null,null,null,null,null,null,"33122"]
[null,null,null,null,null,null,"33123"]
[null,null,null,null,null,null,"33221"]
[null,null,null,null,null,null,"33222"]
[null,null,null,null,null,null,"33223"]
[null,null,null,null,null,null,"35111"]
[null,null,null,null,null,null,"35112"]
[null,null,null,null,null,null,"35113"]
[null,null,null,null,null,null,"42111"]
[null,null,null,null,null,null,"42112"]
[null,null,null,null,null,null,"43221"]
[null,null,null,null,null,null,"43222"]
[null,null,null,null,null,null,"43991"]
[null,null,null,null,null,null,"43992"]
[null,null,null,null,null,null,"43993"]
[null,null,null,null,null,null,"43999"]
[null,null,null,null,null,null,"45111"]
[null,null,null,null,null,null,"45112"]
[null,null,null,null,null,null,"45191"]
[null,null,null,null,null,null,"45192"]
[null,null,null,null,null,null,"45193"]
[null,null,null,null,null,null,"45194"]
[null,null,null,null,null,null,"45201"]
[null,null,null,null,null,null,"45202"]
[null,null,null,null,null,null,"45203"]
[null,null,null,null,null,null,"45204"]
[null,null,null,null,null,null,"45205"]
[null,null,null,null,null,null,"45311"]
[null,null,null,null,null,null,"45312"]
[null,null,null,null,null,null,"45401"]
[null,null,null,null,null,null,"45402"]
[null,null,null,null,null,null,"46211"]
[null,null,null,null,null,null,"46212"]
[null,null,null,null,null,null,"46213"]
[null,null,null,null,null,null,"46214"]
[null,null,null,null,null,null,"46215"]
[null,null,null,null,null,null,"46216"]
[null,null,null,null,null,null,"46217"]
[null,null,null,null,null,null,"46218"]
[null,null,null,null,null,null,"46219"]
[null,null,null,null,null,null,"46231"]
[null,null,null,null,null,null,"46232"]
[null,null,null,null,null,null,"46241"]
[null,null,null,null,null,null,"46242"]
[null,null,null,null,null,null,"46311"]
[null,null,null,null,null,null,"46312"]
[null,null,null,null,null,null,"46331"]
[null,null,null,null,null,null,"46332"]
[null,null,null,null,null,null,"46381"]
[null,null,null,null,null,null,"46382"]
[null,null,null,null,null,null,"46383"]
[null,null,null,null,null,null,"46384"]
[null,null,null,null,null,null,"46389"]
[null,null,null,null,null,null,"46411"]
[null,null,null,null,null,null,"46412"]
[null,null,null,null,null,null,"46421"]
[null,null,null,null,null,null,"46422"]
[null,null,null,null,null,null,"46423"]
[null,null,null,null,null,null,"46424"]
[null,null,null,null,null,null,"46425"]
[null,null,null,null,null,null,"46429"]
[null,null,null,null,null,null,"46431"]
[null,null,null,null,null,null,"46432"]
[null,null,null,null,null,null,"46433"]
[null,null,null,null,null,null,"46434"]
[null,null,null,null,null,null,"46435"]
[null,null,null,null,null,null,"46436"]
[null,null,null,null,null,null,"46441"]
[null,null,null,null,null,null,"46442"]
[null,null,null,null,null,null,"46461"]
[null,null,null,null,null,null,"46462"]
[null,null,null,null,null,null,"46471"]
[null,null,null,null,null,null,"46472"]
[null,null,null,null,null,null,"46473"]
[null,null,null,null,null,null,"46491"]
[null,null,null,null,null,null,"46492"]
[null,null,null,null,null,null,"46493"]
[null,null,null,null,null,null,"46494"]
[null,null,null,null,null,null,"46495"]
[null,null,null,null,null,null,"46496"]
[null,null,null,null,null,null,"46497"]
[null,null,null,null,null,null,"46498"]
[null,null,null,null,null,null,"46499"]
[null,null,null,null,null,null,"46681"]
[null,null,null,null,null,null,"46682"]
[null,null,null,null,null,null,"46691"]
[null,null,null,null,null,null,"46692"]
[null,null,null,null,null,null,"46693"]
[null,null,null,null,null,null,"46694"]
[null,null,null,null,null,null,"46695"]
[null,null,null,null,null,null,"46696"]
[null,null,null,null,null,null,"46697"]
[null,null,null,null,null,null,"46699"]
[null,null,null,null,null,null,"46711"]
[null,null,null,null,null,null,"46712"]
[null,null,null,null,null,null,"46713"]
[null,null,null,null,null,null,"46721"]
[null,null,null,null,null,null,"46722"]
[null,null,null,null,null,null,"46723"]
[null,null,null,null,null,null,"46731"]
[null,null,null,null,null,null,"46732"]
[null,null,null,null,null,null,"46733"]
[null,null,null,null,null,null,"46734"]
[null,null,null,null,null,null,"46735"]
[null,null,null,null,null,null,"46736"]
[null,null,null,null,null,null,"46737"]
[null,null,null,null,null,null,"46738"]
[null,null,null,null,null,null,"46739"]
[null,null,null,null,null,null,"46741"]
[null,null,null,null,null,null,"46742"]
[null,null,null,null,null,null,"46751"]
[null,null,null,null,null,null,"46752"]
[null,null,null,null,null,null,"46761"]
[null,null,null,null,null,null,"46762"]
[null,null,null,null,null,null,"46769"]
[null,null,null,null,null,null,"46771"]
[null,null,null,null,null,null,"46772"]
[null,null,null,null,null,null,"46779"]
[null,null,null,null,null,null,"46901"]
[null,null,null,null,null,null,"46902"]
[null,null,null,null,null,null,"47191"]
[null,null,null,null,null,null,"47192"]
[null,null,null,null,null,null,"47221"]
[null,null,null,null,null,null,"47222"]
[null,null,null,null,null,null,"47241"]
[null,null,null,null,null,null,"47242"]
[null,null,null,null,null,null,"47291"]
[null,null,null,null,null,null,"47292"]
[null,null,null,null,null,null,"47293"]
[null,null,null,null,null,null,"47299"]
[null,null,null,null,null,null,"47431"]
[null,null,null,null,null,null,"47432"]
[null,null,null,null,null,null,"47511"]
[null,null,null,null,null,null,"47512"]
[null,null,null,null,null,null,"47513"]
[null,null,null,null,null,null,"47521"]
[null,null,null,null,null,null,"47522"]
[null,null,null,null,null,null,"47523"]
[null,null,null,null,null,null,"47524"]
[null,null,null,null,null,null,"47525"]
[null,null,null,null,null,null,"47526"]
[null,null,null,null,null,null,"47527"]
[null,null,null,null,null,null,"47528"]
[null,null,null,null,null,null,"47541"]
[null,null,null,null,null,null,"47542"]
[null,null,null,null,null,null,"47543"]
[null,null,null,null,null,null,"47544"]
[null,null,null,null,null,null,"47591"]
[null,null,null,null,null,null,"47592"]
[null,null,null,null,null,null,"47593"]
[null,null,null,null,null,null,"47594"]
[null,null,null,null,null,null,"47595"]
[null,null,null,null,null,null,"47596"]
[null,null,null,null,null,null,"47597"]
[null,null,null,null,null,null,"47641"]
[null,null,null,null,null,null,"47642"]
[null,null,null,null,null,null,"47643"]
[null,null,null,null,null,null,"47644"]
[null,null,null,null,null,null,"47711"]
[null,null,null,null,null,null,"47712"]
[null,null,null,null,null,null,"47713"]
[null,null,null,null,null,null,"47714"]
[null,null,null,null,null,null,"47715"]
[null,null,null,null,null,null,"47716"]
[null,null,null,null,null,null,"47717"]
[null,null,null,null,null,null,"47718"]
[null,null,null,null,null,null,"47721"]
[null,null,null,null,null,null,"47722"]
[null,null,null,null,null,null,"47741"]
[null,null,null,null,null,null,"47742"]
[null,null,null,null,null,null,"47761"]
[null,null,null,null,null,null,"47762"]
[null,null,null,null,null,null,"47763"]
[null,null,null,null,null,null,"47781"]
[null,null,null,null,null,null,"47782"]
[null,null,null,null,null,null,"47783"]
[null,null,null,null,null,null,"47789"]
[null,null,null,null,null,null,"47791"]
[null,null,null,null,null,null,"47792"]
[null,null,null,null,null,null,"47793"]
[null,null,null,null,null,null,"47811"]
[null,null,null,null,null,null,"47819"]
[null,null,null,null,null,null,"47891"]
[null,null,null,null,null,null,"47892"]
[null,null,null,null,null,null,"47899"]
[null,null,null,null,null,null,"47911"]
[null,null,null,null,null,null,"47912"]
[null,null,null,null,null,null,"47913"]
[null,null,null,null,null,null,"47914"]
[null,null,null,null,null,null,"47915"]
[null,null,null,null,null,null,"47916"]
[null,null,null,null,null,null,"47918"]
[null,null,null,null,null,null,"47919"]
[null,null,null,null,null,null,"47991"]
[null,null,null,null,null,null,"47992"]
[null,null,null,null,null,null,"47999"]
[null,null,null,null,null,null,"49391"]
[null,null,null,null,null,null,"49392"]
[null,null,null,null,null,null,"49393"]
[null,null,null,null,null,null,"50201"]
[null,null,null,null,null,null,"50202"]
[null,null,null,null,null,null,"50401"]
[null,null,null,null,null,null,"50402"]
[null,null,null,null,null,null,"50403"]
[null,null,null,null,null,null,"52101"]
[null,null,null,null,null,null,"52102"]
[null,null,null,null,null,null,"52109"]
[null,null,null,null,null,null,"52241"]
[null,null,null,null,null,null,"52242"]
[null,null,null,null,null,null,"52291"]
[null,null,null,null,null,null,"52292"]
[null,null,null,null,null,null,"53201"]
[null,null,null,null,null,null,"53202"]
[null,null,null,null,null,null,"55101"]
[null,null,null,null,null,null,"55102"]
[null,null,null,null,null,null,"55201"]
[null,null,null,null,null,null,"55202"]
[null,null,null,null,null,null,"56101"]
[null,null,null,null,null,null,"56102"]
[null,null,null,null,null,null,"59111"]
[null,null,null,null,null,null,"59112"]
[null,null,null,null,null,null,"64191"]
[null,null,null,null,null,null,"64192"]
[null,null,null,null,null,null,"64193"]
[null,null,null,null,null,null,"64194"]
[null,null,null,null,null,null,"64301"]
[null,null,null,null,null,null,"64302"]
[null,null,null,null,null,null,"64303"]
[null,null,null,null,null,null,"64921"]
[null,null,null,null,null,null,"64922"]
[null,null,null,null,null,null,"64923"]
[null,null,null,null,null,null,"64924"]
[null,null,null,null,null,null,"65111"]
[null,null,null,null,null,null,"65112"]
[null,null,null,null,null,null,"65113"]
[null,null,null,null,null,null,"65121"]
[null,null,null,null,null,null,"65122"]
[null,null,null,null,null,null,"65301"]
[null,null,null,null,null,null,"65302"]
[null,null,null,null,null,null,"65303"]
[null,null,null,null,null,null,"65309"]
[null,null,null,null,null,null,"66191"]
[null,null,null,null,null,null,"66192"]
[null,null,null,null,null,null,"66193"]
[null,null,null,null,null,null,"66291"]
[null,null,null,null,null,null,"66292"]
[null,null,null,null,null,null,"66293"]
[null,null,null,null,null,null,"66299"]
[null,null,null,null,null,null,"68201"]
[null,null,null,null,null,null,"68202"]
[null,null,null,null,null,null,"68203"]
[null,null,null,null,null,null,"68204"]
[null,null,null,null,null,null,"69101"]
[null,null,null,null,null,null,"69102"]
[null,null,null,null,null,null,"69103"]
[null,null,null,null,null,null,"69104"]
[null,null,null,null,null,null,"69105"]
[null,null,null,null,null,null,"69201"]
[null,null,null,null,null,null,"69202"]
[null,null,null,null,null,null,"69203"]
[null,null,null,null,null,null,"69204"]
[null,null,null,null,null,null,"69209"]
[null,null,null,null,null,null,"70101"]
[null,null,null,null,null,null,"70102"]
[null,null,null,null,null,null,"70221"]
[null,null,null,null,null,null,"70222"]
[null,null,null,null,null,null,"71111"]
[null,null,null,null,null,null,"71112"]
[null,null,null,null,null,null,"71201"]
[null,null,null,null,null,null,"71202"]
[null,null,null,null,null,null,"71203"]
[null,null,null,null,null,null,"72111"]
[null,null,null,null,null,null,"72112"]
[null,null,null,null,null,null,"72113"]
[null,null,null,null,null,null,"72191"]
[null,null,null,null,null,null,"72192"]
[null,null,null,null,null,null,"72193"]
[null,null,null,null,null,null,"72199"]
[null,null,null,null,null,null,"74101"]
[null,null,null,null,null,null,"74102"]
[null,null,null,null,null,null,"74103"]
[null,null,null,null,null,null,"74201"]
[null,null,null,null,null,null,"74202"]
[null,null,null,null,null,null,"74203"]
[null,null,null,null,null,null,"77111"]
[null,null,null,null,null,null,"77112"]
[null,null,null,null,null,null,"77291"]
[null,null,null,null,null,null,"77292"]
[null,null,null,null,null,null,"77299"]
[null,null,null,null,null,null,"77391"]
[null,null,null,null,null,null,"77399"]
[null,null,null,null,null,null,"78201"]
[null,null,null,null,null,null,"78202"]
[null,null,null,null,null,null,"78203"]
[null,null,null,null,null,null,"81221"]
[null,null,null,null,null,null,"81222"]
[null,null,null,null,null,null,"81229"]
[null,null,null,null,null,null,"82991"]
[null,null,null,null,null,null,"82992"]
[null,null,null,null,null,null,"82999"]
[null,null,null,null,null,null,"84231"]
[null,null,null,null,null,null,"84232"]
[null,null,null,null,null,null,"85201"]
[null,null,null,null,null,null,"85202"]
[null,null,null,null,null,null,"85203"]
[null,null,null,null,null,null,"85311"]
[null,null,null,null,null,null,"85312"]
[null,null,null,null,null,null,"85313"]
[null,null,null,null,null,null,"85314"]
[null,null,null,null,null,null,"85321"]
[null,null,null,null,null,null,"85322"]
[null,null,null,null,null,null,"85323"]
[null,null,null,null,null,null,"85511"]
[null,null,null,null,null,null,"85519"]
[null,null,null,null,null,null,"85521"]
[null,null,null,null,null,null,"85522"]
[null,null,null,null,null,null,"85591"]
[null,null,null,null,null,null,"85592"]
[null,null,null,null,null,null,"85599"]
[null,null,null,null,null,null,"86101"]
[null,null,null,null,null,null,"86102"]
[null,null,null,null,null,null,"86103"]
[null,null,null,null,null,null,"86104"]
[null,null,null,null,null,null,"86221"]
[null,null,null,null,null,null,"86222"]
[null,null,null,null,null,null,"86231"]
[null,null,null,null,null,null,"86232"]
[null,null,null,null,null,null,"86911"]
[null,null,null,null,null,null,"86912"]
[null,null,null,null,null,null,"86913"]
[null,null,null,null,null,null,"86919"]
[null,null,null,null,null,null,"86921"]
[null,null,null,null,null,null,"86922"]
[null,null,null,null,null,null,"86923"]
[null,null,null,null,null,null,"86924"]
[null,null,null,null,null,null,"86925"]
[null,null,null,null,null,null,"86929"]
[null,null,null,null,null,null,"87301"]
[null,null,null,null,null,null,"87302"]
[null,null,null,null,null,null,"87901"]
[null,null,null,null,null,null,"87902"]
[null,null,null,null,null,null,"88101"]
[null,null,null,null,null,null,"88102"]
[null,null,null,null,null,null,"88103"]
[null,null,null,null,null,null,"88991"]
[null,null,null,null,null,null,"88992"]
[null,null,null,null,null,null,"88993"]
[null,null,null,null,null,null,"88999"]
[null,null,null,null,null,null,"90011"]
[null,null,null,null,null,null,"90012"]
[null,null,null,null,null,null,"90013"]
[null,null,null,null,null,null,"90041"]
[null,null,null,null,null,null,"90042"]
[null,null,null,null,null,null,"91011"]
[null,null,null,null,null,null,"91012"]
[null,null,null,null,null,null,"91019"]
[null,null,null,null,null,null,"91021"]
[null,null,null,null,null,null,"91022"]
[null,null,null,null,null,null,"91041"]
[null,null,null,null,null,null,"91042"]
[null,null,null,null,null,null,"92001"]
[null,null,null,null,null,null,"92009"]
[null,null,null,null,null,null,"93111"]
[null,null,null,null,null,null,"93112"]
[null,null,null,null,null,null,"93113"]
[null,null,null,null,null,null,"93119"]
[null,null,null,null,null,null,"93121"]
[null,null,null,null,null,null,"93122"]
[null,null,null,null,null,null,"93123"]
[null,null,null,null,null,null,"93124"]
[null,null,null,null,null,null,"93125"]
[null,null,null,null,null,null,"93126"]
[null,null,null,null,null,null,"93127"]
[null,null,null,null,null,null,"93128"]
[null,null,null,null,null,null,"93129"]
[null,null,null,null,null,null,"93141"]
[null,null,null,null,null,null,"93142"]
[null,null,null,null,null,null,"93143"]
[null,null,null,null,null,null,"93144"]
[null,null,null,null,null,null,"93145"]
[null,null,null,null,null,null,"93146"]
[null,null,null,null,null,null,"93149"]
[null,null,null,null,null,null,"93151"]
[null,null,null,null,null,null,"93152"]
[null,null,null,null,null,null,"93191"]
[null,null,null,null,null,null,"93192"]
[null,null,null,null,null,null,"93193"]
[null,null,null,null,null,null,"93194"]
[null,null,null,null,null,null,"93195"]
[null,null,null,null,null,null,"93196"]
[null,null,null,null,null,null,"93199"]
[null,null,null,null,null,null,"93211"]
[null,null,null,null,null,null,"93212"]
[null,null,null,null,null,null,"93291"]
[null,null,null,null,null,null,"93299"]
[null,null,null,null,null,null,"94911"]
[null,null,null,null,null,null,"94919"]
[null,null,null,null,null,null,"94991"]
[null,null,null,null,null,null,"94992"]
[null,null,null,null,null,null,"94993"]
[null,null,null,null,null,null,"94994"]
[null,null,null,null,null,null,"94995"]
[null,null,null,null,null,null,"94996"]
[null,null,null,null,null,null,"94997"]
[null,null,null,null,null,null,"96011"]
[null,null,null,null,null,null,"96012"]
[null,null,null,null,null,null,"96013"]
[null,null,null,null,null,null,"96021"]
[null,null,null,null,null,null,"96022"]
[null,null,null,null,null,null,"96031"]
[null,null,null,null,null,null,"96032"]

{"sheet":"Pre-validation","index":3,"n_rows":268,"n_cols":6,"rows_kept":268,"cut":false,"hidden":true,"merged":[]}
[{"$f":"IF(NOT(Stamdata!H1405=\"\"),0,1)+AssertionId(\"existenceAssertion_SigningFinancialStatements_PrtExistence1\")","v":1}]
["KvK: Jaarverantwoording 2023 NLGAAP - kleine rechtspersonen - publicatiestukken","valueAssertion_BalanceSheet_PrtFST1SumOfChildrenDParentCredit1","`Equity` SHOULD be equal to the summation of the underlying values. ","non-blocking","IF(OR(not(AND(Stamdata!D106=\"\",Stamdata!D107=\"\",Stamdata!D108=\"\",Stamdata!D109=\"\",Stamdata!D110=\"\",Stamdata!D111=\"\",Stamdata!D112=\"\",Stamdata!D113=\"\",Stamdata!D114=\"\",Stamdata!D115=\"\")),not(0=0)),IF( Stamdata!D116 = sum(Stamdata!D106,Stamdata!D107,Stamdata!D108,Stamdata!D109,Stamdata!D110,Stamdata!D111,Stamdata!D112,Stamdata!D113,Stamdata!D114,Stamdata!D115),0,1),0)+AssertionId(\"valueAssertion_BalanceSheet_PrtFST1SumOfChildrenDParentCredit1\")","Stamdata!D116"]
["KvK: Jaarverantwoording 2023 NLGAAP - kleine rechtspersonen - publicatiestukken","valueAssertion_BalanceSheet_PrtFST1SumOfChildrenDParentCredit1","`Equity` SHOULD be equal to the summation of the underlying values. ","non-blocking","IF(OR(not(AND(Stamdata!F106=\"\",Stamdata!F107=\"\",Stamdata!F108=\"\",Stamdata!F109=\"\",Stamdata!F110=\"\",Stamdata!F111=\"\",Stamdata!F112=\"\",Stamdata!F113=\"\",Stamdata!F114=\"\",Stamdata!F115=\"\")),not(0=0)),IF( Stamdata!F116 = sum(Stamdata!F106,Stamdata!F107,Stamdata!F108,Stamdata!F109,Stamdata!F110,Stamdata!F111,Stamdata!F112,Stamdata!F113,Stamdata!F114,Stamdata!F115),0,1),0)+AssertionId(\"valueAssertion_BalanceSheet_PrtFST1SumOfChildrenDParentCredit1\")","Stamdata!F116"]
["KvK: Jaarverantwoording 2023 NLGAAP - kleine rechtspersonen - publicatiestukken","valueAssertion_BalanceSheet_PrtFST1SumOfChildrenDParentCredit2","`EquityAndLiabilities` SHOULD be equal to the summation of the underlying values. ","non-blocking","IF(OR(not(AND(Stamdata!D116=\"\",Stamdata!D118=\"\",Stamdata!D119=\"\",Stamdata!D120=\"\")),not(0=0)),IF( Stamdata!D121 = sum(Stamdata!D116,Stamdata!D118,Stamdata!D119,Stamdata!D120),0,1),0)+AssertionId(\"valueAssertion_BalanceSheet_PrtFST1SumOfChildrenDParentCredit2\")","Stamdata!D121"]
["KvK: Jaarverantwoording 2023 NLGAAP - kleine rechtspersonen - publicatiestukken","valueAssertion_BalanceSheet_PrtFST1SumOfChildrenDParentCredit2","`EquityAndLiabilities` SHOULD be equal to the summation of the underlying values. ","non-blocking","IF(OR(not(AND(Stamdata!F116=\"\",Stamdata!F118=\"\",Stamdata!F119=\"\",Stamdata!F120=\"\")),not(0=0)),IF( Stamdata!F121 = sum(Stamdata!F116,Stamdata!F118,Stamdata!F119,Stamdata!F120),0,1),0)+AssertionId(\"valueAssertion_BalanceSheet_PrtFST1SumOfChildrenDParentCredit2\")","Stamdata!F121"]
["KvK: Jaarverantwoording 2023 NLGAAP - kleine rechtspersonen - publicatiestukken","valueAssertion_BalanceSheet_PrtFST1SumOfChildrenDParentDebit1","`AssetsNoncurrent` SHOULD be equal to the summation of the underlying values. ","non-blocking","IF(OR(not(0=0),not(AND(Stamdata!D91=\"\",Stamdata!D92=\"\",Stamdata!D93=\"\",Stamdata!D94=\"\"))),IF( Stamdata!D95 = + sum(Stamdata!D91,Stamdata!D92,Stamdata!D93,Stamdata!D94),0,1),0)+AssertionId(\"valueAssertion_BalanceSheet_PrtFST1SumOfChildrenDParentDebit1\")","Stamdata!D95"]
["KvK: Jaarverantwoording 2023 NLGAAP - kleine rechtspersonen - publicatiestukken","valueAssertion_BalanceSheet_PrtFST1SumOfChildrenDParentDebit1","`AssetsNoncurrent` SHOULD be equal to the summation of the underlying values. ","non-blocking","IF(OR(not(0=0),not(AND(Stamdata!F91=\"\",Stamdata!F92=\"\",Stamdata!F93=\"\",Stamdata!F94=\"\"))),IF( Stamdata!F95 = + sum(Stamdata!F91,Stamdata!F92,Stamdata!F93,Stamdata!F94),0,1),0)+AssertionId(\"valueAssertion_BalanceSheet_PrtFST1SumOfChildrenDParentDebit1\")","Stamdata!F95"]
["KvK: Jaarverantwoording 2023 NLGAAP - kleine rechtspersonen - publicatiestukken","valueAssertion_BalanceSheet_PrtFST1SumOfChildrenDParentDebit2","`AssetsCurrent` SHOULD be equal to the summation of the underlying values. ","non-blocking","IF(OR(not(0=0),not(AND(Stamdata!D97=\"\",Stamdata!D98=\"\",Stamdata!D99=\"\",Stamdata!D100=\"\",Stamdata!D101=\"\"))),IF( Stamdata!D102 = + sum(Stamdata!D97,Stamdata!D98,Stamdata!D99,Stamdata!D100,Stamdata!D101),0,1),0)+AssertionId(\"valueAssertion_BalanceSheet_PrtFST1SumOfChildrenDParentDebit2\")","Stamdata!D102"]
["KvK: Jaarverantwoording 2023 NLGAAP - kleine rechtspersonen - publicatiestukken","valueAssertion_BalanceSheet_PrtFST1SumOfChildrenDParentDebit2","`AssetsCurrent` SHOULD be equal to the summation of the underlying values. ","non-blocking","IF(OR(not(0=0),not(AND(Stamdata!F97=\"\",Stamdata!F98=\"\",Stamdata!F99=\"\",Stamdata!F100=\"\",Stamdata!F101=\"\"))),IF( Stamdata!F102 = + sum(Stamdata!F97,Stamdata!F98,Stamdata!F99,Stamdata!F100,Stamdata!F101),0,1),0)+AssertionId(\"valueAssertion_BalanceSheet_PrtFST1SumOfChildrenDParentDebit2\")","Stamdata!F102"]
["KvK: Jaarverantwoording 2023 NLGAAP - kleine rechtspersonen - publicatiestukken","valueAssertion_BalanceSheet_PrtFST1SumOfChildrenDParentDebit3","`Assets` SHOULD be equal to the summation of the underlying values. ","non-blocking","IF(OR(not(0=0),not(AND(Stamdata!D95=\"\",Stamdata!D102=\"\"))),IF( Stamdata!D104 = + sum(Stamdata!D95,Stamdata!D102),0,1),0)+AssertionId(\"valueAssertion_BalanceSheet_PrtFST1SumOfChildrenDParentDebit3\")","Stamdata!D104"]
["KvK: Jaarverantwoording 2023 NLGAAP - kleine rechtspersonen - publicatiestukken","valueAssertion_BalanceSheet_PrtFST1SumOfChildrenDParentDebit3","`Assets` SHOULD be equal to the summation of the underlying values. ","non-blocking","IF(OR(not(0=0),not(AND(Stamdata!F95=\"\",Stamdata!F102=\"\"))),IF( Stamdata!F104 = + sum(Stamdata!F95,Stamdata!F102),0,1),0)+AssertionId(\"valueAssertion_BalanceSheet_PrtFST1SumOfChildrenDParentDebit3\")","Stamdata!F104"]
["KvK: Jaarverantwoording 2023 NLGAAP - kleine rechtspersonen - publicatiestukken","valueAssertion_BalanceSheet_PrtFST101Variable1","`EquityAndLiabilities` SHOULD be equal to + `Assets`. ","non-blocking","IF(+ Stamdata!D104 = Stamdata!D121 ,0,1)+AssertionId(\"valueAssertion_BalanceSheet_PrtFST101Variable1\")","Stamdata!D104"]
["KvK: Jaarverantwoording 2023 NLGAAP - kleine rechtspersonen - publicatiestukken","valueAssertion_BalanceSheet_PrtFST101Variable1","`EquityAndLiabilities` SHOULD be equal to + `Assets`. ","non-blocking","IF(+ Stamdata!F104 = Stamdata!F121 ,0,1)+AssertionId(\"valueAssertion_BalanceSheet_PrtFST101Variable1\")","Stamdata!F104"]
["KvK: Jaarverantwoording 2023 NLGAAP - kleine rechtspersonen - publicatiestukken","valueAssertion_BalanceSheet_PrtValueThnNoExistenceCovA1","`ResultForTheYear` SHOULD NOT be reported, because the reported value of `BalanceSheetBeforeAfterAppropriationResults` is equal to `Na`. ","non-blocking","IF(Stamdata!D89 = \"Na\",IF(Stamdata!D114=\"\",0,1),0)+AssertionId(\"valueAssertion_BalanceSheet_PrtValueThnNoExistenceCovA1\")","Stamdata!D114"]
["KvK: Jaarverantwoording 2023 NLGAAP - kleine rechtspersonen - publicatiestukken","valueAssertion_BalanceSheet_PrtValueThnNoExistenceCovA1","`ResultForTheYear` SHOULD NOT be reported, because the reported value of `BalanceSheetBeforeAfterAppropriationResults` is equal to `Na`. ","non-blocking","IF(Stamdata!F89 = \"Na\",IF(Stamdata!F114=\"\",0,1),0)+AssertionId(\"valueAssertion_BalanceSheet_PrtValueThnNoExistenceCovA1\")","Stamdata!F114"]
["KvK: Jaarverantwoording 2023 NLGAAP - kleine rechtspersonen - publicatiestukken","existenceAssertion_BalanceSheet_PrtOnlyReportFactPeriodEQParam1","`BalanceSheetBeforeAfterAppropriationResults` SHOULD not exist for any period other than the current period.","non-blocking","IF(NOT(Stamdata!D89=\"\"),0,1)+AssertionId(\"existenceAssertion_BalanceSheet_PrtOnlyReportFactPeriodEQParam1\")","Stamdata!D89"]
["KvK: Jaarverantwoording 2023 NLGAAP - kleine rechtspersonen - publicatiestukken","existenceAssertion_BalanceSheet_PrtOnlyReportFactPeriodEQParam1","`BalanceSheetBeforeAfterAppropriationResults` SHOULD not exist for any period other than the current period.","non-blocking","IF(NOT(Stamdata!F89=\"\"),0,1)+AssertionId(\"existenceAssertion_BalanceSheet_PrtOnlyReportFactPeriodEQParam1\")","Stamdata!F89"]
["KvK: Jaarverantwoording 2023 NLGAAP - kleine rechtspersonen - publicatiestukken","valueAssertion_DocumentInformation_PrtDateEarlier24HDateLater1","The date reported for `FinancialReportingPeriodPreviousEndDate` MUST be one day earlier than the date reported for `FinancialReportingPeriodCurrentStartDate`. ","blocking","IF((Stamdata!D60)+ 1 = (Stamdata!D57),0,1)+AssertionId(\"valueAssertion_DocumentInformation_PrtDateEarlier24HDateLater1\")","Stamdata!D57"]
["KvK: Jaarverantwoording 2023 NLGAAP - kleine rechtspersonen - publicatiestukken","valueAssertion_DocumentInformation_PrtDateEarlierDateLater1","The date reported for `FinancialReportingPeriodCurrentEndDate` MUST be earlier than the date reported for `DocumentAdoptionDate`. ","blocking","IF(Stamdata!D58 < Stamdata!D72,0,1)+AssertionId(\"valueAssertion_DocumentInformation_PrtDateEarlierDateLater1\")","Stamdata!D72"]
["KvK: Jaarverantwoording 2023 NLGAAP - kleine rechtspersonen - publicatiestukken","valueAssertion_DocumentInformation_PrtDateEarlierDateLater2","The date reported for `FinancialReportingPeriodPreviousStartDate` MUST be earlier than the date reported for `FinancialReportingPeriodPreviousEndDate`. ","blocking","IF(Stamdata!D59 < Stamdata!D60,0,1)+AssertionId(\"valueAssertion_DocumentInformation_PrtDateEarlierDateLater2\")","Stamdata!D60"]
["KvK: Jaarverantwoording 2023 NLGAAP - kleine rechtspersonen - publicatiestukken","valueAssertion_DocumentInformation_PrtDateEarlierDateLater3","The date reported for `FinancialReportingPeriodCurrentStartDate` MUST be earlier than the date reported for `FinancialReportingPeriodCurrentEndDate`. ","blocking","IF(Stamdata!D57 < Stamdata!D58,0,1)+AssertionId(\"valueAssertion_DocumentInformation_PrtDateEarlierDateLater3\")","Stamdata!D58"]
["KvK: Jaarverantwoording 2023 NLGAAP - kleine rechtspersonen - publicatiestukken","valueAssertion_DocumentInformation_PrtDateEarlierEQDateLater1","The date reported for `FinancialStatementsDateOfPreparation` SHOULD be earlier than, or equal to, the date reported for `DocumentAdoptionDate`. ","blocking","IF(Stamdata!D70 <= Stamdata!D72,0,1)+AssertionId(\"valueAssertion_DocumentInformation_PrtDateEarlierEQDateLater1\")","Stamdata!D72"]
["KvK: Jaarverantwoording 2023 NLGAAP - kleine rechtspersonen - publicatiestukken","valueAssertion_DocumentInformation_PrtDateEarlierEQYearDateLaterThnValue1","The reported value of `FinancialReportingPeriodDifferentThanAnnualStatus` SHOULD be equal to `Nee`, because the period from `FinancialReportingPeriodCurrentStartDate` to `FinancialReportingPeriodCurrentEndDate` is equal to the standard reporting period of one year. ","blocking","IF(((Stamdata!D57) + 365 - 1) = (Stamdata!D58),IF(Stamdata!D61 = \"Nee\",0,1),0)+AssertionId(\"valueAssertion_DocumentInformation_PrtDateEarlierEQYearDateLaterThnValue1\")","Stamdata!D61"]
["KvK: Jaarverantwoording 2023 NLGAAP - kleine rechtspersonen - publicatiestukken","valueAssertion_DocumentInformation_PrtDateEarlierNEYearDateLaterThnValue1","The reported value of `FinancialReportingPeriodDifferentThanAnnualStatus` SHOULD be equal to `Ja`, because the period from `FinancialReportingPeriodCurrentStartDate` to `FinancialReportingPeriodCurrentEndDate` differs from than the standard reporting period of one year. ","blocking","IF(((Stamdata!D57) + 365 - 1) <> (Stamdata!D58),IF(Stamdata!D61 = \"Ja\",0,1),0)+AssertionId(\"valueAssertion_DocumentInformation_PrtDateEarlierNEYearDateLaterThnValue1\")","Stamdata!D61"]
["KvK: Jaarverantwoording 2023 NLGAAP - kleine rechtspersonen - publicatiestukken","valueAssertion_DocumentInformation_PrtDateEarlierThanCurrent1","The date reported for `FinancialReportingPeriodCurrentEndDate` SHOULD be earlier than the current date. ","blocking","IF(Stamdata!D58 < NOW,0,1)+AssertionId(\"valueAssertion_DocumentInformation_PrtDateEarlierThanCurrent1\")","Stamdata!D58"]
["KvK: Jaarverantwoording 2023 NLGAAP - kleine rechtspersonen - publicatiestukken","valueAssertion_DocumentInformation_PrtDateEarlierThanEQDateCurrent1","The date reported for `DocumentAdoptionDate` SHOULD be earlier than, or equal to, the current date. ","blocking","IF(Stamdata!D72 <= NOW,0,1)+AssertionId(\"valueAssertion_DocumentInformation_PrtDateEarlierThanEQDateCurrent1\")","Stamdata!D72"]
["KvK: Jaarverantwoording 2023 NLGAAP - kleine rechtspersonen - publicatiestukken","valueAssertion_DocumentInformation_PrtExistenceThnExistence1","`FinancialReportingPeriodPreviousStartDate` SHOULD exist at least once within the same context, because `FinancialReportingPeriodPreviousEndDate` is reported. ","blocking","IF(not(Stamdata!D59=\"\"),0,1)+AssertionId(\"valueAssertion_DocumentInformation_PrtExistenceThnExistence1\")","Stamdata!D59"]
["KvK: Jaarverantwoording 2023 NLGAAP - kleine rechtspersonen - publicatiestukken","valueAssertion_DocumentInformation_PrtExistenceThnExistence2","`FinancialReportingPeriodPreviousEndDate` SHOULD exist at least once within the same context, because `FinancialReportingPeriodPreviousStartDate` is reported. ","blocking","IF(not(Stamdata!D60=\"\"),0,1)+AssertionId(\"valueAssertion_DocumentInformation_PrtExistenceThnExistence2\")","Stamdata!D60"]
["KvK: Jaarverantwoording 2023 NLGAAP - kleine rechtspersonen - publicatiestukken","valueAssertion_DocumentInformation_PrtValueThnExistence1","`FinancialReportingPeriodDifferentThanAnnualReasonDescription` SHOULD exist at least once, because the reported value of `FinancialReportingPeriodDifferentThanAnnualStatus` is equal to `Ja`. ","blocking","IF(Stamdata!D61 = \"Ja\",IF(not(Stamdata!D62=\"\"),0,1),0)+AssertionId(\"valueAssertion_DocumentInformation_PrtValueThnExistence1\")","Stamdata!D62"]
["KvK: Jaarverantwoording 2023 NLGAAP - kleine rechtspersonen - publicatiestukken","valueAssertion_DocumentInformation_PrtValueThnExistence2","`FinancialReportingPeriodDifferentThanAnnualImpactComparatives` SHOULD exist at least once, because the reported value of `FinancialReportingPeriodDifferentThanAnnualStatus` is equal to `Ja`. ","blocking","IF(Stamdata!D61 = \"Ja\",IF(not(Stamdata!D63=\"\"),0,1),0)+AssertionId(\"valueAssertion_DocumentInformation_PrtValueThnExistence2\")","Stamdata!D63"]
["KvK: Jaarverantwoording 2023 NLGAAP - kleine rechtspersonen - publicatiestukken","valueAssertion_DocumentInformation_PrtValueThnExistence3","`DocumentAdoptionDate` MUST exist at least once, because the reported value of `DocumentAdoptionStatus` is equal to `Ja`. ","blocking","IF(Stamdata!D71 = \"Ja\",IF(not(Stamdata!D72=\"\"),0,1),0)+AssertionId(\"valueAssertion_DocumentInformation_PrtValueThnExistence3\")","Stamdata!D72"]
["KvK: Jaarverantwoording 2023 NLGAAP - kleine rechtspersonen - publicatiestukken","valueAssertion_DocumentInformation_PrtValueThnExistence4","`DocumentResubmissionDueToTechnicalAndOrProcesRelatedInaccuraciesExplanation` MUST exist at least once, because the reported value of `DocumentResubmissionDueToTechnicalAndOrProcesRelatedInaccuracies` is equal to `Ja`. ","blocking","IF(Stamdata!D75 = \"Ja\",IF(not(Stamdata!D76=\"\"),0,1),0)+AssertionId(\"valueAssertion_DocumentInformation_PrtValueThnExistence4\")","Stamdata!D76"]
["KvK: Jaarverantwoording 2023 NLGAAP - kleine rechtspersonen - publicatiestukken","valueAssertion_DocumentInformation_PrtValueThnExistence5","`DocumentResubmissionDueToUnsurmountableInaccuraciesExplanation` MUST exist at least once, because the reported value of `DocumentResubmissionDueToUnsurmountableInaccuracies` is equal to `Ja`. ","blocking","IF(Stamdata!D73 = \"Ja\",IF(not(Stamdata!D74=\"\"),0,1),0)+AssertionId(\"valueAssertion_DocumentInformation_PrtValueThnExistence5\")","Stamdata!D74"]
["KvK: Jaarverantwoording 2023 NLGAAP - kleine rechtspersonen - publicatiestukken","valueAssertion_DocumentInformation_PrtValueThnNoExistence1","`FinancialReportingPeriodDifferentThanAnnualImpactComparatives` SHOULD NOT be reported, because the reported value of `FinancialReportingPeriodDifferentThanAnnualStatus` is equal to `Nee`. ","blocking","IF(Stamdata!D61 = \"Nee\",IF(Stamdata!D63=\"\",0,1),0)+AssertionId(\"valueAssertion_DocumentInformation_PrtValueThnNoExistence1\")","Stamdata!D63"]
["KvK: Jaarverantwoording 2023 NLGAAP - kleine rechtspersonen - publicatiestukken","valueAssertion_DocumentInformation_PrtValueThnNoExistence2","`DocumentAdoptionDate` MUST NOT be reported, because the reported value of `DocumentAdoptionStatus` is equal to `Nee`. ","blocking","IF(Stamdata!D71 = \"Nee\",IF(Stamdata!D72=\"\",0,1),0)+AssertionId(\"valueAssertion_DocumentInformation_PrtValueThnNoExistence2\")","Stamdata!D72"]
["KvK: Jaarverantwoording 2023 NLGAAP - kleine rechtspersonen - publicatiestukken","valueAssertion_DocumentInformation_PrtValueThnNoExistence3","`FinancialReportingPeriodDifferentThanAnnualReasonDescription` SHOULD NOT be reported, because the reported value of `FinancialReportingPeriodDifferentThanAnnualStatus` is equal to `Nee`. ","blocking","IF(Stamdata!D61 = \"Nee\",IF(Stamdata!D62=\"\",0,1),0)+AssertionId(\"valueAssertion_DocumentInformation_PrtValueThnNoExistence3\")","Stamdata!D62"]
["KvK: Jaarverantwoording 2023 NLGAAP - kleine rechtspersonen - publicatiestukken","existenceAssertion_DocumentInformation_PrtExistOnce1","`EmailAddressFull` MUST exist once.","blocking","IF(NOT(Stamdata!D77=\"\"),0,1)+AssertionId(\"existenceAssertion_DocumentInformation_PrtExistOnce1\")","Stamdata!D77"]
["KvK: Jaarverantwoording 2023 NLGAAP - kleine rechtspersonen - publicatiestukken","existenceAssertion_DocumentInformation_PrtExistOnce3","`FinancialReportingPeriodCurrentEndDate` MUST exist once.","blocking","IF(NOT(Stamdata!D58=\"\"),0,1)+AssertionId(\"existenceAssertion_DocumentInformation_PrtExistOnce3\")","Stamdata!D58"]
["KvK: Jaarverantwoording 2023 NLGAAP - kleine rechtspersonen - publicatiestukken","existenceAssertion_DocumentInformation_PrtExistOnce4","`DocumentPresentationCurrency` MUST exist once.","blocking","IF(NOT(Stamdata!D66=\"\"),0,1)+AssertionId(\"existenceAssertion_DocumentInformation_PrtExistOnce4\")","Stamdata!D66"]
["KvK: Jaarverantwoording 2023 NLGAAP - kleine rechtspersonen - publicatiestukken","existenceAssertion_DocumentInformation_PrtExistOnce5","`FinancialReportingPeriodDifferentThanAnnualStatus` MUST exist once.","blocking","IF(NOT(Stamdata!D61=\"\"),0,1)+AssertionId(\"existenceAssertion_DocumentInformation_PrtExistOnce5\")","Stamdata!D61"]
["KvK: Jaarverantwoording 2023 NLGAAP - kleine rechtspersonen - publicatiestukken","existenceAssertion_DocumentInformation_PrtExistOnce6","`DocumentAdoptionStatus` MUST exist once.","blocking","IF(NOT(Stamdata!D71=\"\"),0,1)+AssertionId(\"existenceAssertion_DocumentInformation_PrtExistOnce6\")","Stamdata!D71"]
["KvK: Jaarverantwoording 2023 NLGAAP - kleine rechtspersonen - publicatiestukken","existenceAssertion_DocumentInformation_PrtExistOnce8","`FinancialReportingPeriodCurrentStartDate` MUST exist once.","blocking","IF(NOT(Stamdata!D57=\"\"),0,1)+AssertionId(\"existenceAssertion_DocumentInformation_PrtExistOnce8\")","Stamdata!D57"]
["KvK: Jaarverantwoording 2023 NLGAAP - kleine rechtspersonen - publicatiestukken","existenceAssertion_DocumentInformation_PrtExistOnce10","`FinancialStatementsDateOfPreparation` MUST exist once.","blocking","IF(NOT(Stamdata!D70=\"\"),0,1)+AssertionId(\"existenceAssertion_DocumentInformation_PrtExistOnce10\")","Stamdata!D70"]
["KvK: Jaarverantwoording 2023 NLGAAP - kleine rechtspersonen - publicatiestukken","existenceAssertion_DocumentInformation_PrtExistOnceMax1","`FinancialReportingPeriodPreviousEndDate` MUST not exist or at most once.","blocking","IF(NOT(Stamdata!D60=\"\"),0,1)+AssertionId(\"existenceAssertion_DocumentInformation_PrtExistOnceMax1\")","Stamdata!D60"]
["KvK: Jaarverantwoording 2023 NLGAAP - kleine rechtspersonen - publicatiestukken","existenceAssertion_DocumentInformation_PrtExistOnceMax2","`FinancialReportingPeriodPreviousStartDate` MUST not exist or at most once.","blocking","IF(NOT(Stamdata!D59=\"\"),0,1)+AssertionId(\"existenceAssertion_DocumentInformation_PrtExistOnceMax2\")","Stamdata!D59"]
["KvK: Jaarverantwoording 2023 NLGAAP - kleine rechtspersonen - publicatiestukken","existenceAssertion_DocumentInformation_PrtExistOnce2","`BasisOfPreparation` MUST exist once.","blocking","IF(NOT(Stamdata!D64=\"\"),0,1)+AssertionId(\"existenceAssertion_DocumentInformation_PrtExistOnce2\")","Stamdata!D64"]
["KvK: Jaarverantwoording 2023 NLGAAP - kleine rechtspersonen - publicatiestukken","valueAssertion_EntityAddress_PrtExistenceThnNoExistenceCovA1","`DescriptionLocationNL` MUST NOT be reported, because `PlaceOfResidenceAbroad` is reported. ","blocking","IF(0=0,0,1)+AssertionId(\"valueAssertion_EntityAddress_PrtExistenceThnNoExistenceCovA1\")","Stamdata!D37"]
["KvK: Jaarverantwoording 2023 NLGAAP - kleine rechtspersonen - publicatiestukken","valueAssertion_EntityAddress_PrtExistenceThnNoExistenceCovA2","`StreetNameNL` MUST NOT be reported, because `PlaceOfResidenceAbroad` is reported. ","blocking","IF(0=0,0,1)+AssertionId(\"valueAssertion_EntityAddress_PrtExistenceThnNoExistenceCovA2\")","Stamdata!D38"]
["KvK: Jaarverantwoording 2023 NLGAAP - kleine rechtspersonen - publicatiestukken","valueAssertion_EntityAddress_PrtExistenceThnNoExistenceCovA3","`HouseNumberNL` MUST NOT be reported, because `PlaceOfResidenceAbroad` is reported. ","blocking","IF(0=0,0,1)+AssertionId(\"valueAssertion_EntityAddress_PrtExistenceThnNoExistenceCovA3\")","Stamdata!D39"]
["KvK: Jaarverantwoording 2023 NLGAAP - kleine rechtspersonen - publicatiestukken","valueAssertion_EntityAddress_PrtExistenceThnNoExistenceCovA4","`HouseNumberAddition` MUST NOT be reported, because `PlaceOfResidenceAbroad` is reported. ","blocking","IF(0=0,0,1)+AssertionId(\"valueAssertion_EntityAddress_PrtExistenceThnNoExistenceCovA4\")","Stamdata!D40"]
["KvK: Jaarverantwoording 2023 NLGAAP - kleine rechtspersonen - publicatiestukken","valueAssertion_EntityAddress_PrtExistenceThnNoExistenceCovA5","`POBoxNumber` MUST NOT be reported, because `PlaceOfResidenceAbroad` is reported. ","blocking","IF(0=0,0,1)+AssertionId(\"valueAssertion_EntityAddress_PrtExistenceThnNoExistenceCovA5\")","Stamdata!D41"]
["KvK: Jaarverantwoording 2023 NLGAAP - kleine rechtspersonen - publicatiestukken","valueAssertion_EntityAddress_PrtExistenceThnNoExistenceCovA6","`DescriptionLocationAbroad` MUST NOT be reported, because `PlaceOfResidenceNL` is reported. ","blocking","IF(0=0,0,1)+AssertionId(\"valueAssertion_EntityAddress_PrtExistenceThnNoExistenceCovA6\")","Stamdata!D44"]
["KvK: Jaarverantwoording 2023 NLGAAP - kleine rechtspersonen - publicatiestukken","valueAssertion_EntityAddress_PrtExistenceThnNoExistenceCovA7","`StreetNameAbroad` MUST NOT be reported, because `PlaceOfResidenceNL` is reported. ","blocking","IF(0=0,0,1)+AssertionId(\"valueAssertion_EntityAddress_PrtExistenceThnNoExistenceCovA7\")","Stamdata!D45"]
["KvK: Jaarverantwoording 2023 NLGAAP - kleine rechtspersonen - publicatiestukken","valueAssertion_EntityAddress_PrtExistenceThnNoExistenceCovA8","`HouseNumberAbroad` MUST NOT be reported, because `PlaceOfResidenceNL` is reported. ","blocking","IF(0=0,0,1)+AssertionId(\"valueAssertion_EntityAddress_PrtExistenceThnNoExistenceCovA8\")","Stamdata!D46"]
["KvK: Jaarverantwoording 2023 NLGAAP - kleine rechtspersonen - publicatiestukken","valueAssertion_EntityAddress_PrtExistenceThnNoExistenceCovA9","`PostalCodeAbroad` MUST NOT be reported, because `PlaceOfResidenceNL` is reported. ","blocking","IF(0=0,0,1)+AssertionId(\"valueAssertion_EntityAddress_PrtExistenceThnNoExistenceCovA9\")","Stamdata!D47"]
["KvK: Jaarverantwoording 2023 NLGAAP - kleine rechtspersonen - publicatiestukken","existenceAssertion_EntityAddress_PrtExist02XOR1","`PlaceOfResidenceNL` or `PlaceOfResidenceAbroad` MUST exist once.","blocking","IF(OR(NOT(Stamdata!D43=\"\"),NOT(Stamdata!D48=\"\")),0,1)+AssertionId(\"existenceAssertion_EntityAddress_PrtExist02XOR1\")","Stamdata!D43,Stamdata!D48"]
["KvK: Jaarverantwoording 2023 NLGAAP - kleine rechtspersonen - publicatiestukken","existenceAssertion_EntityAddress_PrtExist02XOR2","`PostalCodeNL` or `PlaceOfResidenceAbroad` MUST exist once.","blocking","IF(OR(NOT(Stamdata!D42=\"\"),NOT(Stamdata!D48=\"\")),0,1)+AssertionId(\"existenceAssertion_EntityAddress_PrtExist02XOR2\")","Stamdata!D42,Stamdata!D48"]
["KvK: Jaarverantwoording 2023 NLGAAP - kleine rechtspersonen - publicatiestukken","existenceAssertion_EntityInformation_PrtExistOnce5","`LegalEntityLegalForm` MUST exist once.","blocking","IF(NOT(Stamdata!D25=\"\"),0,1)+AssertionId(\"existenceAssertion_EntityInformation_PrtExistOnce5\")","Stamdata!D25"]
["KvK: Jaarverantwoording 2023 NLGAAP - kleine rechtspersonen - publicatiestukken","existenceAssertion_EntityInformation_PrtExistOnce2","`LegalEntityRegisteredOffice` MUST exist once.","blocking","IF(NOT(Stamdata!D26=\"\"),0,1)+AssertionId(\"existenceAssertion_EntityInformation_PrtExistOnce2\")","Stamdata!D26"]
["KvK: Jaarverantwoording 2023 NLGAAP - kleine rechtspersonen - publicatiestukken","existenceAssertion_EntityInformation_PrtExistOnce3","`LegalEntityName` MUST exist once.","blocking","IF(NOT(Stamdata!D24=\"\"),0,1)+AssertionId(\"existenceAssertion_EntityInformation_PrtExistOnce3\")","Stamdata!D24"]
["KvK: Jaarverantwoording 2023 NLGAAP - kleine rechtspersonen - publicatiestukken","existenceAssertion_EntityInformation_PrtExistOnce4","`ChamberOfCommerceRegistrationNumber` MUST exist once.","blocking","IF(NOT(Stamdata!D27=\"\"),0,1)+AssertionId(\"existenceAssertion_EntityInformation_PrtExistOnce4\")","Stamdata!D27"]
["KvK: Jaarverantwoording 2023 NLGAAP - kleine rechtspersonen - publicatiestukken","existenceAssertion_EntityInformation_PrtExistOnce7","`LegalSizeCriteriaClassificationSmall` MUST exist once.","blocking","IF(NOT(Stamdata!D29=\"\"),0,1)+AssertionId(\"existenceAssertion_EntityInformation_PrtExistOnce7\")","Stamdata!D29"]
["KvK: Jaarverantwoording 2023 NLGAAP - kleine rechtspersonen - publicatiestukken","valueAssertion_NotesAverageNumberOfEmployeesBreakdown_PrtFST102Variables1","`AverageNumberEmployees` SHOULD be equal to + `AverageNumberEmployeesNetherlands` + `AverageNumberEmployeesAbroad`. ","non-blocking","IF(OR(not(Stamdata!D1049Netherlands=\"\"),not(Stamdata!D1049Abroad=\"\")),IF(+ Stamdata!D1049Netherlands + Stamdata!D1049Abroad = Stamdata!D1049 ,0,1),0)+AssertionId(\"valueAssertion_NotesAverageNumberOfEmployeesBreakdown_PrtFST102Variables1\")","Stamdata!D1049"]
["KvK: Jaarverantwoording 2023 NLGAAP - kleine rechtspersonen - publicatiestukken","valueAssertion_NotesAverageNumberOfEmployeesBreakdown_PrtFST102Variables1","`AverageNumberEmployees` SHOULD be equal to + `AverageNumberEmployeesNetherlands` + `AverageNumberEmployeesAbroad`. ","non-blocking","IF(OR(not(Stamdata!F1049Netherlands=\"\"),not(Stamdata!F1049Abroad=\"\")),IF(+ Stamdata!F1049Netherlands + Stamdata!F1049Abroad = Stamdata!F1049 ,0,1),0)+AssertionId(\"valueAssertion_NotesAverageNumberOfEmployeesBreakdown_PrtFST102Variables1\")","Stamdata!F1049"]
["KvK: Jaarverantwoording 2023 NLGAAP - kleine rechtspersonen - publicatiestukken","existenceAssertion_NotesAverageNumberOfEmployeesBreakdown_PrtExistence1","`AverageNumberEmployees` SHOULD exist at least once.","non-blocking","IF(NOT(Stamdata!D1049=\"\"),0,1)+AssertionId(\"existenceAssertion_NotesAverageNumberOfEmployeesBreakdown_PrtExistence1\")","Stamdata!D1049"]
["KvK: Jaarverantwoording 2023 NLGAAP - kleine rechtspersonen - publicatiestukken","existenceAssertion_NotesAverageNumberOfEmployeesBreakdown_PrtExistence1","`AverageNumberEmployees` SHOULD exist at least once.","non-blocking","IF(NOT(Stamdata!F1049=\"\"),0,1)+AssertionId(\"existenceAssertion_NotesAverageNumberOfEmployeesBreakdown_PrtExistence1\")","Stamdata!F1049"]
["KvK: Jaarverantwoording 2023 NLGAAP - kleine rechtspersonen - publicatiestukken","valueAssertion_NotesIntangibleAssetsBreakdown_PrtFST1SumOfChildrenParentDebit1","`IntangibleAssets` SHOULD be equal to the summation of the underlying values. ","non-blocking","IF(OR(not(0=0),not(AND(Stamdata!D469=\"\",Stamdata!D470=\"\"))),IF( Stamdata!D472 = + sum(Stamdata!D469,Stamdata!D470),0,1),0)+AssertionId(\"valueAssertion_NotesIntangibleAssetsBreakdown_PrtFST1SumOfChildrenParentDebit1\")","Stamdata!D472"]
["KvK: Jaarverantwoording 2023 NLGAAP - kleine rechtspersonen - publicatiestukken","valueAssertion_NotesIntangibleAssetsBreakdown_PrtFST1SumOfChildrenParentDebit1","`IntangibleAssets` SHOULD be equal to the summation of the underlying values. ","non-blocking","IF(OR(not(0=0),not(AND(Stamdata!F469=\"\",Stamdata!F470=\"\"))),IF( Stamdata!F472 = + sum(Stamdata!F469,Stamdata!F470),0,1),0)+AssertionId(\"valueAssertion_NotesIntangibleAssetsBreakdown_PrtFST1SumOfChildrenParentDebit1\")","Stamdata!F472"]
["KvK: Jaarverantwoording 2023 NLGAAP - kleine rechtspersonen - publicatiestukken","valueAssertion_NotesLegalReservesBreakdown_PrtFST1SumOfChildrenParentCredit1","`LegalReserves` SHOULD be equal to the summation of the underlying values. ","non-blocking","IF(OR(not(AND(Stamdata!D799=\"\",Stamdata!D800=\"\",Stamdata!D801=\"\",Stamdata!D802=\"\",Stamdata!D803=\"\",Stamdata!D804=\"\",Stamdata!D805=\"\",Stamdata!D806=\"\",Stamdata!D807=\"\")),not(0=0)),IF( Stamdata!D809 = sum(Stamdata!D799,Stamdata!D800,Stamdata!D801,Stamdata!D802,Stamdata!D803,Stamdata!D804,Stamdata!D805,Stamdata!D806,Stamdata!D807),0,1),0)+AssertionId(\"valueAssertion_NotesLegalReservesBreakdown_PrtFST1SumOfChildrenParentCredit1\")","Stamdata!D809"]
["KvK: Jaarverantwoording 2023 NLGAAP - kleine rechtspersonen - publicatiestukken","valueAssertion_NotesLegalReservesBreakdown_PrtFST1SumOfChildrenParentCredit1","`LegalReserves` SHOULD be equal to the summation of the underlying values. ","non-blocking","IF(OR(not(AND(Stamdata!F799=\"\",Stamdata!F800=\"\",Stamdata!F801=\"\",Stamdata!F802=\"\",Stamdata!F803=\"\",Stamdata!F804=\"\",Stamdata!F805=\"\",Stamdata!F806=\"\",Stamdata!F807=\"\")),not(0=0)),IF( Stamdata!F809 = sum(Stamdata!F799,Stamdata!F800,Stamdata!F801,Stamdata!F802,Stamdata!F803,Stamdata!F804,Stamdata!F805,Stamdata!F806,Stamdata!F807),0,1),0)+AssertionId(\"valueAssertion_NotesLegalReservesBreakdown_PrtFST1SumOfChildrenParentCredit1\")","Stamdata!F809"]
["KvK: Jaarverantwoording 2023 NLGAAP - kleine rechtspersonen - publicatiestukken","valueAssertion_NotesNoncurrentLiabilitiesBreakdown_PrtFST1SumOfChildrenParentCredit1","`LiabilitiesNoncurrent` SHOULD be equal to the summation of the underlying values. ","non-blocking","IF(OR(not(AND(Stamdata!D890=\"\",Stamdata!D891=\"\")),not(0=0)),IF( Stamdata!D893 = sum(Stamdata!D890,Stamdata!D891),0,1),0)+AssertionId(\"valueAssertion_NotesNoncurrentLiabilitiesBreakdown_PrtFST1SumOfChildrenParentCredit1\")","Stamdata!D893"]
["KvK: Jaarverantwoording 2023 NLGAAP - kleine rechtspersonen - publicatiestukken","valueAssertion_NotesNoncurrentLiabilitiesBreakdown_PrtFST1SumOfChildrenParentCredit1","`LiabilitiesNoncurrent` SHOULD be equal to the summation of the underlying values. ","non-blocking","IF(OR(not(AND(Stamdata!F890=\"\",Stamdata!F891=\"\")),not(0=0)),IF( Stamdata!F893 = sum(Stamdata!F890,Stamdata!F891),0,1),0)+AssertionId(\"valueAssertion_NotesNoncurrentLiabilitiesBreakdown_PrtFST1SumOfChildrenParentCredit1\")","Stamdata!F893"]
["KvK: Jaarverantwoording 2023 NLGAAP - kleine rechtspersonen - publicatiestukken","valueAssertion_NotesPaymentsDueToTerminationEmploymentSeniorOfficialsSpecification_PrtFST102Variables1","`AmountExceedingMaximumRemuneration` SHOULD be equal to + `PaymentsDueToTerminationOfTheEmploymentIncludingUnduePayments` - `IndividualMaximumPaymentDueToTerminationOfTheEmployment`. ","non-blocking","IF(OR(not(Stamdata!D1078=\"\"),not(Stamdata!D1077=\"\")),IF(+ Stamdata!D1078 - Stamdata!D1077 = Stamdata!D1081 ,0,1),0)+AssertionId(\"valueAssertion_NotesPaymentsDueToTerminationEmploymentSeniorOfficialsSpecification_PrtFST102Variables1\")","Stamdata!D1081"]
["KvK: Jaarverantwoording 2023 NLGAAP - kleine rechtspersonen - publicatiestukken","valueAssertion_NotesPaymentsDueToTerminationEmploymentSeniorOfficialsSpecification_PrtFST102Variables1","`AmountExceedingMaximumRemuneration` SHOULD be equal to + `PaymentsDueToTerminationOfTheEmploymentIncludingUnduePayments` - `IndividualMaximumPaymentDueToTerminationOfTheEmployment`. ","non-blocking","IF(OR(not(Stamdata!E1078=\"\"),not(Stamdata!E1077=\"\")),IF(+ Stamdata!E1078 - Stamdata!E1077 = Stamdata!E1081 ,0,1),0)+AssertionId(\"valueAssertion_NotesPaymentsDueToTerminationEmploymentSeniorOfficialsSpecification_PrtFST102Variables1\")","Stamdata!E1081"]
["KvK: Jaarverantwoording 2023 NLGAAP - kleine rechtspersonen - publicatiestukken","valueAssertion_NotesPaymentsDueToTerminationEmploymentSeniorOfficialsSpecification_PrtFST102Variables1","`AmountExceedingMaximumRemuneration` SHOULD be equal to + `PaymentsDueToTerminationOfTheEmploymentIncludingUnduePayments` - `IndividualMaximumPaymentDueToTerminationOfTheEmployment`. ","non-blocking","IF(OR(not(Stamdata!F1078=\"\"),not(Stamdata!F1077=\"\")),IF(+ Stamdata!F1078 - Stamdata!F1077 = Stamdata!F1081 ,0,1),0)+AssertionId(\"valueAssertion_NotesPaymentsDueToTerminationEmploymentSeniorOfficialsSpecification_PrtFST102Variables1\")","Stamdata!F1081"]
["KvK: Jaarverantwoording 2023 NLGAAP - kleine rechtspersonen - publicatiestukken","valueAssertion_NotesPaymentsDueToTerminationEmploymentSeniorOfficialsSpecification_PrtFST102Variables1","`AmountExceedingMaximumRemuneration` SHOULD be equal to + `PaymentsDueToTerminationOfTheEmploymentIncludingUnduePayments` - `IndividualMaximumPaymentDueToTerminationOfTheEmployment`. ","non-blocking","IF(OR(not(Stamdata!G1078=\"\"),not(Stamdata!G1077=\"\")),IF(+ Stamdata!G1078 - Stamdata!G1077 = Stamdata!G1081 ,0,1),0)+AssertionId(\"valueAssertion_NotesPaymentsDueToTerminationEmploymentSeniorOfficialsSpecification_PrtFST102Variables1\")","Stamdata!G1081"]
["KvK: Jaarverantwoording 2023 NLGAAP - kleine rechtspersonen - publicatiestukken","valueAssertion_NotesPaymentsDueToTerminationEmploymentSeniorOfficialsSpecification_PrtFST102Variables1","`AmountExceedingMaximumRemuneration` SHOULD be equal to + `PaymentsDueToTerminationOfTheEmploymentIncludingUnduePayments` - `IndividualMaximumPaymentDueToTerminationOfTheEmployment`. ","non-blocking","IF(OR(not(Stamdata!H1078=\"\"),not(Stamdata!H1077=\"\")),IF(+ Stamdata!H1078 - Stamdata!H1077 = Stamdata!H1081 ,0,1),0)+AssertionId(\"valueAssertion_NotesPaymentsDueToTerminationEmploymentSeniorOfficialsSpecification_PrtFST102Variables1\")","Stamdata!H1081"]
["KvK: Jaarverantwoording 2023 NLGAAP - kleine rechtspersonen - publicatiestukken","valueAssertion_NotesReceivablesBreakdown_PrtFST1SumOfChildrenParentDebit1","`Receivables` SHOULD be equal to the summation of the underlying values. ","non-blocking","IF(OR(not(0=0),not(AND(Stamdata!D607=\"\",Stamdata!D608=\"\"))),IF( Stamdata!D610 = + sum(Stamdata!D607,Stamdata!D608),0,1),0)+AssertionId(\"valueAssertion_NotesReceivablesBreakdown_PrtFST1SumOfChildrenParentDebit1\")","Stamdata!D610"]
["KvK: Jaarverantwoording 2023 NLGAAP - kleine rechtspersonen - publicatiestukken","valueAssertion_NotesReceivablesBreakdown_PrtFST1SumOfChildrenParentDebit1","`Receivables` SHOULD be equal to the summation of the underlying values. ","non-blocking","IF(OR(not(0=0),not(AND(Stamdata!F607=\"\",Stamdata!F608=\"\"))),IF( Stamdata!F610 = + sum(Stamdata!F607,Stamdata!F608),0,1),0)+AssertionId(\"valueAssertion_NotesReceivablesBreakdown_PrtFST1SumOfChildrenParentDebit1\")","Stamdata!F610"]
["KvK: Jaarverantwoording 2023 NLGAAP - kleine rechtspersonen - publicatiestukken","valueAssertion_NotesReceivablesBreakdown_PrtFST1SumOfChildrenParentDebit2","`ReceivablesOtherCurrent` SHOULD be equal to the summation of the underlying values. ","non-blocking","IF(OR(not(0=0),not(0=0)),IF( Stamdata!D608 = + 0,0,1),0)+AssertionId(\"valueAssertion_NotesReceivablesBreakdown_PrtFST1SumOfChildrenParentDebit2\")","Stamdata!D608"]
["KvK: Jaarverantwoording 2023 NLGAAP - kleine rechtspersonen - publicatiestukken","valueAssertion_NotesReceivablesBreakdown_PrtFST1SumOfChildrenParentDebit2","`ReceivablesOtherCurrent` SHOULD be equal to the summation of the underlying values. ","non-blocking","IF(OR(not(0=0),not(0=0)),IF( Stamdata!F608 = + 0,0,1),0)+AssertionId(\"valueAssertion_NotesReceivablesBreakdown_PrtFST1SumOfChildrenParentDebit2\")","Stamdata!F608"]
["KvK: Jaarverantwoording 2023 NLGAAP - kleine rechtspersonen - publicatiestukken","valueAssertion_NotesRemunerationExecutiveSeniorOfficialsFrom13MonthSpecification_PrtFST1SumOfChildrenParentDebit1T2","`RemunerationUnduePayments` SHOULD be equal to the summation of the underlying values. ","non-blocking","IF(OR(not(0=0),not(AND(Stamdata!D1100=\"\",Stamdata!D1101=\"\"))),IF( Stamdata!D1103 = + sum(Stamdata!D1100,Stamdata!D1101),0,1),0)+AssertionId(\"valueAssertion_NotesRemunerationExecutiveSeniorOfficialsFrom13MonthSpecification_PrtFST1SumOfChildrenParentDebit1T2\")","Stamdata!D1103"]
["KvK: Jaarverantwoording 2023 NLGAAP - kleine rechtspersonen - publicatiestukken","valueAssertion_NotesRemunerationExecutiveSeniorOfficialsFrom13MonthSpecification_PrtFST1SumOfChildrenParentDebit1T2","`RemunerationUnduePayments` SHOULD be equal to the summation of the underlying values. ","non-blocking","IF(OR(not(0=0),not(AND(Stamdata!E1100=\"\",Stamdata!E1101=\"\"))),IF( Stamdata!E1103 = + sum(Stamdata!E1100,Stamdata!E1101),0,1),0)+AssertionId(\"valueAssertion_NotesRemunerationExecutiveSeniorOfficialsFrom13MonthSpecification_PrtFST1SumOfChildrenParentDebit1T2\")","Stamdata!E1103"]
["KvK: Jaarverantwoording 2023 NLGAAP - kleine rechtspersonen - publicatiestukken","valueAssertion_NotesRemunerationExecutiveSeniorOfficialsFrom13MonthSpecification_PrtFST1SumOfChildrenParentDebit1T2","`RemunerationUnduePayments` SHOULD be equal to the summation of the underlying values. ","non-blocking","IF(OR(not(0=0),not(AND(Stamdata!F1100=\"\",Stamdata!F1101=\"\"))),IF( Stamdata!F1103 = + sum(Stamdata!F1100,Stamdata!F1101),0,1),0)+AssertionId(\"valueAssertion_NotesRemunerationExecutiveSeniorOfficialsFrom13MonthSpecification_PrtFST1SumOfChildrenParentDebit1T2\")","Stamdata!F1103"]
["KvK: Jaarverantwoording 2023 NLGAAP - kleine rechtspersonen - publicatiestukken","valueAssertion_NotesRemunerationExecutiveSeniorOfficialsFrom13MonthSpecification_PrtFST1SumOfChildrenParentDebit1T2","`RemunerationUnduePayments` SHOULD be equal to the summation of the underlying values. ","non-blocking","IF(OR(not(0=0),not(AND(Stamdata!G1100=\"\",Stamdata!G1101=\"\"))),IF( Stamdata!G1103 = + sum(Stamdata!G1100,Stamdata!G1101),0,1),0)+AssertionId(\"valueAssertion_NotesRemunerationExecutiveSeniorOfficialsFrom13MonthSpecification_PrtFST1SumOfChildrenParentDebit1T2\")","Stamdata!G1103"]
["KvK: Jaarverantwoording 2023 NLGAAP - kleine rechtspersonen - publicatiestukken","valueAssertion_NotesRemunerationExecutiveSeniorOfficialsFrom13MonthSpecification_PrtFST1SumOfChildrenParentDebit1T2","`RemunerationUnduePayments` SHOULD be equal to the summation of the underlying values. ","non-blocking","IF(OR(not(0=0),not(AND(Stamdata!H1100=\"\",Stamdata!H1101=\"\"))),IF( Stamdata!H1103 = + sum(Stamdata!H1100,Stamdata!H1101),0,1),0)+AssertionId(\"valueAssertion_NotesRemunerationExecutiveSeniorOfficialsFrom13MonthSpecification_PrtFST1SumOfChildrenParentDebit1T2\")","Stamdata!H1103"]
["KvK: Jaarverantwoording 2023 NLGAAP - kleine rechtspersonen - publicatiestukken","valueAssertion_NotesRemunerationExecutiveSeniorOfficialsFrom13MonthSpecification_PrtFST102Variables1","`Remuneration` SHOULD be equal to + `RemunerationUnduePayments` - `UnduePayments`. ","non-blocking","IF(OR(not(Stamdata!D1106UnduePayments=\"\"),not(Stamdata!D1105=\"\")),IF(+ Stamdata!D1106UnduePayments - Stamdata!D1105 = Stamdata!D1106 ,0,1),0)+AssertionId(\"valueAssertion_NotesRemunerationExecutiveSeniorOfficialsFrom13MonthSpecification_PrtFST102Variables1\")","Stamdata!D1106"]
["KvK: Jaarverantwoording 2023 NLGAAP - kleine rechtspersonen - publicatiestukken","valueAssertion_NotesRemunerationExecutiveSeniorOfficialsFrom13MonthSpecification_PrtFST102Variables1","`Remuneration` SHOULD be equal to + `RemunerationUnduePayments` - `UnduePayments`. ","non-blocking","IF(OR(not(Stamdata!E1106UnduePayments=\"\"),not(Stamdata!E1105=\"\")),IF(+ Stamdata!E1106UnduePayments - Stamdata!E1105 = Stamdata!E1106 ,0,1),0)+AssertionId(\"valueAssertion_NotesRemunerationExecutiveSeniorOfficialsFrom13MonthSpecification_PrtFST102Variables1\")","Stamdata!E1106"]
["KvK: Jaarverantwoording 2023 NLGAAP - kleine rechtspersonen - publicatiestukken","valueAssertion_NotesRemunerationExecutiveSeniorOfficialsFrom13MonthSpecification_PrtFST102Variables1","`Remuneration` SHOULD be equal to + `RemunerationUnduePayments` - `UnduePayments`. ","non-blocking","IF(OR(not(Stamdata!F1106UnduePayments=\"\"),not(Stamdata!F1105=\"\")),IF(+ Stamdata!F1106UnduePayments - Stamdata!F1105 = Stamdata!F1106 ,0,1),0)+AssertionId(\"valueAssertion_NotesRemunerationExecutiveSeniorOfficialsFrom13MonthSpecification_PrtFST102Variables1\")","Stamdata!F1106"]
["KvK: Jaarverantwoording 2023 NLGAAP - kleine rechtspersonen - publicatiestukken","valueAssertion_NotesRemunerationExecutiveSeniorOfficialsFrom13MonthSpecification_PrtFST102Variables1","`Remuneration` SHOULD be equal to + `RemunerationUnduePayments` - `UnduePayments`. ","non-blocking","IF(OR(not(Stamdata!G1106UnduePayments=\"\"),not(Stamdata!G1105=\"\")),IF(+ Stamdata!G1106UnduePayments - Stamdata!G1105 = Stamdata!G1106 ,0,1),0)+AssertionId(\"valueAssertion_NotesRemunerationExecutiveSeniorOfficialsFrom13MonthSpecification_PrtFST102Variables1\")","Stamdata!G1106"]
["KvK: Jaarverantwoording 2023 NLGAAP - kleine rechtspersonen - publicatiestukken","valueAssertion_NotesRemunerationExecutiveSeniorOfficialsFrom13MonthSpecification_PrtFST102Variables1","`Remuneration` SHOULD be equal to + `RemunerationUnduePayments` - `UnduePayments`. ","non-blocking","IF(OR(not(Stamdata!H1106UnduePayments=\"\"),not(Stamdata!H1105=\"\")),IF(+ Stamdata!H1106UnduePayments - Stamdata!H1105 = Stamdata!H1106 ,0,1),0)+AssertionId(\"valueAssertion_NotesRemunerationExecutiveSeniorOfficialsFrom13MonthSpecification_PrtFST102Variables1\")","Stamdata!H1106"]
["KvK: Jaarverantwoording 2023 NLGAAP - kleine rechtspersonen - publicatiestukken","valueAssertion_NotesRemunerationExecutiveSeniorOfficialsFrom13MonthSpecification_PrtFST102Variables2","`AmountExceedingMaximumRemuneration` SHOULD be equal to + `RemunerationUnduePayments` - `IndividualMaximumRemuneration`. ","non-blocking","IF(OR(not(Stamdata!D1103=\"\"),not(Stamdata!D1104=\"\")),IF(+ Stamdata!D1103 - Stamdata!D1104 = Stamdata!D1107 ,0,1),0)+AssertionId(\"valueAssertion_NotesRemunerationExecutiveSeniorOfficialsFrom13MonthSpecification_PrtFST102Variables2\")","Stamdata!D1107"]
["KvK: Jaarverantwoording 2023 NLGAAP - kleine rechtspersonen - publicatiestukken","valueAssertion_NotesRemunerationExecutiveSeniorOfficialsFrom13MonthSpecification_PrtFST102Variables2","`AmountExceedingMaximumRemuneration` SHOULD be equal to + `RemunerationUnduePayments` - `IndividualMaximumRemuneration`. ","non-blocking","IF(OR(not(Stamdata!E1103=\"\"),not(Stamdata!E1104=\"\")),IF(+ Stamdata!E1103 - Stamdata!E1104 = Stamdata!E1107 ,0,1),0)+AssertionId(\"valueAssertion_NotesRemunerationExecutiveSeniorOfficialsFrom13MonthSpecification_PrtFST102Variables2\")","Stamdata!E1107"]
["KvK: Jaarverantwoording 2023 NLGAAP - kleine rechtspersonen - publicatiestukken","valueAssertion_NotesRemunerationExecutiveSeniorOfficialsFrom13MonthSpecification_PrtFST102Variables2","`AmountExceedingMaximumRemuneration` SHOULD be equal to + `RemunerationUnduePayments` - `IndividualMaximumRemuneration`. ","non-blocking","IF(OR(not(Stamdata!F1103=\"\"),not(Stamdata!F1104=\"\")),IF(+ Stamdata!F1103 - Stamdata!F1104 = Stamdata!F1107 ,0,1),0)+AssertionId(\"valueAssertion_NotesRemunerationExecutiveSeniorOfficialsFrom13MonthSpecification_PrtFST102Variables2\")","Stamdata!F1107"]
["KvK: Jaarverantwoording 2023 NLGAAP - kleine rechtspersonen - publicatiestukken","valueAssertion_NotesRemunerationExecutiveSeniorOfficialsFrom13MonthSpecification_PrtFST102Variables2","`AmountExceedingMaximumRemuneration` SHOULD be equal to + `RemunerationUnduePayments` - `IndividualMaximumRemuneration`. ","non-blocking","IF(OR(not(Stamdata!G1103=\"\"),not(Stamdata!G1104=\"\")),IF(+ Stamdata!G1103 - Stamdata!G1104 = Stamdata!G1107 ,0,1),0)+AssertionId(\"valueAssertion_NotesRemunerationExecutiveSeniorOfficialsFrom13MonthSpecification_PrtFST102Variables2\")","Stamdata!G1107"]
["KvK: Jaarverantwoording 2023 NLGAAP - kleine rechtspersonen - publicatiestukken","valueAssertion_NotesRemunerationExecutiveSeniorOfficialsFrom13MonthSpecification_PrtFST102Variables2","`AmountExceedingMaximumRemuneration` SHOULD be equal to + `RemunerationUnduePayments` - `IndividualMaximumRemuneration`. ","non-blocking","IF(OR(not(Stamdata!H1103=\"\"),not(Stamdata!H1104=\"\")),IF(+ Stamdata!H1103 - Stamdata!H1104 = Stamdata!H1107 ,0,1),0)+AssertionId(\"valueAssertion_NotesRemunerationExecutiveSeniorOfficialsFrom13MonthSpecification_PrtFST102Variables2\")","Stamdata!H1107"]
["KvK: Jaarverantwoording 2023 NLGAAP - kleine rechtspersonen - publicatiestukken","valueAssertion_NotesRemunerationExecutiveSeniorOfficialsWithoutEmployment12MonthsSpecification_PrtFST102Variables1","`Remuneration` SHOULD be equal to + `TotalRemunerationDuringFinancialYear` - `UnduePayments`. ","non-blocking","IF(OR(not(Stamdata!D1149=\"\"),not(Stamdata!D1150=\"\")),IF(+ Stamdata!D1149 - Stamdata!D1150 = Stamdata!D1151 ,0,1),0)+AssertionId(\"valueAssertion_NotesRemunerationExecutiveSeniorOfficialsWithoutEmployment12MonthsSpecification_PrtFST102Variables1\")","Stamdata!D1151"]
["KvK: Jaarverantwoording 2023 NLGAAP - kleine rechtspersonen - publicatiestukken","valueAssertion_NotesRemunerationExecutiveSeniorOfficialsWithoutEmployment12MonthsSpecification_PrtFST102Variables1","`Remuneration` SHOULD be equal to + `TotalRemunerationDuringFinancialYear` - `UnduePayments`. ","non-blocking","IF(OR(not(Stamdata!E1149=\"\"),not(Stamdata!E1150=\"\")),IF(+ Stamdata!E1149 - Stamdata!E1150 = Stamdata!E1151 ,0,1),0)+AssertionId(\"valueAssertion_NotesRemunerationExecutiveSeniorOfficialsWithoutEmployment12MonthsSpecification_PrtFST102Variables1\")","Stamdata!E1151"]
["KvK: Jaarverantwoording 2023 NLGAAP - kleine rechtspersonen - publicatiestukken","valueAssertion_NotesRemunerationExecutiveSeniorOfficialsWithoutEmployment12MonthsSpecification_PrtFST102Variables1","`Remuneration` SHOULD be equal to + `TotalRemunerationDuringFinancialYear` - `UnduePayments`. ","non-blocking","IF(OR(not(Stamdata!F1149=\"\"),not(Stamdata!F1150=\"\")),IF(+ Stamdata!F1149 - Stamdata!F1150 = Stamdata!F1151 ,0,1),0)+AssertionId(\"valueAssertion_NotesRemunerationExecutiveSeniorOfficialsWithoutEmployment12MonthsSpecification_PrtFST102Variables1\")","Stamdata!F1151"]
["KvK: Jaarverantwoording 2023 NLGAAP - kleine rechtspersonen - publicatiestukken","valueAssertion_NotesRemunerationExecutiveSeniorOfficialsWithoutEmployment12MonthsSpecification_PrtFST102Variables1","`Remuneration` SHOULD be equal to + `TotalRemunerationDuringFinancialYear` - `UnduePayments`. ","non-blocking","IF(OR(not(Stamdata!G1149=\"\"),not(Stamdata!G1150=\"\")),IF(+ Stamdata!G1149 - Stamdata!G1150 = Stamdata!G1151 ,0,1),0)+AssertionId(\"valueAssertion_NotesRemunerationExecutiveSeniorOfficialsWithoutEmployment12MonthsSpecification_PrtFST102Variables1\")","Stamdata!G1151"]
["KvK: Jaarverantwoording 2023 NLGAAP - kleine rechtspersonen - publicatiestukken","valueAssertion_NotesRemunerationExecutiveSeniorOfficialsWithoutEmployment12MonthsSpecification_PrtFST102Variables1","`Remuneration` SHOULD be equal to + `TotalRemunerationDuringFinancialYear` - `UnduePayments`. ","non-blocking","IF(OR(not(Stamdata!H1149=\"\"),not(Stamdata!H1150=\"\")),IF(+ Stamdata!H1149 - Stamdata!H1150 = Stamdata!H1151 ,0,1),0)+AssertionId(\"valueAssertion_NotesRemunerationExecutiveSeniorOfficialsWithoutEmployment12MonthsSpecification_PrtFST102Variables1\")","Stamdata!H1151"]
["KvK: Jaarverantwoording 2023 NLGAAP - kleine rechtspersonen - publicatiestukken","valueAssertion_NotesRemunerationExecutiveSeniorOfficialsWithoutEmployment12MonthsSpecification_PrtFST102Variables1","`Remuneration` SHOULD be equal to + `TotalRemunerationDuringFinancialYear` - `UnduePayments`. ","non-blocking","IF(OR(not(Stamdata!D1175=\"\"),not(Stamdata!D1176=\"\")),IF(+ Stamdata!D1175 - Stamdata!D1176 = Stamdata!D1177 ,0,1),0)+AssertionId(\"valueAssertion_NotesRemunerationExecutiveSeniorOfficialsWithoutEmployment12MonthsSpecification_PrtFST102Variables1\")","Stamdata!D1177"]
["KvK: Jaarverantwoording 2023 NLGAAP - kleine rechtspersonen - publicatiestukken","valueAssertion_NotesRemunerationExecutiveSeniorOfficialsWithoutEmployment12MonthsSpecification_PrtFST102Variables1","`Remuneration` SHOULD be equal to + `TotalRemunerationDuringFinancialYear` - `UnduePayments`. ","non-blocking","IF(OR(not(Stamdata!E1175=\"\"),not(Stamdata!E1176=\"\")),IF(+ Stamdata!E1175 - Stamdata!E1176 = Stamdata!E1177 ,0,1),0)+AssertionId(\"valueAssertion_NotesRemunerationExecutiveSeniorOfficialsWithoutEmployment12MonthsSpecification_PrtFST102Variables1\")","Stamdata!E1177"]
["KvK: Jaarverantwoording 2023 NLGAAP - kleine rechtspersonen - publicatiestukken","valueAssertion_NotesRemunerationExecutiveSeniorOfficialsWithoutEmployment12MonthsSpecification_PrtFST102Variables1","`Remuneration` SHOULD be equal to + `TotalRemunerationDuringFinancialYear` - `UnduePayments`. ","non-blocking","IF(OR(not(Stamdata!F1175=\"\"),not(Stamdata!F1176=\"\")),IF(+ Stamdata!F1175 - Stamdata!F1176 = Stamdata!F1177 ,0,1),0)+AssertionId(\"valueAssertion_NotesRemunerationExecutiveSeniorOfficialsWithoutEmployment12MonthsSpecification_PrtFST102Variables1\")","Stamdata!F1177"]
["KvK: Jaarverantwoording 2023 NLGAAP - kleine rechtspersonen - publicatiestukken","valueAssertion_NotesRemunerationExecutiveSeniorOfficialsWithoutEmployment12MonthsSpecification_PrtFST102Variables1","`Remuneration` SHOULD be equal to + `TotalRemunerationDuringFinancialYear` - `UnduePayments`. ","non-blocking","IF(OR(not(Stamdata!G1175=\"\"),not(Stamdata!G1176=\"\")),IF(+ Stamdata!G1175 - Stamdata!G1176 = Stamdata!G1177 ,0,1),0)+AssertionId(\"valueAssertion_NotesRemunerationExecutiveSeniorOfficialsWithoutEmployment12MonthsSpecification_PrtFST102Variables1\")","Stamdata!G1177"]
["KvK: Jaarverantwoording 2023 NLGAAP - kleine rechtspersonen - publicatiestukken","valueAssertion_NotesRemunerationExecutiveSeniorOfficialsWithoutEmployment12MonthsSpecification_PrtFST102Variables1","`Remuneration` SHOULD be equal to + `TotalRemunerationDuringFinancialYear` - `UnduePayments`. ","non-blocking","IF(OR(not(Stamdata!H1175=\"\"),not(Stamdata!H1176=\"\")),IF(+ Stamdata!H1175 - Stamdata!H1176 = Stamdata!H1177 ,0,1),0)+AssertionId(\"valueAssertion_NotesRemunerationExecutiveSeniorOfficialsWithoutEmployment12MonthsSpecification_PrtFST102Variables1\")","Stamdata!H1177"]
["KvK: Jaarverantwoording 2023 NLGAAP - kleine rechtspersonen - publicatiestukken","valueAssertion_NotesRemunerationExecutiveSeniorOfficialsWithoutEmployment12MonthsSpecification_PrtFST102Variables2","`AmountExceedingMaximumRemuneration` SHOULD be equal to + `TotalRemunerationDuringFinancialYear` - `IndividualMaximumDuringFinancialYear`. ","non-blocking","IF(OR(not(Stamdata!D1149=\"\"),not(Stamdata!D1147=\"\")),IF(+ Stamdata!D1149 - Stamdata!D1147 = Stamdata!D1152 ,0,1),0)+AssertionId(\"valueAssertion_NotesRemunerationExecutiveSeniorOfficialsWithoutEmployment12MonthsSpecification_PrtFST102Variables2\")","Stamdata!D1152"]
["KvK: Jaarverantwoording 2023 NLGAAP - kleine rechtspersonen - publicatiestukken","valueAssertion_NotesRemunerationExecutiveSeniorOfficialsWithoutEmployment12MonthsSpecification_PrtFST102Variables2","`AmountExceedingMaximumRemuneration` SHOULD be equal to + `TotalRemunerationDuringFinancialYear` - `IndividualMaximumDuringFinancialYear`. ","non-blocking","IF(OR(not(Stamdata!E1149=\"\"),not(Stamdata!E1147=\"\")),IF(+ Stamdata!E1149 - Stamdata!E1147 = Stamdata!E1152 ,0,1),0)+AssertionId(\"valueAssertion_NotesRemunerationExecutiveSeniorOfficialsWithoutEmployment12MonthsSpecification_PrtFST102Variables2\")","Stamdata!E1152"]
["KvK: Jaarverantwoording 2023 NLGAAP - kleine rechtspersonen - publicatiestukken","valueAssertion_NotesRemunerationExecutiveSeniorOfficialsWithoutEmployment12MonthsSpecification_PrtFST102Variables2","`AmountExceedingMaximumRemuneration` SHOULD be equal to + `TotalRemunerationDuringFinancialYear` - `IndividualMaximumDuringFinancialYear`. ","non-blocking","IF(OR(not(Stamdata!F1149=\"\"),not(Stamdata!F1147=\"\")),IF(+ Stamdata!F1149 - Stamdata!F1147 = Stamdata!F1152 ,0,1),0)+AssertionId(\"valueAssertion_NotesRemunerationExecutiveSeniorOfficialsWithoutEmployment12MonthsSpecification_PrtFST102Variables2\")","Stamdata!F1152"]
["KvK: Jaarverantwoording 2023 NLGAAP - kleine rechtspersonen - publicatiestukken","valueAssertion_NotesRemunerationExecutiveSeniorOfficialsWithoutEmployment12MonthsSpecification_PrtFST102Variables2","`AmountExceedingMaximumRemuneration` SHOULD be equal to + `TotalRemunerationDuringFinancialYear` - `IndividualMaximumDuringFinancialYear`. ","non-blocking","IF(OR(not(Stamdata!G1149=\"\"),not(Stamdata!G1147=\"\")),IF(+ Stamdata!G1149 - Stamdata!G1147 = Stamdata!G1152 ,0,1),0)+AssertionId(\"valueAssertion_NotesRemunerationExecutiveSeniorOfficialsWithoutEmployment12MonthsSpecification_PrtFST102Variables2\")","Stamdata!G1152"]
["KvK: Jaarverantwoording 2023 NLGAAP - kleine rechtspersonen - publicatiestukken","valueAssertion_NotesRemunerationExecutiveSeniorOfficialsWithoutEmployment12MonthsSpecification_PrtFST102Variables2","`AmountExceedingMaximumRemuneration` SHOULD be equal to + `TotalRemunerationDuringFinancialYear` - `IndividualMaximumDuringFinancialYear`. ","non-blocking","IF(OR(not(Stamdata!H1149=\"\"),not(Stamdata!H1147=\"\")),IF(+ Stamdata!H1149 - Stamdata!H1147 = Stamdata!H1152 ,0,1),0)+AssertionId(\"valueAssertion_NotesRemunerationExecutiveSeniorOfficialsWithoutEmployment12MonthsSpecification_PrtFST102Variables2\")","Stamdata!H1152"]
["KvK: Jaarverantwoording 2023 NLGAAP - kleine rechtspersonen - publicatiestukken","valueAssertion_NotesRemunerationExecutiveSeniorOfficialsWithoutEmployment12MonthsSpecification_PrtFST102Variables2","`AmountExceedingMaximumRemuneration` SHOULD be equal to + `TotalRemunerationDuringFinancialYear` - `IndividualMaximumDuringFinancialYear`. ","non-blocking","IF(OR(not(Stamdata!D1175=\"\"),not(Stamdata!D1173=\"\")),IF(+ Stamdata!D1175 - Stamdata!D1173 = Stamdata!D1178 ,0,1),0)+AssertionId(\"valueAssertion_NotesRemunerationExecutiveSeniorOfficialsWithoutEmployment12MonthsSpecification_PrtFST102Variables2\")","Stamdata!D1178"]
["KvK: Jaarverantwoording 2023 NLGAAP - kleine rechtspersonen - publicatiestukken","valueAssertion_NotesRemunerationExecutiveSeniorOfficialsWithoutEmployment12MonthsSpecification_PrtFST102Variables2","`AmountExceedingMaximumRemuneration` SHOULD be equal to + `TotalRemunerationDuringFinancialYear` - `IndividualMaximumDuringFinancialYear`. ","non-blocking","IF(OR(not(Stamdata!E1175=\"\"),not(Stamdata!E1173=\"\")),IF(+ Stamdata!E1175 - Stamdata!E1173 = Stamdata!E1178 ,0,1),0)+AssertionId(\"valueAssertion_NotesRemunerationExecutiveSeniorOfficialsWithoutEmployment12MonthsSpecification_PrtFST102Variables2\")","Stamdata!E1178"]
["KvK: Jaarverantwoording 2023 NLGAAP - kleine rechtspersonen - publicatiestukken","valueAssertion_NotesRemunerationExecutiveSeniorOfficialsWithoutEmployment12MonthsSpecification_PrtFST102Variables2","`AmountExceedingMaximumRemuneration` SHOULD be equal to + `TotalRemunerationDuringFinancialYear` - `IndividualMaximumDuringFinancialYear`. ","non-blocking","IF(OR(not(Stamdata!F1175=\"\"),not(Stamdata!F1173=\"\")),IF(+ Stamdata!F1175 - Stamdata!F1173 = Stamdata!F1178 ,0,1),0)+AssertionId(\"valueAssertion_NotesRemunerationExecutiveSeniorOfficialsWithoutEmployment12MonthsSpecification_PrtFST102Variables2\")","Stamdata!F1178"]
["KvK: Jaarverantwoording 2023 NLGAAP - kleine rechtspersonen - publicatiestukken","valueAssertion_NotesRemunerationExecutiveSeniorOfficialsWithoutEmployment12MonthsSpecification_PrtFST102Variables2","`AmountExceedingMaximumRemuneration` SHOULD be equal to + `TotalRemunerationDuringFinancialYear` - `IndividualMaximumDuringFinancialYear`. ","non-blocking","IF(OR(not(Stamdata!G1175=\"\"),not(Stamdata!G1173=\"\")),IF(+ Stamdata!G1175 - Stamdata!G1173 = Stamdata!G1178 ,0,1),0)+AssertionId(\"valueAssertion_NotesRemunerationExecutiveSeniorOfficialsWithoutEmployment12MonthsSpecification_PrtFST102Variables2\")","Stamdata!G1178"]
["KvK: Jaarverantwoording 2023 NLGAAP - kleine rechtspersonen - publicatiestukken","valueAssertion_NotesRemunerationExecutiveSeniorOfficialsWithoutEmployment12MonthsSpecification_PrtFST102Variables2","`AmountExceedingMaximumRemuneration` SHOULD be equal to + `TotalRemunerationDuringFinancialYear` - `IndividualMaximumDuringFinancialYear`. ","non-blocking","IF(OR(not(Stamdata!H1175=\"\"),not(Stamdata!H1173=\"\")),IF(+ Stamdata!H1175 - Stamdata!H1173 = Stamdata!H1178 ,0,1),0)+AssertionId(\"valueAssertion_NotesRemunerationExecutiveSeniorOfficialsWithoutEmployment12MonthsSpecification_PrtFST102Variables2\")","Stamdata!H1178"]
["KvK: Jaarverantwoording 2023 NLGAAP - kleine rechtspersonen - publicatiestukken","valueAssertion_NotesRemunerationOfExecutiveSeniorOfficialsConsideredFourYearsSpecification_PrtFST1SumOfChildrenParentDebit1","`SubtotalRemuneration` SHOULD be equal to the summation of the underlying values. ","non-blocking","IF(OR(not(Stamdata!D1266=\"\"),not(AND(Stamdata!D1263=\"\",Stamdata!D1264=\"\",Stamdata!D1265=\"\"))),IF( Stamdata!D1268 = - Stamdata!D1266+ sum(Stamdata!D1263,Stamdata!D1264,Stamdata!D1265),0,1),0)+AssertionId(\"valueAssertion_NotesRemunerationOfExecutiveSeniorOfficialsConsideredFourYearsSpecification_PrtFST1SumOfChildrenParentDebit1\")","Stamdata!D1268"]
["KvK: Jaarverantwoording 2023 NLGAAP - kleine rechtspersonen - publicatiestukken","valueAssertion_NotesRemunerationOfExecutiveSeniorOfficialsConsideredFourYearsSpecification_PrtFST1SumOfChildrenParentDebit1","`SubtotalRemuneration` SHOULD be equal to the summation of the underlying values. ","non-blocking","IF(OR(not(Stamdata!E1266=\"\"),not(AND(Stamdata!E1263=\"\",Stamdata!E1264=\"\",Stamdata!E1265=\"\"))),IF( Stamdata!E1268 = - Stamdata!E1266+ sum(Stamdata!E1263,Stamdata!E1264,Stamdata!E1265),0,1),0)+AssertionId(\"valueAssertion_NotesRemunerationOfExecutiveSeniorOfficialsConsideredFourYearsSpecification_PrtFST1SumOfChildrenParentDebit1\")","Stamdata!E1268"]
["KvK: Jaarverantwoording 2023 NLGAAP - kleine rechtspersonen - publicatiestukken","valueAssertion_NotesRemunerationOfExecutiveSeniorOfficialsConsideredFourYearsSpecification_PrtFST1SumOfChildrenParentDebit1","`SubtotalRemuneration` SHOULD be equal to the summation of the underlying values. ","non-blocking","IF(OR(not(Stamdata!F1266=\"\"),not(AND(Stamdata!F1263=\"\",Stamdata!F1264=\"\",Stamdata!F1265=\"\"))),IF( Stamdata!F1268 = - Stamdata!F1266+ sum(Stamdata!F1263,Stamdata!F1264,Stamdata!F1265),0,1),0)+AssertionId(\"valueAssertion_NotesRemunerationOfExecutiveSeniorOfficialsConsideredFourYearsSpecification_PrtFST1SumOfChildrenParentDebit1\")","Stamdata!F1268"]
["KvK: Jaarverantwoording 2023 NLGAAP - kleine rechtspersonen - publicatiestukken","valueAssertion_NotesRemunerationOfExecutiveSeniorOfficialsConsideredFourYearsSpecification_PrtFST1SumOfChildrenParentDebit1","`SubtotalRemuneration` SHOULD be equal to the summation of the underlying values. ","non-blocking","IF(OR(not(Stamdata!G1266=\"\"),not(AND(Stamdata!G1263=\"\",Stamdata!G1264=\"\",Stamdata!G1265=\"\"))),IF( Stamdata!G1268 = - Stamdata!G1266+ sum(Stamdata!G1263,Stamdata!G1264,Stamdata!G1265),0,1),0)+AssertionId(\"valueAssertion_NotesRemunerationOfExecutiveSeniorOfficialsConsideredFourYearsSpecification_PrtFST1SumOfChildrenParentDebit1\")","Stamdata!G1268"]
["KvK: Jaarverantwoording 2023 NLGAAP - kleine rechtspersonen - publicatiestukken","valueAssertion_NotesRemunerationOfExecutiveSeniorOfficialsConsideredFourYearsSpecification_PrtFST1SumOfChildrenParentDebit1","`SubtotalRemuneration` SHOULD be equal to the summation of the underlying values. ","non-blocking","IF(OR(not(Stamdata!H1266=\"\"),not(AND(Stamdata!H1263=\"\",Stamdata!H1264=\"\",Stamdata!H1265=\"\"))),IF( Stamdata!H1268 = - Stamdata!H1266+ sum(Stamdata!H1263,Stamdata!H1264,Stamdata!H1265),0,1),0)+AssertionId(\"valueAssertion_NotesRemunerationOfExecutiveSeniorOfficialsConsideredFourYearsSpecification_PrtFST1SumOfChildrenParentDebit1\")","Stamdata!H1268"]
["KvK: Jaarverantwoording 2023 NLGAAP - kleine rechtspersonen - publicatiestukken","valueAssertion_NotesRemunerationOfNonSeniorOfficialsSpecification_PrtFST1SumOfChildrenParentDebit1T1","`Remuneration` SHOULD be equal to the summation of the underlying values. ","non-blocking","IF(OR(not(0=0),not(AND(Stamdata!D1192=\"\",Stamdata!D1193=\"\"))),IF( Stamdata!D1195 = + sum(Stamdata!D1192,Stamdata!D1193),0,1),0)+AssertionId(\"valueAssertion_NotesRemunerationOfNonSeniorOfficialsSpecification_PrtFST1SumOfChildrenParentDebit1T1\")","Stamdata!D1195"]
["KvK: Jaarverantwoording 2023 NLGAAP - kleine rechtspersonen - publicatiestukken","valueAssertion_NotesRemunerationOfNonSeniorOfficialsSpecification_PrtFST1SumOfChildrenParentDebit1T1","`Remuneration` SHOULD be equal to the summation of the underlying values. ","non-blocking","IF(OR(not(0=0),not(AND(Stamdata!E1192=\"\",Stamdata!E1193=\"\"))),IF( Stamdata!E1195 = + sum(Stamdata!E1192,Stamdata!E1193),0,1),0)+AssertionId(\"valueAssertion_NotesRemunerationOfNonSeniorOfficialsSpecification_PrtFST1SumOfChildrenParentDebit1T1\")","Stamdata!E1195"]
["KvK: Jaarverantwoording 2023 NLGAAP - kleine rechtspersonen - publicatiestukken","valueAssertion_NotesRemunerationOfNonSeniorOfficialsSpecification_PrtFST1SumOfChildrenParentDebit1T1","`Remuneration` SHOULD be equal to the summation of the underlying values. ","non-blocking","IF(OR(not(0=0),not(AND(Stamdata!F1192=\"\",Stamdata!F1193=\"\"))),IF( Stamdata!F1195 = + sum(Stamdata!F1192,Stamdata!F1193),0,1),0)+AssertionId(\"valueAssertion_NotesRemunerationOfNonSeniorOfficialsSpecification_PrtFST1SumOfChildrenParentDebit1T1\")","Stamdata!F1195"]
["KvK: Jaarverantwoording 2023 NLGAAP - kleine rechtspersonen - publicatiestukken","valueAssertion_NotesRemunerationOfNonSeniorOfficialsSpecification_PrtFST1SumOfChildrenParentDebit1T1","`Remuneration` SHOULD be equal to the summation of the underlying values. ","non-blocking","IF(OR(not(0=0),not(AND(Stamdata!G1192=\"\",Stamdata!G1193=\"\"))),IF( Stamdata!G1195 = + sum(Stamdata!G1192,Stamdata!G1193),0,1),0)+AssertionId(\"valueAssertion_NotesRemunerationOfNonSeniorOfficialsSpecification_PrtFST1SumOfChildrenParentDebit1T1\")","Stamdata!G1195"]
["KvK: Jaarverantwoording 2023 NLGAAP - kleine rechtspersonen - publicatiestukken","valueAssertion_NotesRemunerationOfNonSeniorOfficialsSpecification_PrtFST1SumOfChildrenParentDebit1T1","`Remuneration` SHOULD be equal to the summation of the underlying values. ","non-blocking","IF(OR(not(0=0),not(AND(Stamdata!H1192=\"\",Stamdata!H1193=\"\"))),IF( Stamdata!H1195 = + sum(Stamdata!H1192,Stamdata!H1193),0,1),0)+AssertionId(\"valueAssertion_NotesRemunerationOfNonSeniorOfficialsSpecification_PrtFST1SumOfChildrenParentDebit1T1\")","Stamdata!H1195"]
["KvK: Jaarverantwoording 2023 NLGAAP - kleine rechtspersonen - publicatiestukken","valueAssertion_NotesRemunerationOfSupervisorySeniorOfficialsSpecification_PrtFST102Variables1","`AmountExceedingMaximumRemuneration` SHOULD be equal to + `Remuneration` - `IndividualMaximumRemuneration`. ","non-blocking","IF(OR(not(Stamdata!D1227=\"\"),not(Stamdata!D1225=\"\")),IF(+ Stamdata!D1227 - Stamdata!D1225 = Stamdata!D1228 ,0,1),0)+AssertionId(\"valueAssertion_NotesRemunerationOfSupervisorySeniorOfficialsSpecification_PrtFST102Variables1\")","Stamdata!D1228"]
["KvK: Jaarverantwoording 2023 NLGAAP - kleine rechtspersonen - publicatiestukken","valueAssertion_NotesRemunerationOfSupervisorySeniorOfficialsSpecification_PrtFST102Variables1","`AmountExceedingMaximumRemuneration` SHOULD be equal to + `Remuneration` - `IndividualMaximumRemuneration`. ","non-blocking","IF(OR(not(Stamdata!E1227=\"\"),not(Stamdata!E1225=\"\")),IF(+ Stamdata!E1227 - Stamdata!E1225 = Stamdata!E1228 ,0,1),0)+AssertionId(\"valueAssertion_NotesRemunerationOfSupervisorySeniorOfficialsSpecification_PrtFST102Variables1\")","Stamdata!E1228"]
["KvK: Jaarverantwoording 2023 NLGAAP - kleine rechtspersonen - publicatiestukken","valueAssertion_NotesRemunerationOfSupervisorySeniorOfficialsSpecification_PrtFST102Variables1","`AmountExceedingMaximumRemuneration` SHOULD be equal to + `Remuneration` - `IndividualMaximumRemuneration`. ","non-blocking","IF(OR(not(Stamdata!F1227=\"\"),not(Stamdata!F1225=\"\")),IF(+ Stamdata!F1227 - Stamdata!F1225 = Stamdata!F1228 ,0,1),0)+AssertionId(\"valueAssertion_NotesRemunerationOfSupervisorySeniorOfficialsSpecification_PrtFST102Variables1\")","Stamdata!F1228"]
["KvK: Jaarverantwoording 2023 NLGAAP - kleine rechtspersonen - publicatiestukken","valueAssertion_NotesRemunerationOfSupervisorySeniorOfficialsSpecification_PrtFST102Variables1","`AmountExceedingMaximumRemuneration` SHOULD be equal to + `Remuneration` - `IndividualMaximumRemuneration`. ","non-blocking","IF(OR(not(Stamdata!G1227=\"\"),not(Stamdata!G1225=\"\")),IF(+ Stamdata!G1227 - Stamdata!G1225 = Stamdata!G1228 ,0,1),0)+AssertionId(\"valueAssertion_NotesRemunerationOfSupervisorySeniorOfficialsSpecification_PrtFST102Variables1\")","Stamdata!G1228"]
["KvK: Jaarverantwoording 2023 NLGAAP - kleine rechtspersonen - publicatiestukken","valueAssertion_NotesRemunerationOfSupervisorySeniorOfficialsSpecification_PrtFST102Variables1","`AmountExceedingMaximumRemuneration` SHOULD be equal to + `Remuneration` - `IndividualMaximumRemuneration`. ","non-blocking","IF(OR(not(Stamdata!H1227=\"\"),not(Stamdata!H1225=\"\")),IF(+ Stamdata!H1227 - Stamdata!H1225 = Stamdata!H1228 ,0,1),0)+AssertionId(\"valueAssertion_NotesRemunerationOfSupervisorySeniorOfficialsSpecification_PrtFST102Variables1\")","Stamdata!H1228"]
["KvK: Jaarverantwoording 2023 NLGAAP - kleine rechtspersonen - publicatiestukken","valueAssertion_NotesRemunerationOfSupervisorySeniorOfficialsSpecification_PrtFST102Variables2","`Remuneration` SHOULD be equal to + `RemunerationUnduePayments` - `UnduePayments`. ","non-blocking","IF(OR(not(Stamdata!D1227UnduePayments=\"\"),not(Stamdata!D1226=\"\")),IF(+ Stamdata!D1227UnduePayments - Stamdata!D1226 = Stamdata!D1227 ,0,1),0)+AssertionId(\"valueAssertion_NotesRemunerationOfSupervisorySeniorOfficialsSpecification_PrtFST102Variables2\")","Stamdata!D1227"]
["KvK: Jaarverantwoording 2023 NLGAAP - kleine rechtspersonen - publicatiestukken","valueAssertion_NotesRemunerationOfSupervisorySeniorOfficialsSpecification_PrtFST102Variables2","`Remuneration` SHOULD be equal to + `RemunerationUnduePayments` - `UnduePayments`. ","non-blocking","IF(OR(not(Stamdata!E1227UnduePayments=\"\"),not(Stamdata!E1226=\"\")),IF(+ Stamdata!E1227UnduePayments - Stamdata!E1226 = Stamdata!E1227 ,0,1),0)+AssertionId(\"valueAssertion_NotesRemunerationOfSupervisorySeniorOfficialsSpecification_PrtFST102Variables2\")","Stamdata!E1227"]
["KvK: Jaarverantwoording 2023 NLGAAP - kleine rechtspersonen - publicatiestukken","valueAssertion_NotesRemunerationOfSupervisorySeniorOfficialsSpecification_PrtFST102Variables2","`Remuneration` SHOULD be equal to + `RemunerationUnduePayments` - `UnduePayments`. ","non-blocking","IF(OR(not(Stamdata!F1227UnduePayments=\"\"),not(Stamdata!F1226=\"\")),IF(+ Stamdata!F1227UnduePayments - Stamdata!F1226 = Stamdata!F1227 ,0,1),0)+AssertionId(\"valueAssertion_NotesRemunerationOfSupervisorySeniorOfficialsSpecification_PrtFST102Variables2\")","Stamdata!F1227"]
["KvK: Jaarverantwoording 2023 NLGAAP - kleine rechtspersonen - publicatiestukken","valueAssertion_NotesRemunerationOfSupervisorySeniorOfficialsSpecification_PrtFST102Variables2","`Remuneration` SHOULD be equal to + `RemunerationUnduePayments` - `UnduePayments`. ","non-blocking","IF(OR(not(Stamdata!G1227UnduePayments=\"\"),not(Stamdata!G1226=\"\")),IF(+ Stamdata!G1227UnduePayments - Stamdata!G1226 = Stamdata!G1227 ,0,1),0)+AssertionId(\"valueAssertion_NotesRemunerationOfSupervisorySeniorOfficialsSpecification_PrtFST102Variables2\")","Stamdata!G1227"]
["KvK: Jaarverantwoording 2023 NLGAAP - kleine rechtspersonen - publicatiestukken","valueAssertion_NotesRemunerationOfSupervisorySeniorOfficialsSpecification_PrtFST102Variables2","`Remuneration` SHOULD be equal to + `RemunerationUnduePayments` - `UnduePayments`. ","non-blocking","IF(OR(not(Stamdata!H1227UnduePayments=\"\"),not(Stamdata!H1226=\"\")),IF(+ Stamdata!H1227UnduePayments - Stamdata!H1226 = Stamdata!H1227 ,0,1),0)+AssertionId(\"valueAssertion_NotesRemunerationOfSupervisorySeniorOfficialsSpecification_PrtFST102Variables2\")","Stamdata!H1227"]
["KvK: Jaarverantwoording 2023 NLGAAP - kleine rechtspersonen - publicatiestukken","valueAssertion_NotesRevaluationReserveStatementOfChanges_PrtExistenceThnExistence1E1","`AdjustedRevaluationReserveAfterRecalculationChangeAccountingPolicies` SHOULD exist at least once within the same context, because `RevaluationReserveChangeAccountingPolicies` is reported. ","non-blocking","IF(not(Stamdata!D747=\"\"),0,1)+AssertionId(\"valueAssertion_NotesRevaluationReserveStatementOfChanges_PrtExistenceThnExistence1E1\")","Stamdata!D747"]
["KvK: Jaarverantwoording 2023 NLGAAP - kleine rechtspersonen - publicatiestukken","valueAssertion_NotesRevaluationReserveStatementOfChanges_PrtExistenceThnExistence1E1","`AdjustedRevaluationReserveAfterRecalculationChangeAccountingPolicies` SHOULD exist at least once within the same context, because `RevaluationReserveChangeAccountingPolicies` is reported. ","non-blocking","IF(not(Stamdata!E747=\"\"),0,1)+AssertionId(\"valueAssertion_NotesRevaluationReserveStatementOfChanges_PrtExistenceThnExistence1E1\")","Stamdata!E747"]
["KvK: Jaarverantwoording 2023 NLGAAP - kleine rechtspersonen - publicatiestukken","valueAssertion_NotesRevaluationReserveStatementOfChanges_PrtExistenceThnExistence1E1","`AdjustedRevaluationReserveAfterRecalculationChangeAccountingPolicies` SHOULD exist at least once within the same context, because `RevaluationReserveChangeAccountingPolicies` is reported. ","non-blocking","IF(not(Stamdata!F747=\"\"),0,1)+AssertionId(\"valueAssertion_NotesRevaluationReserveStatementOfChanges_PrtExistenceThnExistence1E1\")","Stamdata!F747"]
["KvK: Jaarverantwoording 2023 NLGAAP - kleine rechtspersonen - publicatiestukken","valueAssertion_NotesRevaluationReserveStatementOfChanges_PrtExistenceThnExistence1E1","`AdjustedRevaluationReserveAfterRecalculationChangeAccountingPolicies` SHOULD exist at least once within the same context, because `RevaluationReserveChangeAccountingPolicies` is reported. ","non-blocking","IF(not(Stamdata!G747=\"\"),0,1)+AssertionId(\"valueAssertion_NotesRevaluationReserveStatementOfChanges_PrtExistenceThnExistence1E1\")","Stamdata!G747"]
["KvK: Jaarverantwoording 2023 NLGAAP - kleine rechtspersonen - publicatiestukken","valueAssertion_NotesRevaluationReserveStatementOfChanges_PrtExistenceThnExistence1E1","`AdjustedRevaluationReserveAfterRecalculationChangeAccountingPolicies` SHOULD exist at least once within the same context, because `RevaluationReserveChangeAccountingPolicies` is reported. ","non-blocking","IF(not(Stamdata!H747=\"\"),0,1)+AssertionId(\"valueAssertion_NotesRevaluationReserveStatementOfChanges_PrtExistenceThnExistence1E1\")","Stamdata!H747"]
["KvK: Jaarverantwoording 2023 NLGAAP - kleine rechtspersonen - publicatiestukken","valueAssertion_NotesRevaluationReserveStatementOfChanges_PrtExistenceThnExistence1E1","`AdjustedRevaluationReserveAfterRecalculationChangeAccountingPolicies` SHOULD exist at least once within the same context, because `RevaluationReserveChangeAccountingPolicies` is reported. ","non-blocking","IF(not(Stamdata!I747=\"\"),0,1)+AssertionId(\"valueAssertion_NotesRevaluationReserveStatementOfChanges_PrtExistenceThnExistence1E1\")","Stamdata!I747"]
["KvK: Jaarverantwoording 2023 NLGAAP - kleine rechtspersonen - publicatiestukken","valueAssertion_NotesRevaluationReserveStatementOfChanges_PrtExistenceThnExistence1E1","`AdjustedRevaluationReserveAfterRecalculationChangeAccountingPolicies` SHOULD exist at least once within the same context, because `RevaluationReserveChangeAccountingPolicies` is reported. ","non-blocking","IF(not(Stamdata!D771=\"\"),0,1)+AssertionId(\"valueAssertion_NotesRevaluationReserveStatementOfChanges_PrtExistenceThnExistence1E1\")","Stamdata!D771"]
["KvK: Jaarverantwoording 2023 NLGAAP - kleine rechtspersonen - publicatiestukken","valueAssertion_NotesRevaluationReserveStatementOfChanges_PrtExistenceThnExistence1E1","`AdjustedRevaluationReserveAfterRecalculationChangeAccountingPolicies` SHOULD exist at least once within the same context, because `RevaluationReserveChangeAccountingPolicies` is reported. ","non-blocking","IF(not(Stamdata!E771=\"\"),0,1)+AssertionId(\"valueAssertion_NotesRevaluationReserveStatementOfChanges_PrtExistenceThnExistence1E1\")","Stamdata!E771"]
["KvK: Jaarverantwoording 2023 NLGAAP - kleine rechtspersonen - publicatiestukken","valueAssertion_NotesRevaluationReserveStatementOfChanges_PrtExistenceThnExistence1E1","`AdjustedRevaluationReserveAfterRecalculationChangeAccountingPolicies` SHOULD exist at least once within the same context, because `RevaluationReserveChangeAccountingPolicies` is reported. ","non-blocking","IF(not(Stamdata!F771=\"\"),0,1)+AssertionId(\"valueAssertion_NotesRevaluationReserveStatementOfChanges_PrtExistenceThnExistence1E1\")","Stamdata!F771"]
["KvK: Jaarverantwoording 2023 NLGAAP - kleine rechtspersonen - publicatiestukken","valueAssertion_NotesRevaluationReserveStatementOfChanges_PrtExistenceThnExistence1E1","`AdjustedRevaluationReserveAfterRecalculationChangeAccountingPolicies` SHOULD exist at least once within the same context, because `RevaluationReserveChangeAccountingPolicies` is reported. ","non-blocking","IF(not(Stamdata!G771=\"\"),0,1)+AssertionId(\"valueAssertion_NotesRevaluationReserveStatementOfChanges_PrtExistenceThnExistence1E1\")","Stamdata!G771"]
["KvK: Jaarverantwoording 2023 NLGAAP - kleine rechtspersonen - publicatiestukken","valueAssertion_NotesRevaluationReserveStatementOfChanges_PrtExistenceThnExistence1E1","`AdjustedRevaluationReserveAfterRecalculationChangeAccountingPolicies` SHOULD exist at least once within the same context, because `RevaluationReserveChangeAccountingPolicies` is reported. ","non-blocking","IF(not(Stamdata!H771=\"\"),0,1)+AssertionId(\"valueAssertion_NotesRevaluationReserveStatementOfChanges_PrtExistenceThnExistence1E1\")","Stamdata!H771"]
["KvK: Jaarverantwoording 2023 NLGAAP - kleine rechtspersonen - publicatiestukken","valueAssertion_NotesRevaluationReserveStatementOfChanges_PrtExistenceThnExistence1E1","`AdjustedRevaluationReserveAfterRecalculationChangeAccountingPolicies` SHOULD exist at least once within the same context, because `RevaluationReserveChangeAccountingPolicies` is reported. ","non-blocking","IF(not(Stamdata!I771=\"\"),0,1)+AssertionId(\"valueAssertion_NotesRevaluationReserveStatementOfChanges_PrtExistenceThnExistence1E1\")","Stamdata!I771"]
["KvK: Jaarverantwoording 2023 NLGAAP - kleine rechtspersonen - publicatiestukken","valueAssertion_NotesRevaluationReserveStatementOfChanges_PrtFST1ExistenceThn03Variables1","`AdjustedRevaluationReserveAfterRecalculationChangeAccountingPolicies` SHOULD be equal to + `RevaluationReserve` + `RevaluationReserveChangeAccountingPolicies` - `RevaluationReserveChangeAccountingPoliciesTaxImpact`, because `RevaluationReserveChangeAccountingPolicies` is reported. ","non-blocking","IF(OR(not(Stamdata!D744=\"\"),not(Stamdata!D744ChangeAccountingPolicies=\"\"),not(Stamdata!D744ChangeAccountingPoliciesTaxImpact=\"\")),IF(OR(+ Stamdata!D744 + Stamdata!D744ChangeAccountingPolicies - Stamdata!D744ChangeAccountingPoliciesTaxImpact = Stamdata!D747 ,+ Stamdata!D760 + Stamdata!D760ChangeAccountingPolicies - Stamdata!D760ChangeAccountingPoliciesTaxImpact = Stamdata!D747 ),0,1),0)+AssertionId(\"valueAssertion_NotesRevaluationReserveStatementOfChanges_PrtFST1ExistenceThn03Variables1\")","Stamdata!D744,Stamdata!D760"]
["KvK: Jaarverantwoording 2023 NLGAAP - kleine rechtspersonen - publicatiestukken","valueAssertion_NotesRevaluationReserveStatementOfChanges_PrtFST1ExistenceThn03Variables1","`AdjustedRevaluationReserveAfterRecalculationChangeAccountingPolicies` SHOULD be equal to + `RevaluationReserve` + `RevaluationReserveChangeAccountingPolicies` - `RevaluationReserveChangeAccountingPoliciesTaxImpact`, because `RevaluationReserveChangeAccountingPolicies` is reported. ","non-blocking","IF(OR(not(Stamdata!E744=\"\"),not(Stamdata!E744ChangeAccountingPolicies=\"\"),not(Stamdata!E744ChangeAccountingPoliciesTaxImpact=\"\")),IF(OR(+ Stamdata!E744 + Stamdata!E744ChangeAccountingPolicies - Stamdata!E744ChangeAccountingPoliciesTaxImpact = Stamdata!E747 ,+ Stamdata!E760 + Stamdata!E760ChangeAccountingPolicies - Stamdata!E760ChangeAccountingPoliciesTaxImpact = Stamdata!E747 ),0,1),0)+AssertionId(\"valueAssertion_NotesRevaluationReserveStatementOfChanges_PrtFST1ExistenceThn03Variables1\")","Stamdata!E744,Stamdata!E760"]
["KvK: Jaarverantwoording 2023 NLGAAP - kleine rechtspersonen - publicatiestukken","valueAssertion_NotesRevaluationReserveStatementOfChanges_PrtFST1ExistenceThn03Variables1","`AdjustedRevaluationReserveAfterRecalculationChangeAccountingPolicies` SHOULD be equal to + `RevaluationReserve` + `RevaluationReserveChangeAccountingPolicies` - `RevaluationReserveChangeAccountingPoliciesTaxImpact`, because `RevaluationReserveChangeAccountingPolicies` is reported. ","non-blocking","IF(OR(not(Stamdata!F744=\"\"),not(Stamdata!F744ChangeAccountingPolicies=\"\"),not(Stamdata!F744ChangeAccountingPoliciesTaxImpact=\"\")),IF(OR(+ Stamdata!F744 + Stamdata!F744ChangeAccountingPolicies - Stamdata!F744ChangeAccountingPoliciesTaxImpact = Stamdata!F747 ,+ Stamdata!F760 + Stamdata!F760ChangeAccountingPolicies - Stamdata!F760ChangeAccountingPoliciesTaxImpact = Stamdata!F747 ),0,1),0)+AssertionId(\"valueAssertion_NotesRevaluationReserveStatementOfChanges_PrtFST1ExistenceThn03Variables1\")","Stamdata!F744,Stamdata!F760"]
["KvK: Jaarverantwoording 2023 NLGAAP - kleine rechtspersonen - publicatiestukken","valueAssertion_NotesRevaluationReserveStatementOfChanges_PrtFST1ExistenceThn03Variables1","`AdjustedRevaluationReserveAfterRecalculationChangeAccountingPolicies` SHOULD be equal to + `RevaluationReserve` + `RevaluationReserveChangeAccountingPolicies` - `RevaluationReserveChangeAccountingPoliciesTaxImpact`, because `RevaluationReserveChangeAccountingPolicies` is reported. ","non-blocking","IF(OR(not(Stamdata!G744=\"\"),not(Stamdata!G744ChangeAccountingPolicies=\"\"),not(Stamdata!G744ChangeAccountingPoliciesTaxImpact=\"\")),IF(OR(+ Stamdata!G744 + Stamdata!G744ChangeAccountingPolicies - Stamdata!G744ChangeAccountingPoliciesTaxImpact = Stamdata!G747 ,+ Stamdata!G760 + Stamdata!G760ChangeAccountingPolicies - Stamdata!G760ChangeAccountingPoliciesTaxImpact = Stamdata!G747 ),0,1),0)+AssertionId(\"valueAssertion_NotesRevaluationReserveStatementOfChanges_PrtFST1ExistenceThn03Variables1\")","Stamdata!G744,Stamdata!G760"]
["KvK: Jaarverantwoording 2023 NLGAAP - kleine rechtspersonen - publicatiestukken","valueAssertion_NotesRevaluationReserveStatementOfChanges_PrtFST1ExistenceThn03Variables1","`AdjustedRevaluationReserveAfterRecalculationChangeAccountingPolicies` SHOULD be equal to + `RevaluationReserve` + `RevaluationReserveChangeAccountingPolicies` - `RevaluationReserveChangeAccountingPoliciesTaxImpact`, because `RevaluationReserveChangeAccountingPolicies` is reported. ","non-blocking","IF(OR(not(Stamdata!H744=\"\"),not(Stamdata!H744ChangeAccountingPolicies=\"\"),not(Stamdata!H744ChangeAccountingPoliciesTaxImpact=\"\")),IF(OR(+ Stamdata!H744 + Stamdata!H744ChangeAccountingPolicies - Stamdata!H744ChangeAccountingPoliciesTaxImpact = Stamdata!H747 ,+ Stamdata!H760 + Stamdata!H760ChangeAccountingPolicies - Stamdata!H760ChangeAccountingPoliciesTaxImpact = Stamdata!H747 ),0,1),0)+AssertionId(\"valueAssertion_NotesRevaluationReserveStatementOfChanges_PrtFST1ExistenceThn03Variables1\")","Stamdata!H744,Stamdata!H760"]
["KvK: Jaarverantwoording 2023 NLGAAP - kleine rechtspersonen - publicatiestukken","valueAssertion_NotesRevaluationReserveStatementOfChanges_PrtFST1ExistenceThn03Variables1","`AdjustedRevaluationReserveAfterRecalculationChangeAccountingPolicies` SHOULD be equal to + `RevaluationReserve` + `RevaluationReserveChangeAccountingPolicies` - `RevaluationReserveChangeAccountingPoliciesTaxImpact`, because `RevaluationReserveChangeAccountingPolicies` is reported. ","non-blocking","IF(OR(not(Stamdata!I744=\"\"),not(Stamdata!I744ChangeAccountingPolicies=\"\"),not(Stamdata!I744ChangeAccountingPoliciesTaxImpact=\"\")),IF(OR(+ Stamdata!I744 + Stamdata!I744ChangeAccountingPolicies - Stamdata!I744ChangeAccountingPoliciesTaxImpact = Stamdata!I747 ,+ Stamdata!I760 + Stamdata!I760ChangeAccountingPolicies - Stamdata!I760ChangeAccountingPoliciesTaxImpact = Stamdata!I747 ),0,1),0)+AssertionId(\"valueAssertion_NotesRevaluationReserveStatementOfChanges_PrtFST1ExistenceThn03Variables1\")","Stamdata!I744,Stamdata!I760"]
["KvK: Jaarverantwoording 2023 NLGAAP - kleine rechtspersonen - publicatiestukken","valueAssertion_NotesRevaluationReserveStatementOfChanges_PrtFST1ExistenceThn03Variables1","`AdjustedRevaluationReserveAfterRecalculationChangeAccountingPolicies` SHOULD be equal to + `RevaluationReserve` + `RevaluationReserveChangeAccountingPolicies` - `RevaluationReserveChangeAccountingPoliciesTaxImpact`, because `RevaluationReserveChangeAccountingPolicies` is reported. ","non-blocking","IF(OR(not(Stamdata!D768=\"\"),not(Stamdata!D768ChangeAccountingPolicies=\"\"),not(Stamdata!D768ChangeAccountingPoliciesTaxImpact=\"\")),IF(OR(+ Stamdata!D768 + Stamdata!D768ChangeAccountingPolicies - Stamdata!D768ChangeAccountingPoliciesTaxImpact = Stamdata!D771 ,+ Stamdata!D784 + Stamdata!D784ChangeAccountingPolicies - Stamdata!D784ChangeAccountingPoliciesTaxImpact = Stamdata!D771 ),0,1),0)+AssertionId(\"valueAssertion_NotesRevaluationReserveStatementOfChanges_PrtFST1ExistenceThn03Variables1\")","Stamdata!D768,Stamdata!D784"]
["KvK: Jaarverantwoording 2023 NLGAAP - kleine rechtspersonen - publicatiestukken","valueAssertion_NotesRevaluationReserveStatementOfChanges_PrtFST1ExistenceThn03Variables1","`AdjustedRevaluationReserveAfterRecalculationChangeAccountingPolicies` SHOULD be equal to + `RevaluationReserve` + `RevaluationReserveChangeAccountingPolicies` - `RevaluationReserveChangeAccountingPoliciesTaxImpact`, because `RevaluationReserveChangeAccountingPolicies` is reported. ","non-blocking","IF(OR(not(Stamdata!E768=\"\"),not(Stamdata!E768ChangeAccountingPolicies=\"\"),not(Stamdata!E768ChangeAccountingPoliciesTaxImpact=\"\")),IF(OR(+ Stamdata!E768 + Stamdata!E768ChangeAccountingPolicies - Stamdata!E768ChangeAccountingPoliciesTaxImpact = Stamdata!E771 ,+ Stamdata!E784 + Stamdata!E784ChangeAccountingPolicies - Stamdata!E784ChangeAccountingPoliciesTaxImpact = Stamdata!E771 ),0,1),0)+AssertionId(\"valueAssertion_NotesRevaluationReserveStatementOfChanges_PrtFST1ExistenceThn03Variables1\")","Stamdata!E768,Stamdata!E784"]
["KvK: Jaarverantwoording 2023 NLGAAP - kleine rechtspersonen - publicatiestukken","valueAssertion_NotesRevaluationReserveStatementOfChanges_PrtFST1ExistenceThn03Variables1","`AdjustedRevaluationReserveAfterRecalculationChangeAccountingPolicies` SHOULD be equal to + `RevaluationReserve` + `RevaluationReserveChangeAccountingPolicies` - `RevaluationReserveChangeAccountingPoliciesTaxImpact`, because `RevaluationReserveChangeAccountingPolicies` is reported. ","non-blocking","IF(OR(not(Stamdata!F768=\"\"),not(Stamdata!F768ChangeAccountingPolicies=\"\"),not(Stamdata!F768ChangeAccountingPoliciesTaxImpact=\"\")),IF(OR(+ Stamdata!F768 + Stamdata!F768ChangeAccountingPolicies - Stamdata!F768ChangeAccountingPoliciesTaxImpact = Stamdata!F771 ,+ Stamdata!F784 + Stamdata!F784ChangeAccountingPolicies - Stamdata!F784ChangeAccountingPoliciesTaxImpact = Stamdata!F771 ),0,1),0)+AssertionId(\"valueAssertion_NotesRevaluationReserveStatementOfChanges_PrtFST1ExistenceThn03Variables1\")","Stamdata!F768,Stamdata!F784"]
["KvK: Jaarverantwoording 2023 NLGAAP - kleine rechtspersonen - publicatiestukken","valueAssertion_NotesRevaluationReserveStatementOfChanges_PrtFST1ExistenceThn03Variables1","`AdjustedRevaluationReserveAfterRecalculationChangeAccountingPolicies` SHOULD be equal to + `RevaluationReserve` + `RevaluationReserveChangeAccountingPolicies` - `RevaluationReserveChangeAccountingPoliciesTaxImpact`, because `RevaluationReserveChangeAccountingPolicies` is reported. ","non-blocking","IF(OR(not(Stamdata!G768=\"\"),not(Stamdata!G768ChangeAccountingPolicies=\"\"),not(Stamdata!G768ChangeAccountingPoliciesTaxImpact=\"\")),IF(OR(+ Stamdata!G768 + Stamdata!G768ChangeAccountingPolicies - Stamdata!G768ChangeAccountingPoliciesTaxImpact = Stamdata!G771 ,+ Stamdata!G784 + Stamdata!G784ChangeAccountingPolicies - Stamdata!G784ChangeAccountingPoliciesTaxImpact = Stamdata!G771 ),0,1),0)+AssertionId(\"valueAssertion_NotesRevaluationReserveStatementOfChanges_PrtFST1ExistenceThn03Variables1\")","Stamdata!G768,Stamdata!G784"]
["KvK: Jaarverantwoording 2023 NLGAAP - kleine rechtspersonen - publicatiestukken","valueAssertion_NotesRevaluationReserveStatementOfChanges_PrtFST1ExistenceThn03Variables1","`AdjustedRevaluationReserveAfterRecalculationChangeAccountingPolicies` SHOULD be equal to + `RevaluationReserve` + `RevaluationReserveChangeAccountingPolicies` - `RevaluationReserveChangeAccountingPoliciesTaxImpact`, because `RevaluationReserveChangeAccountingPolicies` is reported. ","non-blocking","IF(OR(not(Stamdata!H768=\"\"),not(Stamdata!H768ChangeAccountingPolicies=\"\"),not(Stamdata!H768ChangeAccountingPoliciesTaxImpact=\"\")),IF(OR(+ Stamdata!H768 + Stamdata!H768ChangeAccountingPolicies - Stamdata!H768ChangeAccountingPoliciesTaxImpact = Stamdata!H771 ,+ Stamdata!H784 + Stamdata!H784ChangeAccountingPolicies - Stamdata!H784ChangeAccountingPoliciesTaxImpact = Stamdata!H771 ),0,1),0)+AssertionId(\"valueAssertion_NotesRevaluationReserveStatementOfChanges_PrtFST1ExistenceThn03Variables1\")","Stamdata!H768,Stamdata!H784"]
["KvK: Jaarverantwoording 2023 NLGAAP - kleine rechtspersonen - publicatiestukken","valueAssertion_NotesRevaluationReserveStatementOfChanges_PrtFST1ExistenceThn03Variables1","`AdjustedRevaluationReserveAfterRecalculationChangeAccountingPolicies` SHOULD be equal to + `RevaluationReserve` + `RevaluationReserveChangeAccountingPolicies` - `RevaluationReserveChangeAccountingPoliciesTaxImpact`, because `RevaluationReserveChangeAccountingPolicies` is reported. ","non-blocking","IF(OR(not(Stamdata!I768=\"\"),not(Stamdata!I768ChangeAccountingPolicies=\"\"),not(Stamdata!I768ChangeAccountingPoliciesTaxImpact=\"\")),IF(OR(+ Stamdata!I768 + Stamdata!I768ChangeAccountingPolicies - Stamdata!I768ChangeAccountingPoliciesTaxImpact = Stamdata!I771 ,+ Stamdata!I784 + Stamdata!I784ChangeAccountingPolicies - Stamdata!I784ChangeAccountingPoliciesTaxImpact = Stamdata!I771 ),0,1),0)+AssertionId(\"valueAssertion_NotesRevaluationReserveStatementOfChanges_PrtFST1ExistenceThn03Variables1\")","Stamdata!I768,Stamdata!I784"]
["KvK: Jaarverantwoording 2023 NLGAAP - kleine rechtspersonen - publicatiestukken","valueAssertion_NotesRevaluationReserveStatementOfChanges_PrtFST1ExistenceThnPeriodStartMutationPeriodEnd1","The reported value of `RevaluationReserve` at end of period SHOULD be equal to sum of reported value of `AdjustedRevaluationReserveAfterRecalculationChangeAccountingPolicies` at beginning of period and changes in that value during period, `RevaluationReserveMovement`, because `RevaluationReserveChangeAccountingPolicies` is reported. ","non-blocking","IF(OR(Stamdata!D747 + Stamdata!D758 = Stamdata!D744,Stamdata!D747 + Stamdata!D758 = Stamdata!D760),0,1)+AssertionId(\"valueAssertion_NotesRevaluationReserveStatementOfChanges_PrtFST1ExistenceThnPeriodStartMutationPeriodEnd1\")","Stamdata!D744,Stamdata!D760"]
["KvK: Jaarverantwoording 2023 NLGAAP - kleine rechtspersonen - publicatiestukken","valueAssertion_NotesRevaluationReserveStatementOfChanges_PrtFST1ExistenceThnPeriodStartMutationPeriodEnd1","The reported value of `RevaluationReserve` at end of period SHOULD be equal to sum of reported value of `AdjustedRevaluationReserveAfterRecalculationChangeAccountingPolicies` at beginning of period and changes in that value during period, `RevaluationReserveMovement`, because `RevaluationReserveChangeAccountingPolicies` is reported. ","non-blocking","IF(OR(Stamdata!E747 + Stamdata!E758 = Stamdata!E744,Stamdata!E747 + Stamdata!E758 = Stamdata!E760),0,1)+AssertionId(\"valueAssertion_NotesRevaluationReserveStatementOfChanges_PrtFST1ExistenceThnPeriodStartMutationPeriodEnd1\")","Stamdata!E744,Stamdata!E760"]
["KvK: Jaarverantwoording 2023 NLGAAP - kleine rechtspersonen - publicatiestukken","valueAssertion_NotesRevaluationReserveStatementOfChanges_PrtFST1ExistenceThnPeriodStartMutationPeriodEnd1","The reported value of `RevaluationReserve` at end of period SHOULD be equal to sum of reported value of `AdjustedRevaluationReserveAfterRecalculationChangeAccountingPolicies` at beginning of period and changes in that value during period, `RevaluationReserveMovement`, because `RevaluationReserveChangeAccountingPolicies` is reported. ","non-blocking","IF(OR(Stamdata!F747 + Stamdata!F758 = Stamdata!F744,Stamdata!F747 + Stamdata!F758 = Stamdata!F760),0,1)+AssertionId(\"valueAssertion_NotesRevaluationReserveStatementOfChanges_PrtFST1ExistenceThnPeriodStartMutationPeriodEnd1\")","Stamdata!F744,Stamdata!F760"]
["KvK: Jaarverantwoording 2023 NLGAAP - kleine rechtspersonen - publicatiestukken","valueAssertion_NotesRevaluationReserveStatementOfChanges_PrtFST1ExistenceThnPeriodStartMutationPeriodEnd1","The reported value of `RevaluationReserve` at end of period SHOULD be equal to sum of reported value of `AdjustedRevaluationReserveAfterRecalculationChangeAccountingPolicies` at beginning of period and changes in that value during period, `RevaluationReserveMovement`, because `RevaluationReserveChangeAccountingPolicies` is reported. ","non-blocking","IF(OR(Stamdata!G747 + Stamdata!G758 = Stamdata!G744,Stamdata!G747 + Stamdata!G758 = Stamdata!G760),0,1)+AssertionId(\"valueAssertion_NotesRevaluationReserveStatementOfChanges_PrtFST1ExistenceThnPeriodStartMutationPeriodEnd1\")","Stamdata!G744,Stamdata!G760"]
["KvK: Jaarverantwoording 2023 NLGAAP - kleine rechtspersonen - publicatiestukken","valueAssertion_NotesRevaluationReserveStatementOfChanges_PrtFST1ExistenceThnPeriodStartMutationPeriodEnd1","The reported value of `RevaluationReserve` at end of period SHOULD be equal to sum of reported value of `AdjustedRevaluationReserveAfterRecalculationChangeAccountingPolicies` at beginning of period and changes in that value during period, `RevaluationReserveMovement`, because `RevaluationReserveChangeAccountingPolicies` is reported. ","non-blocking","IF(OR(Stamdata!H747 + Stamdata!H758 = Stamdata!H744,Stamdata!H747 + Stamdata!H758 = Stamdata!H760),0,1)+AssertionId(\"valueAssertion_NotesRevaluationReserveStatementOfChanges_PrtFST1ExistenceThnPeriodStartMutationPeriodEnd1\")","Stamdata!H744,Stamdata!H760"]
["KvK: Jaarverantwoording 2023 NLGAAP - kleine rechtspersonen - publicatiestukken","valueAssertion_NotesRevaluationReserveStatementOfChanges_PrtFST1ExistenceThnPeriodStartMutationPeriodEnd1","The reported value of `RevaluationReserve` at end of period SHOULD be equal to sum of reported value of `AdjustedRevaluationReserveAfterRecalculationChangeAccountingPolicies` at beginning of period and changes in that value during period, `RevaluationReserveMovement`, because `RevaluationReserveChangeAccountingPolicies` is reported. ","non-blocking","IF(OR(Stamdata!I747 + Stamdata!I758 = Stamdata!I744,Stamdata!I747 + Stamdata!I758 = Stamdata!I760),0,1)+AssertionId(\"valueAssertion_NotesRevaluationReserveStatementOfChanges_PrtFST1ExistenceThnPeriodStartMutationPeriodEnd1\")","Stamdata!I744,Stamdata!I760"]
["KvK: Jaarverantwoording 2023 NLGAAP - kleine rechtspersonen - publicatiestukken","valueAssertion_NotesRevaluationReserveStatementOfChanges_PrtFST1ExistenceThnPeriodStartMutationPeriodEnd1","The reported value of `RevaluationReserve` at end of period SHOULD be equal to sum of reported value of `AdjustedRevaluationReserveAfterRecalculationChangeAccountingPolicies` at beginning of period and changes in that value during period, `RevaluationReserveMovement`, because `RevaluationReserveChangeAccountingPolicies` is reported. ","non-blocking","IF(OR(Stamdata!D771 + Stamdata!D782 = Stamdata!D768,Stamdata!D771 + Stamdata!D782 = Stamdata!D784),0,1)+AssertionId(\"valueAssertion_NotesRevaluationReserveStatementOfChanges_PrtFST1ExistenceThnPeriodStartMutationPeriodEnd1\")","Stamdata!D768,Stamdata!D784"]
["KvK: Jaarverantwoording 2023 NLGAAP - kleine rechtspersonen - publicatiestukken","valueAssertion_NotesRevaluationReserveStatementOfChanges_PrtFST1ExistenceThnPeriodStartMutationPeriodEnd1","The reported value of `RevaluationReserve` at end of period SHOULD be equal to sum of reported value of `AdjustedRevaluationReserveAfterRecalculationChangeAccountingPolicies` at beginning of period and changes in that value during period, `RevaluationReserveMovement`, because `RevaluationReserveChangeAccountingPolicies` is reported. ","non-blocking","IF(OR(Stamdata!E771 + Stamdata!E782 = Stamdata!E768,Stamdata!E771 + Stamdata!E782 = Stamdata!E784),0,1)+AssertionId(\"valueAssertion_NotesRevaluationReserveStatementOfChanges_PrtFST1ExistenceThnPeriodStartMutationPeriodEnd1\")","Stamdata!E768,Stamdata!E784"]
["KvK: Jaarverantwoording 2023 NLGAAP - kleine rechtspersonen - publicatiestukken","valueAssertion_NotesRevaluationReserveStatementOfChanges_PrtFST1ExistenceThnPeriodStartMutationPeriodEnd1","The reported value of `RevaluationReserve` at end of period SHOULD be equal to sum of reported value of `AdjustedRevaluationReserveAfterRecalculationChangeAccountingPolicies` at beginning of period and changes in that value during period, `RevaluationReserveMovement`, because `RevaluationReserveChangeAccountingPolicies` is reported. ","non-blocking","IF(OR(Stamdata!F771 + Stamdata!F782 = Stamdata!F768,Stamdata!F771 + Stamdata!F782 = Stamdata!F784),0,1)+AssertionId(\"valueAssertion_NotesRevaluationReserveStatementOfChanges_PrtFST1ExistenceThnPeriodStartMutationPeriodEnd1\")","Stamdata!F768,Stamdata!F784"]
["KvK: Jaarverantwoording 2023 NLGAAP - kleine rechtspersonen - publicatiestukken","valueAssertion_NotesRevaluationReserveStatementOfChanges_PrtFST1ExistenceThnPeriodStartMutationPeriodEnd1","The reported value of `RevaluationReserve` at end of period SHOULD be equal to sum of reported value of `AdjustedRevaluationReserveAfterRecalculationChangeAccountingPolicies` at beginning of period and changes in that value during period, `RevaluationReserveMovement`, because `RevaluationReserveChangeAccountingPolicies` is reported. ","non-blocking","IF(OR(Stamdata!G771 + Stamdata!G782 = Stamdata!G768,Stamdata!G771 + Stamdata!G782 = Stamdata!G784),0,1)+AssertionId(\"valueAssertion_NotesRevaluationReserveStatementOfChanges_PrtFST1ExistenceThnPeriodStartMutationPeriodEnd1\")","Stamdata!G768,Stamdata!G784"]
["KvK: Jaarverantwoording 2023 NLGAAP - kleine rechtspersonen - publicatiestukken","valueAssertion_NotesRevaluationReserveStatementOfChanges_PrtFST1ExistenceThnPeriodStartMutationPeriodEnd1","The reported value of `RevaluationReserve` at end of period SHOULD be equal to sum of reported value of `AdjustedRevaluationReserveAfterRecalculationChangeAccountingPolicies` at beginning of period and changes in that value during period, `RevaluationReserveMovement`, because `RevaluationReserveChangeAccountingPolicies` is reported. ","non-blocking","IF(OR(Stamdata!H771 + Stamdata!H782 = Stamdata!H768,Stamdata!H771 + Stamdata!H782 = Stamdata!H784),0,1)+AssertionId(\"valueAssertion_NotesRevaluationReserveStatementOfChanges_PrtFST1ExistenceThnPeriodStartMutationPeriodEnd1\")","Stamdata!H768,Stamdata!H784"]
["KvK: Jaarverantwoording 2023 NLGAAP - kleine rechtspersonen - publicatiestukken","valueAssertion_NotesRevaluationReserveStatementOfChanges_PrtFST1ExistenceThnPeriodStartMutationPeriodEnd1","The reported value of `RevaluationReserve` at end of period SHOULD be equal to sum of reported value of `AdjustedRevaluationReserveAfterRecalculationChangeAccountingPolicies` at beginning of period and changes in that value during period, `RevaluationReserveMovement`, because `RevaluationReserveChangeAccountingPolicies` is reported. ","non-blocking","IF(OR(Stamdata!I771 + Stamdata!I782 = Stamdata!I768,Stamdata!I771 + Stamdata!I782 = Stamdata!I784),0,1)+AssertionId(\"valueAssertion_NotesRevaluationReserveStatementOfChanges_PrtFST1ExistenceThnPeriodStartMutationPeriodEnd1\")","Stamdata!I768,Stamdata!I784"]
["KvK: Jaarverantwoording 2023 NLGAAP - kleine rechtspersonen - publicatiestukken","valueAssertion_NotesRevaluationReserveStatementOfChanges_PrtFST1FactExplicitEQFactNonExplicit1","`RevaluationReserve` reported with `ClassesOfRevaluationReserveAxis` and `RevaluationReserveMember` SHOULD be equal to `RevaluationReserve` without `ClassesOfRevaluationReserveAxis` and RevaluationReserveMember| ","non-blocking","IF(OR(Stamdata!D744 = Stamdata!D744,Stamdata!D760 = Stamdata!D744),0,1)+AssertionId(\"valueAssertion_NotesRevaluationReserveStatementOfChanges_PrtFST1FactExplicitEQFactNonExplicit1\")","Stamdata!D744,Stamdata!D760"]
["KvK: Jaarverantwoording 2023 NLGAAP - kleine rechtspersonen - publicatiestukken","valueAssertion_NotesRevaluationReserveStatementOfChanges_PrtFST1FactExplicitEQFactNonExplicit1","`RevaluationReserve` reported with `ClassesOfRevaluationReserveAxis` and `RevaluationReserveMember` SHOULD be equal to `RevaluationReserve` without `ClassesOfRevaluationReserveAxis` and RevaluationReserveMember| ","non-blocking","IF(OR(Stamdata!E744 = Stamdata!E744,Stamdata!E760 = Stamdata!E744),0,1)+AssertionId(\"valueAssertion_NotesRevaluationReserveStatementOfChanges_PrtFST1FactExplicitEQFactNonExplicit1\")","Stamdata!E744,Stamdata!E760"]
["KvK: Jaarverantwoording 2023 NLGAAP - kleine rechtspersonen - publicatiestukken","valueAssertion_NotesRevaluationReserveStatementOfChanges_PrtFST1FactExplicitEQFactNonExplicit1","`RevaluationReserve` reported with `ClassesOfRevaluationReserveAxis` and `RevaluationReserveMember` SHOULD be equal to `RevaluationReserve` without `ClassesOfRevaluationReserveAxis` and RevaluationReserveMember| ","non-blocking","IF(OR(Stamdata!F744 = Stamdata!F744,Stamdata!F760 = Stamdata!F744),0,1)+AssertionId(\"valueAssertion_NotesRevaluationReserveStatementOfChanges_PrtFST1FactExplicitEQFactNonExplicit1\")","Stamdata!F744,Stamdata!F760"]
["KvK: Jaarverantwoording 2023 NLGAAP - kleine rechtspersonen - publicatiestukken","valueAssertion_NotesRevaluationReserveStatementOfChanges_PrtFST1FactExplicitEQFactNonExplicit1","`RevaluationReserve` reported with `ClassesOfRevaluationReserveAxis` and `RevaluationReserveMember` SHOULD be equal to `RevaluationReserve` without `ClassesOfRevaluationReserveAxis` and RevaluationReserveMember| ","non-blocking","IF(OR(Stamdata!G744 = Stamdata!G744,Stamdata!G760 = Stamdata!G744),0,1)+AssertionId(\"valueAssertion_NotesRevaluationReserveStatementOfChanges_PrtFST1FactExplicitEQFactNonExplicit1\")","Stamdata!G744,Stamdata!G760"]
["KvK: Jaarverantwoording 2023 NLGAAP - kleine rechtspersonen - publicatiestukken","valueAssertion_NotesRevaluationReserveStatementOfChanges_PrtFST1FactExplicitEQFactNonExplicit1","`RevaluationReserve` reported with `ClassesOfRevaluationReserveAxis` and `RevaluationReserveMember` SHOULD be equal to `RevaluationReserve` without `ClassesOfRevaluationReserveAxis` and RevaluationReserveMember| ","non-blocking","IF(OR(Stamdata!H744 = Stamdata!H744,Stamdata!H760 = Stamdata!H744),0,1)+AssertionId(\"valueAssertion_NotesRevaluationReserveStatementOfChanges_PrtFST1FactExplicitEQFactNonExplicit1\")","Stamdata!H744,Stamdata!H760"]
["KvK: Jaarverantwoording 2023 NLGAAP - kleine rechtspersonen - publicatiestukken","valueAssertion_NotesRevaluationReserveStatementOfChanges_PrtFST1FactExplicitEQFactNonExplicit1","`RevaluationReserve` reported with `ClassesOfRevaluationReserveAxis` and `RevaluationReserveMember` SHOULD be equal to `RevaluationReserve` without `ClassesOfRevaluationReserveAxis` and RevaluationReserveMember| ","non-blocking","IF(OR(Stamdata!I744 = Stamdata!I744,Stamdata!I760 = Stamdata!I744),0,1)+AssertionId(\"valueAssertion_NotesRevaluationReserveStatementOfChanges_PrtFST1FactExplicitEQFactNonExplicit1\")","Stamdata!I744,Stamdata!I760"]
["KvK: Jaarverantwoording 2023 NLGAAP - kleine rechtspersonen - publicatiestukken","valueAssertion_NotesRevaluationReserveStatementOfChanges_PrtFST1FactExplicitEQFactNonExplicit1","`RevaluationReserve` reported with `ClassesOfRevaluationReserveAxis` and `RevaluationReserveMember` SHOULD be equal to `RevaluationReserve` without `ClassesOfRevaluationReserveAxis` and RevaluationReserveMember| ","non-blocking","IF(OR(Stamdata!D768 = Stamdata!D768,Stamdata!D784 = Stamdata!D768),0,1)+AssertionId(\"valueAssertion_NotesRevaluationReserveStatementOfChanges_PrtFST1FactExplicitEQFactNonExplicit1\")","Stamdata!D768,Stamdata!D784"]
["KvK: Jaarverantwoording 2023 NLGAAP - kleine rechtspersonen - publicatiestukken","valueAssertion_NotesRevaluationReserveStatementOfChanges_PrtFST1FactExplicitEQFactNonExplicit1","`RevaluationReserve` reported with `ClassesOfRevaluationReserveAxis` and `RevaluationReserveMember` SHOULD be equal to `RevaluationReserve` without `ClassesOfRevaluationReserveAxis` and RevaluationReserveMember| ","non-blocking","IF(OR(Stamdata!E768 = Stamdata!E768,Stamdata!E784 = Stamdata!E768),0,1)+AssertionId(\"valueAssertion_NotesRevaluationReserveStatementOfChanges_PrtFST1FactExplicitEQFactNonExplicit1\")","Stamdata!E768,Stamdata!E784"]
["KvK: Jaarverantwoording 2023 NLGAAP - kleine rechtspersonen - publicatiestukken","valueAssertion_NotesRevaluationReserveStatementOfChanges_PrtFST1FactExplicitEQFactNonExplicit1","`RevaluationReserve` reported with `ClassesOfRevaluationReserveAxis` and `RevaluationReserveMember` SHOULD be equal to `RevaluationReserve` without `ClassesOfRevaluationReserveAxis` and RevaluationReserveMember| ","non-blocking","IF(OR(Stamdata!F768 = Stamdata!F768,Stamdata!F784 = Stamdata!F768),0,1)+AssertionId(\"valueAssertion_NotesRevaluationReserveStatementOfChanges_PrtFST1FactExplicitEQFactNonExplicit1\")","Stamdata!F768,Stamdata!F784"]
["KvK: Jaarverantwoording 2023 NLGAAP - kleine rechtspersonen - publicatiestukken","valueAssertion_NotesRevaluationReserveStatementOfChanges_PrtFST1FactExplicitEQFactNonExplicit1","`RevaluationReserve` reported with `ClassesOfRevaluationReserveAxis` and `RevaluationReserveMember` SHOULD be equal to `RevaluationReserve` without `ClassesOfRevaluationReserveAxis` and RevaluationReserveMember| ","non-blocking","IF(OR(Stamdata!G768 = Stamdata!G768,Stamdata!G784 = Stamdata!G768),0,1)+AssertionId(\"valueAssertion_NotesRevaluationReserveStatementOfChanges_PrtFST1FactExplicitEQFactNonExplicit1\")","Stamdata!G768,Stamdata!G784"]
["KvK: Jaarverantwoording 2023 NLGAAP - kleine rechtspersonen - publicatiestukken","valueAssertion_NotesRevaluationReserveStatementOfChanges_PrtFST1FactExplicitEQFactNonExplicit1","`RevaluationReserve` reported with `ClassesOfRevaluationReserveAxis` and `RevaluationReserveMember` SHOULD be equal to `RevaluationReserve` without `ClassesOfRevaluationReserveAxis` and RevaluationReserveMember| ","non-blocking","IF(OR(Stamdata!H768 = Stamdata!H768,Stamdata!H784 = Stamdata!H768),0,1)+AssertionId(\"valueAssertion_NotesRevaluationReserveStatementOfChanges_PrtFST1FactExplicitEQFactNonExplicit1\")","Stamdata!H768,Stamdata!H784"]
["KvK: Jaarverantwoording 2023 NLGAAP - kleine rechtspersonen - publicatiestukken","valueAssertion_NotesRevaluationReserveStatementOfChanges_PrtFST1FactExplicitEQFactNonExplicit1","`RevaluationReserve` reported with `ClassesOfRevaluationReserveAxis` and `RevaluationReserveMember` SHOULD be equal to `RevaluationReserve` without `ClassesOfRevaluationReserveAxis` and RevaluationReserveMember| ","non-blocking","IF(OR(Stamdata!I768 = Stamdata!I768,Stamdata!I784 = Stamdata!I768),0,1)+AssertionId(\"valueAssertion_NotesRevaluationReserveStatementOfChanges_PrtFST1FactExplicitEQFactNonExplicit1\")","Stamdata!I768,Stamdata!I784"]
["KvK: Jaarverantwoording 2023 NLGAAP - kleine rechtspersonen - publicatiestukken","valueAssertion_NotesRevaluationReserveStatementOfChanges_PrtFST1NoExistenceThnPeriodStartMutationPeriodEnd1","The reported value of `RevaluationReserve` at end of period SHOULD be equal to sum of reported value of `RevaluationReserve` at beginning of period and changes in that value during period, `RevaluationReserveMovement`, because `RevaluationReserveChangeAccountingPolicies` is not reported. ","non-blocking","IF(Stamdata!D745=\"\",IF(OR(Stamdata!D744 + Stamdata!D758 = Stamdata!D744,Stamdata!D744 + Stamdata!D758 = Stamdata!D760),0,1),0)+AssertionId(\"valueAssertion_NotesRevaluationReserveStatementOfChanges_PrtFST1NoExistenceThnPeriodStartMutationPeriodEnd1\")","Stamdata!D744,Stamdata!D760"]
["KvK: Jaarverantwoording 2023 NLGAAP - kleine rechtspersonen - publicatiestukken","valueAssertion_NotesRevaluationReserveStatementOfChanges_PrtFST1NoExistenceThnPeriodStartMutationPeriodEnd1","The reported value of `RevaluationReserve` at end of period SHOULD be equal to sum of reported value of `RevaluationReserve` at beginning of period and changes in that value during period, `RevaluationReserveMovement`, because `RevaluationReserveChangeAccountingPolicies` is not reported. ","non-blocking","IF(Stamdata!E745=\"\",IF(OR(Stamdata!E744 + Stamdata!E758 = Stamdata!E744,Stamdata!E744 + Stamdata!E758 = Stamdata!E760),0,1),0)+AssertionId(\"valueAssertion_NotesRevaluationReserveStatementOfChanges_PrtFST1NoExistenceThnPeriodStartMutationPeriodEnd1\")","Stamdata!E744,Stamdata!E760"]
["KvK: Jaarverantwoording 2023 NLGAAP - kleine rechtspersonen - publicatiestukken","valueAssertion_NotesRevaluationReserveStatementOfChanges_PrtFST1NoExistenceThnPeriodStartMutationPeriodEnd1","The reported value of `RevaluationReserve` at end of period SHOULD be equal to sum of reported value of `RevaluationReserve` at beginning of period and changes in that value during period, `RevaluationReserveMovement`, because `RevaluationReserveChangeAccountingPolicies` is not reported. ","non-blocking","IF(Stamdata!F745=\"\",IF(OR(Stamdata!F744 + Stamdata!F758 = Stamdata!F744,Stamdata!F744 + Stamdata!F758 = Stamdata!F760),0,1),0)+AssertionId(\"valueAssertion_NotesRevaluationReserveStatementOfChanges_PrtFST1NoExistenceThnPeriodStartMutationPeriodEnd1\")","Stamdata!F744,Stamdata!F760"]
["KvK: Jaarverantwoording 2023 NLGAAP - kleine rechtspersonen - publicatiestukken","valueAssertion_NotesRevaluationReserveStatementOfChanges_PrtFST1NoExistenceThnPeriodStartMutationPeriodEnd1","The reported value of `RevaluationReserve` at end of period SHOULD be equal to sum of reported value of `RevaluationReserve` at beginning of period and changes in that value during period, `RevaluationReserveMovement`, because `RevaluationReserveChangeAccountingPolicies` is not reported. ","non-blocking","IF(Stamdata!G745=\"\",IF(OR(Stamdata!G744 + Stamdata!G758 = Stamdata!G744,Stamdata!G744 + Stamdata!G758 = Stamdata!G760),0,1),0)+AssertionId(\"valueAssertion_NotesRevaluationReserveStatementOfChanges_PrtFST1NoExistenceThnPeriodStartMutationPeriodEnd1\")","Stamdata!G744,Stamdata!G760"]
["KvK: Jaarverantwoording 2023 NLGAAP - kleine rechtspersonen - publicatiestukken","valueAssertion_NotesRevaluationReserveStatementOfChanges_PrtFST1NoExistenceThnPeriodStartMutationPeriodEnd1","The reported value of `RevaluationReserve` at end of period SHOULD be equal to sum of reported value of `RevaluationReserve` at beginning of period and changes in that value during period, `RevaluationReserveMovement`, because `RevaluationReserveChangeAccountingPolicies` is not reported. ","non-blocking","IF(Stamdata!H745=\"\",IF(OR(Stamdata!H744 + Stamdata!H758 = Stamdata!H744,Stamdata!H744 + Stamdata!H758 = Stamdata!H760),0,1),0)+AssertionId(\"valueAssertion_NotesRevaluationReserveStatementOfChanges_PrtFST1NoExistenceThnPeriodStartMutationPeriodEnd1\")","Stamdata!H744,Stamdata!H760"]
["KvK: Jaarverantwoording 2023 NLGAAP - kleine rechtspersonen - publicatiestukken","valueAssertion_NotesRevaluationReserveStatementOfChanges_PrtFST1NoExistenceThnPeriodStartMutationPeriodEnd1","The reported value of `RevaluationReserve` at end of period SHOULD be equal to sum of reported value of `RevaluationReserve` at beginning of period and changes in that value during period, `RevaluationReserveMovement`, because `RevaluationReserveChangeAccountingPolicies` is not reported. ","non-blocking","IF(Stamdata!I745=\"\",IF(OR(Stamdata!I744 + Stamdata!I758 = Stamdata!I744,Stamdata!I744 + Stamdata!I758 = Stamdata!I760),0,1),0)+AssertionId(\"valueAssertion_NotesRevaluationReserveStatementOfChanges_PrtFST1NoExistenceThnPeriodStartMutationPeriodEnd1\")","Stamdata!I744,Stamdata!I760"]
["KvK: Jaarverantwoording 2023 NLGAAP - kleine rechtspersonen - publicatiestukken","valueAssertion_NotesRevaluationReserveStatementOfChanges_PrtFST1NoExistenceThnPeriodStartMutationPeriodEnd1","The reported value of `RevaluationReserve` at end of period SHOULD be equal to sum of reported value of `RevaluationReserve` at beginning of period and changes in that value during period, `RevaluationReserveMovement`, because `RevaluationReserveChangeAccountingPolicies` is not reported. ","non-blocking","IF(Stamdata!D769=\"\",IF(OR(Stamdata!D768 + Stamdata!D782 = Stamdata!D768,Stamdata!D768 + Stamdata!D782 = Stamdata!D784),0,1),0)+AssertionId(\"valueAssertion_NotesRevaluationReserveStatementOfChanges_PrtFST1NoExistenceThnPeriodStartMutationPeriodEnd1\")","Stamdata!D768,Stamdata!D784"]
["KvK: Jaarverantwoording 2023 NLGAAP - kleine rechtspersonen - publicatiestukken","valueAssertion_NotesRevaluationReserveStatementOfChanges_PrtFST1NoExistenceThnPeriodStartMutationPeriodEnd1","The reported value of `RevaluationReserve` at end of period SHOULD be equal to sum of reported value of `RevaluationReserve` at beginning of period and changes in that value during period, `RevaluationReserveMovement`, because `RevaluationReserveChangeAccountingPolicies` is not reported. ","non-blocking","IF(Stamdata!E769=\"\",IF(OR(Stamdata!E768 + Stamdata!E782 = Stamdata!E768,Stamdata!E768 + Stamdata!E782 = Stamdata!E784),0,1),0)+AssertionId(\"valueAssertion_NotesRevaluationReserveStatementOfChanges_PrtFST1NoExistenceThnPeriodStartMutationPeriodEnd1\")","Stamdata!E768,Stamdata!E784"]
["KvK: Jaarverantwoording 2023 NLGAAP - kleine rechtspersonen - publicatiestukken","valueAssertion_NotesRevaluationReserveStatementOfChanges_PrtFST1NoExistenceThnPeriodStartMutationPeriodEnd1","The reported value of `RevaluationReserve` at end of period SHOULD be equal to sum of reported value of `RevaluationReserve` at beginning of period and changes in that value during period, `RevaluationReserveMovement`, because `RevaluationReserveChangeAccountingPolicies` is not reported. ","non-blocking","IF(Stamdata!F769=\"\",IF(OR(Stamdata!F768 + Stamdata!F782 = Stamdata!F768,Stamdata!F768 + Stamdata!F782 = Stamdata!F784),0,1),0)+AssertionId(\"valueAssertion_NotesRevaluationReserveStatementOfChanges_PrtFST1NoExistenceThnPeriodStartMutationPeriodEnd1\")","Stamdata!F768,Stamdata!F784"]
["KvK: Jaarverantwoording 2023 NLGAAP - kleine rechtspersonen - publicatiestukken","valueAssertion_NotesRevaluationReserveStatementOfChanges_PrtFST1NoExistenceThnPeriodStartMutationPeriodEnd1","The reported value of `RevaluationReserve` at end of period SHOULD be equal to sum of reported value of `RevaluationReserve` at beginning of period and changes in that value during period, `RevaluationReserveMovement`, because `RevaluationReserveChangeAccountingPolicies` is not reported. ","non-blocking","IF(Stamdata!G769=\"\",IF(OR(Stamdata!G768 + Stamdata!G782 = Stamdata!G768,Stamdata!G768 + Stamdata!G782 = Stamdata!G784),0,1),0)+AssertionId(\"valueAssertion_NotesRevaluationReserveStatementOfChanges_PrtFST1NoExistenceThnPeriodStartMutationPeriodEnd1\")","Stamdata!G768,Stamdata!G784"]
["KvK: Jaarverantwoording 2023 NLGAAP - kleine rechtspersonen - publicatiestukken","valueAssertion_NotesRevaluationReserveStatementOfChanges_PrtFST1NoExistenceThnPeriodStartMutationPeriodEnd1","The reported value of `RevaluationReserve` at end of period SHOULD be equal to sum of reported value of `RevaluationReserve` at beginning of period and changes in that value during period, `RevaluationReserveMovement`, because `RevaluationReserveChangeAccountingPolicies` is not reported. ","non-blocking","IF(Stamdata!H769=\"\",IF(OR(Stamdata!H768 + Stamdata!H782 = Stamdata!H768,Stamdata!H768 + Stamdata!H782 = Stamdata!H784),0,1),0)+AssertionId(\"valueAssertion_NotesRevaluationReserveStatementOfChanges_PrtFST1NoExistenceThnPeriodStartMutationPeriodEnd1\")","Stamdata!H768,Stamdata!H784"]
["KvK: Jaarverantwoording 2023 NLGAAP - kleine rechtspersonen - publicatiestukken","valueAssertion_NotesRevaluationReserveStatementOfChanges_PrtFST1NoExistenceThnPeriodStartMutationPeriodEnd1","The reported value of `RevaluationReserve` at end of period SHOULD be equal to sum of reported value of `RevaluationReserve` at beginning of period and changes in that value during period, `RevaluationReserveMovement`, because `RevaluationReserveChangeAccountingPolicies` is not reported. ","non-blocking","IF(Stamdata!I769=\"\",IF(OR(Stamdata!I768 + Stamdata!I782 = Stamdata!I768,Stamdata!I768 + Stamdata!I782 = Stamdata!I784),0,1),0)+AssertionId(\"valueAssertion_NotesRevaluationReserveStatementOfChanges_PrtFST1NoExistenceThnPeriodStartMutationPeriodEnd1\")","Stamdata!I768,Stamdata!I784"]
["KvK: Jaarverantwoording 2023 NLGAAP - kleine rechtspersonen - publicatiestukken","valueAssertion_NotesRevaluationReserveStatementOfChanges_PrtFST1SumOfChildrenParentCredit1E1","`RevaluationReserveMovement` SHOULD be equal to the summation of the underlying values. ","non-blocking","IF(OR(not(AND(Stamdata!D752=\"\",Stamdata!D753=\"\",Stamdata!D754=\"\",Stamdata!D755=\"\")),not(AND(Stamdata!D749=\"\",Stamdata!D750=\"\",Stamdata!D751=\"\",Stamdata!D756=\"\"))),IF( Stamdata!D758 = sum(Stamdata!D752,Stamdata!D753,Stamdata!D754,Stamdata!D755)- sum(Stamdata!D749,Stamdata!D750,Stamdata!D751,Stamdata!D756),0,1),0)+AssertionId(\"valueAssertion_NotesRevaluationReserveStatementOfChanges_PrtFST1SumOfChildrenParentCredit1E1\")","Stamdata!D758"]
["KvK: Jaarverantwoording 2023 NLGAAP - kleine rechtspersonen - publicatiestukken","valueAssertion_NotesRevaluationReserveStatementOfChanges_PrtFST1SumOfChildrenParentCredit1E1","`RevaluationReserveMovement` SHOULD be equal to the summation of the underlying values. ","non-blocking","IF(OR(not(AND(Stamdata!E752=\"\",Stamdata!E753=\"\",Stamdata!E754=\"\",Stamdata!E755=\"\")),not(AND(Stamdata!E749=\"\",Stamdata!E750=\"\",Stamdata!E751=\"\",Stamdata!E756=\"\"))),IF( Stamdata!E758 = sum(Stamdata!E752,Stamdata!E753,Stamdata!E754,Stamdata!E755)- sum(Stamdata!E749,Stamdata!E750,Stamdata!E751,Stamdata!E756),0,1),0)+AssertionId(\"valueAssertion_NotesRevaluationReserveStatementOfChanges_PrtFST1SumOfChildrenParentCredit1E1\")","Stamdata!E758"]
["KvK: Jaarverantwoording 2023 NLGAAP - kleine rechtspersonen - publicatiestukken","valueAssertion_NotesRevaluationReserveStatementOfChanges_PrtFST1SumOfChildrenParentCredit1E1","`RevaluationReserveMovement` SHOULD be equal to the summation of the underlying values. ","non-blocking","IF(OR(not(AND(Stamdata!F752=\"\",Stamdata!F753=\"\",Stamdata!F754=\"\",Stamdata!F755=\"\")),not(AND(Stamdata!F749=\"\",Stamdata!F750=\"\",Stamdata!F751=\"\",Stamdata!F756=\"\"))),IF( Stamdata!F758 = sum(Stamdata!F752,Stamdata!F753,Stamdata!F754,Stamdata!F755)- sum(Stamdata!F749,Stamdata!F750,Stamdata!F751,Stamdata!F756),0,1),0)+AssertionId(\"valueAssertion_NotesRevaluationReserveStatementOfChanges_PrtFST1SumOfChildrenParentCredit1E1\")","Stamdata!F758"]
["KvK: Jaarverantwoording 2023 NLGAAP - kleine rechtspersonen - publicatiestukken","valueAssertion_NotesRevaluationReserveStatementOfChanges_PrtFST1SumOfChildrenParentCredit1E1","`RevaluationReserveMovement` SHOULD be equal to the summation of the underlying values. ","non-blocking","IF(OR(not(AND(Stamdata!G752=\"\",Stamdata!G753=\"\",Stamdata!G754=\"\",Stamdata!G755=\"\")),not(AND(Stamdata!G749=\"\",Stamdata!G750=\"\",Stamdata!G751=\"\",Stamdata!G756=\"\"))),IF( Stamdata!G758 = sum(Stamdata!G752,Stamdata!G753,Stamdata!G754,Stamdata!G755)- sum(Stamdata!G749,Stamdata!G750,Stamdata!G751,Stamdata!G756),0,1),0)+AssertionId(\"valueAssertion_NotesRevaluationReserveStatementOfChanges_PrtFST1SumOfChildrenParentCredit1E1\")","Stamdata!G758"]
["KvK: Jaarverantwoording 2023 NLGAAP - kleine rechtspersonen - publicatiestukken","valueAssertion_NotesRevaluationReserveStatementOfChanges_PrtFST1SumOfChildrenParentCredit1E1","`RevaluationReserveMovement` SHOULD be equal to the summation of the underlying values. ","non-blocking","IF(OR(not(AND(Stamdata!H752=\"\",Stamdata!H753=\"\",Stamdata!H754=\"\",Stamdata!H755=\"\")),not(AND(Stamdata!H749=\"\",Stamdata!H750=\"\",Stamdata!H751=\"\",Stamdata!H756=\"\"))),IF( Stamdata!H758 = sum(Stamdata!H752,Stamdata!H753,Stamdata!H754,Stamdata!H755)- sum(Stamdata!H749,Stamdata!H750,Stamdata!H751,Stamdata!H756),0,1),0)+AssertionId(\"valueAssertion_NotesRevaluationReserveStatementOfChanges_PrtFST1SumOfChildrenParentCredit1E1\")","Stamdata!H758"]
["KvK: Jaarverantwoording 2023 NLGAAP - kleine rechtspersonen - publicatiestukken","valueAssertion_NotesRevaluationReserveStatementOfChanges_PrtFST1SumOfChildrenParentCredit1E1","`RevaluationReserveMovement` SHOULD be equal to the summation of the underlying values. ","non-blocking","IF(OR(not(AND(Stamdata!I752=\"\",Stamdata!I753=\"\",Stamdata!I754=\"\",Stamdata!I755=\"\")),not(AND(Stamdata!I749=\"\",Stamdata!I750=\"\",Stamdata!I751=\"\",Stamdata!I756=\"\"))),IF( Stamdata!I758 = sum(Stamdata!I752,Stamdata!I753,Stamdata!I754,Stamdata!I755)- sum(Stamdata!I749,Stamdata!I750,Stamdata!I751,Stamdata!I756),0,1),0)+AssertionId(\"valueAssertion_NotesRevaluationReserveStatementOfChanges_PrtFST1SumOfChildrenParentCredit1E1\")","Stamdata!I758"]
["KvK: Jaarverantwoording 2023 NLGAAP - kleine rechtspersonen - publicatiestukken","valueAssertion_NotesRevaluationReserveStatementOfChanges_PrtFST1SumOfChildrenParentCredit1E1","`RevaluationReserveMovement` SHOULD be equal to the summation of the underlying values. ","non-blocking","IF(OR(not(AND(Stamdata!D776=\"\",Stamdata!D777=\"\",Stamdata!D778=\"\",Stamdata!D779=\"\")),not(AND(Stamdata!D773=\"\",Stamdata!D774=\"\",Stamdata!D775=\"\",Stamdata!D780=\"\"))),IF( Stamdata!D782 = sum(Stamdata!D776,Stamdata!D777,Stamdata!D778,Stamdata!D779)- sum(Stamdata!D773,Stamdata!D774,Stamdata!D775,Stamdata!D780),0,1),0)+AssertionId(\"valueAssertion_NotesRevaluationReserveStatementOfChanges_PrtFST1SumOfChildrenParentCredit1E1\")","Stamdata!D782"]
["KvK: Jaarverantwoording 2023 NLGAAP - kleine rechtspersonen - publicatiestukken","valueAssertion_NotesRevaluationReserveStatementOfChanges_PrtFST1SumOfChildrenParentCredit1E1","`RevaluationReserveMovement` SHOULD be equal to the summation of the underlying values. ","non-blocking","IF(OR(not(AND(Stamdata!E776=\"\",Stamdata!E777=\"\",Stamdata!E778=\"\",Stamdata!E779=\"\")),not(AND(Stamdata!E773=\"\",Stamdata!E774=\"\",Stamdata!E775=\"\",Stamdata!E780=\"\"))),IF( Stamdata!E782 = sum(Stamdata!E776,Stamdata!E777,Stamdata!E778,Stamdata!E779)- sum(Stamdata!E773,Stamdata!E774,Stamdata!E775,Stamdata!E780),0,1),0)+AssertionId(\"valueAssertion_NotesRevaluationReserveStatementOfChanges_PrtFST1SumOfChildrenParentCredit1E1\")","Stamdata!E782"]
["KvK: Jaarverantwoording 2023 NLGAAP - kleine rechtspersonen - publicatiestukken","valueAssertion_NotesRevaluationReserveStatementOfChanges_PrtFST1SumOfChildrenParentCredit1E1","`RevaluationReserveMovement` SHOULD be equal to the summation of the underlying values. ","non-blocking","IF(OR(not(AND(Stamdata!F776=\"\",Stamdata!F777=\"\",Stamdata!F778=\"\",Stamdata!F779=\"\")),not(AND(Stamdata!F773=\"\",Stamdata!F774=\"\",Stamdata!F775=\"\",Stamdata!F780=\"\"))),IF( Stamdata!F782 = sum(Stamdata!F776,Stamdata!F777,Stamdata!F778,Stamdata!F779)- sum(Stamdata!F773,Stamdata!F774,Stamdata!F775,Stamdata!F780),0,1),0)+AssertionId(\"valueAssertion_NotesRevaluationReserveStatementOfChanges_PrtFST1SumOfChildrenParentCredit1E1\")","Stamdata!F782"]
["KvK: Jaarverantwoording 2023 NLGAAP - kleine rechtspersonen - publicatiestukken","valueAssertion_NotesRevaluationReserveStatementOfChanges_PrtFST1SumOfChildrenParentCredit1E1","`RevaluationReserveMovement` SHOULD be equal to the summation of the underlying values. ","non-blocking","IF(OR(not(AND(Stamdata!G776=\"\",Stamdata!G777=\"\",Stamdata!G778=\"\",Stamdata!G779=\"\")),not(AND(Stamdata!G773=\"\",Stamdata!G774=\"\",Stamdata!G775=\"\",Stamdata!G780=\"\"))),IF( Stamdata!G782 = sum(Stamdata!G776,Stamdata!G777,Stamdata!G778,Stamdata!G779)- sum(Stamdata!G773,Stamdata!G774,Stamdata!G775,Stamdata!G780),0,1),0)+AssertionId(\"valueAssertion_NotesRevaluationReserveStatementOfChanges_PrtFST1SumOfChildrenParentCredit1E1\")","Stamdata!G782"]
["KvK: Jaarverantwoording 2023 NLGAAP - kleine rechtspersonen - publicatiestukken","valueAssertion_NotesRevaluationReserveStatementOfChanges_PrtFST1SumOfChildrenParentCredit1E1","`RevaluationReserveMovement` SHOULD be equal to the summation of the underlying values. ","non-blocking","IF(OR(not(AND(Stamdata!H776=\"\",Stamdata!H777=\"\",Stamdata!H778=\"\",Stamdata!H779=\"\")),not(AND(Stamdata!H773=\"\",Stamdata!H774=\"\",Stamdata!H775=\"\",Stamdata!H780=\"\"))),IF( Stamdata!H782 = sum(Stamdata!H776,Stamdata!H777,Stamdata!H778,Stamdata!H779)- sum(Stamdata!H773,Stamdata!H774,Stamdata!H775,Stamdata!H780),0,1),0)+AssertionId(\"valueAssertion_NotesRevaluationReserveStatementOfChanges_PrtFST1SumOfChildrenParentCredit1E1\")","Stamdata!H782"]
["KvK: Jaarverantwoording 2023 NLGAAP - kleine rechtspersonen - publicatiestukken","valueAssertion_NotesRevaluationReserveStatementOfChanges_PrtFST1SumOfChildrenParentCredit1E1","`RevaluationReserveMovement` SHOULD be equal to the summation of the underlying values. ","non-blocking","IF(OR(not(AND(Stamdata!I776=\"\",Stamdata!I777=\"\",Stamdata!I778=\"\",Stamdata!I779=\"\")),not(AND(Stamdata!I773=\"\",Stamdata!I774=\"\",Stamdata!I775=\"\",Stamdata!I780=\"\"))),IF( Stamdata!I782 = sum(Stamdata!I776,Stamdata!I777,Stamdata!I778,Stamdata!I779)- sum(Stamdata!I773,Stamdata!I774,Stamdata!I775,Stamdata!I780),0,1),0)+AssertionId(\"valueAssertion_NotesRevaluationReserveStatementOfChanges_PrtFST1SumOfChildrenParentCredit1E1\")","Stamdata!I782"]
["KvK: Jaarverantwoording 2023 NLGAAP - kleine rechtspersonen - publicatiestukken","valueAssertion_NotesShareCapitalStatementOfChangesNumberofSharesSpecification_PrtFST1PeriodStartMutationPeriodEnd1","Reported value of `ShareCapitalNumberShares` at end of period SHOULD be equal to sum of reported value of `ShareCapitalNumberShares` at beginning of period and changes in that value during period, `ShareCapitalNumberSharesMovement`. ","non-blocking","IF(OR(Stamdata!D665 + Stamdata!D675 = Stamdata!D665,Stamdata!D665 + Stamdata!D675 = Stamdata!D677),0,1)+AssertionId(\"valueAssertion_NotesShareCapitalStatementOfChangesNumberofSharesSpecification_PrtFST1PeriodStartMutationPeriodEnd1\")","Stamdata!D665,Stamdata!D677"]
["KvK: Jaarverantwoording 2023 NLGAAP - kleine rechtspersonen - publicatiestukken","valueAssertion_NotesShareCapitalStatementOfChangesNumberofSharesSpecification_PrtFST1PeriodStartMutationPeriodEnd1","Reported value of `ShareCapitalNumberShares` at end of period SHOULD be equal to sum of reported value of `ShareCapitalNumberShares` at beginning of period and changes in that value during period, `ShareCapitalNumberSharesMovement`. ","non-blocking","IF(OR(Stamdata!E665 + Stamdata!E675 = Stamdata!E665,Stamdata!E665 + Stamdata!E675 = Stamdata!E677),0,1)+AssertionId(\"valueAssertion_NotesShareCapitalStatementOfChangesNumberofSharesSpecification_PrtFST1PeriodStartMutationPeriodEnd1\")","Stamdata!E665,Stamdata!E677"]
["KvK: Jaarverantwoording 2023 NLGAAP - kleine rechtspersonen - publicatiestukken","valueAssertion_NotesShareCapitalStatementOfChangesNumberofSharesSpecification_PrtFST1PeriodStartMutationPeriodEnd1","Reported value of `ShareCapitalNumberShares` at end of period SHOULD be equal to sum of reported value of `ShareCapitalNumberShares` at beginning of period and changes in that value during period, `ShareCapitalNumberSharesMovement`. ","non-blocking","IF(OR(Stamdata!F665 + Stamdata!F675 = Stamdata!F665,Stamdata!F665 + Stamdata!F675 = Stamdata!F677),0,1)+AssertionId(\"valueAssertion_NotesShareCapitalStatementOfChangesNumberofSharesSpecification_PrtFST1PeriodStartMutationPeriodEnd1\")","Stamdata!F665,Stamdata!F677"]
["KvK: Jaarverantwoording 2023 NLGAAP - kleine rechtspersonen - publicatiestukken","valueAssertion_NotesShareCapitalStatementOfChangesNumberofSharesSpecification_PrtFST1PeriodStartMutationPeriodEnd1","Reported value of `ShareCapitalNumberShares` at end of period SHOULD be equal to sum of reported value of `ShareCapitalNumberShares` at beginning of period and changes in that value during period, `ShareCapitalNumberSharesMovement`. ","non-blocking","IF(OR(Stamdata!G665 + Stamdata!G675 = Stamdata!G665,Stamdata!G665 + Stamdata!G675 = Stamdata!G677),0,1)+AssertionId(\"valueAssertion_NotesShareCapitalStatementOfChangesNumberofSharesSpecification_PrtFST1PeriodStartMutationPeriodEnd1\")","Stamdata!G665,Stamdata!G677"]
["KvK: Jaarverantwoording 2023 NLGAAP - kleine rechtspersonen - publicatiestukken","valueAssertion_NotesShareCapitalStatementOfChangesNumberofSharesSpecification_PrtFST1PeriodStartMutationPeriodEnd1","Reported value of `ShareCapitalNumberShares` at end of period SHOULD be equal to sum of reported value of `ShareCapitalNumberShares` at beginning of period and changes in that value during period, `ShareCapitalNumberSharesMovement`. ","non-blocking","IF(OR(Stamdata!H665 + Stamdata!H675 = Stamdata!H665,Stamdata!H665 + Stamdata!H675 = Stamdata!H677),0,1)+AssertionId(\"valueAssertion_NotesShareCapitalStatementOfChangesNumberofSharesSpecification_PrtFST1PeriodStartMutationPeriodEnd1\")","Stamdata!H665,Stamdata!H677"]
["KvK: Jaarverantwoording 2023 NLGAAP - kleine rechtspersonen - publicatiestukken","valueAssertion_NotesShareCapitalStatementOfChangesNumberofSharesSpecification_PrtFST1PeriodStartMutationPeriodEnd1","Reported value of `ShareCapitalNumberShares` at end of period SHOULD be equal to sum of reported value of `ShareCapitalNumberShares` at beginning of period and changes in that value during period, `ShareCapitalNumberSharesMovement`. ","non-blocking","IF(OR(Stamdata!D688 + Stamdata!D698 = Stamdata!D688,Stamdata!D688 + Stamdata!D698 = Stamdata!D700),0,1)+AssertionId(\"valueAssertion_NotesShareCapitalStatementOfChangesNumberofSharesSpecification_PrtFST1PeriodStartMutationPeriodEnd1\")","Stamdata!D688,Stamdata!D700"]
["KvK: Jaarverantwoording 2023 NLGAAP - kleine rechtspersonen - publicatiestukken","valueAssertion_NotesShareCapitalStatementOfChangesNumberofSharesSpecification_PrtFST1PeriodStartMutationPeriodEnd1","Reported value of `ShareCapitalNumberShares` at end of period SHOULD be equal to sum of reported value of `ShareCapitalNumberShares` at beginning of period and changes in that value during period, `ShareCapitalNumberSharesMovement`. ","non-blocking","IF(OR(Stamdata!E688 + Stamdata!E698 = Stamdata!E688,Stamdata!E688 + Stamdata!E698 = Stamdata!E700),0,1)+AssertionId(\"valueAssertion_NotesShareCapitalStatementOfChangesNumberofSharesSpecification_PrtFST1PeriodStartMutationPeriodEnd1\")","Stamdata!E688,Stamdata!E700"]
["KvK: Jaarverantwoording 2023 NLGAAP - kleine rechtspersonen - publicatiestukken","valueAssertion_NotesShareCapitalStatementOfChangesNumberofSharesSpecification_PrtFST1PeriodStartMutationPeriodEnd1","Reported value of `ShareCapitalNumberShares` at end of period SHOULD be equal to sum of reported value of `ShareCapitalNumberShares` at beginning of period and changes in that value during period, `ShareCapitalNumberSharesMovement`. ","non-blocking","IF(OR(Stamdata!F688 + Stamdata!F698 = Stamdata!F688,Stamdata!F688 + Stamdata!F698 = Stamdata!F700),0,1)+AssertionId(\"valueAssertion_NotesShareCapitalStatementOfChangesNumberofSharesSpecification_PrtFST1PeriodStartMutationPeriodEnd1\")","Stamdata!F688,Stamdata!F700"]
["KvK: Jaarverantwoording 2023 NLGAAP - kleine rechtspersonen - publicatiestukken","valueAssertion_NotesShareCapitalStatementOfChangesNumberofSharesSpecification_PrtFST1PeriodStartMutationPeriodEnd1","Reported value of `ShareCapitalNumberShares` at end of period SHOULD be equal to sum of reported value of `ShareCapitalNumberShares` at beginning of period and changes in that value during period, `ShareCapitalNumberSharesMovement`. ","non-blocking","IF(OR(Stamdata!G688 + Stamdata!G698 = Stamdata!G688,Stamdata!G688 + Stamdata!G698 = Stamdata!G700),0,1)+AssertionId(\"valueAssertion_NotesShareCapitalStatementOfChangesNumberofSharesSpecification_PrtFST1PeriodStartMutationPeriodEnd1\")","Stamdata!G688,Stamdata!G700"]
["KvK: Jaarverantwoording 2023 NLGAAP - kleine rechtspersonen - publicatiestukken","valueAssertion_NotesShareCapitalStatementOfChangesNumberofSharesSpecification_PrtFST1PeriodStartMutationPeriodEnd1","Reported value of `ShareCapitalNumberShares` at end of period SHOULD be equal to sum of reported value of `ShareCapitalNumberShares` at beginning of period and changes in that value during period, `ShareCapitalNumberSharesMovement`. ","non-blocking","IF(OR(Stamdata!H688 + Stamdata!H698 = Stamdata!H688,Stamdata!H688 + Stamdata!H698 = Stamdata!H700),0,1)+AssertionId(\"valueAssertion_NotesShareCapitalStatementOfChangesNumberofSharesSpecification_PrtFST1PeriodStartMutationPeriodEnd1\")","Stamdata!H688,Stamdata!H700"]
["KvK: Jaarverantwoording 2023 NLGAAP - kleine rechtspersonen - publicatiestukken","valueAssertion_NotesShareCapitalStatementOfChangesNumberofSharesSpecification_PrtFST107Variables1","`ShareCapitalNumberSharesMovement` SHOULD be equal to + `ShareCapitalNumberSharesIssue` + `ShareCapitalNumberSharesPurchase` + `ShareCapitalNumberSharesGranting` + `ShareCapitalNumberSharesSale` + `ShareCapitalNumberSharesWithdrawal` + `ShareCapitalNumberSharesDistributionAsDividend` + `ShareCapitalNumberSharesOtherMovements`. ","non-blocking","IF(OR(not(Stamdata!D667=\"\"),not(Stamdata!D668=\"\"),not(Stamdata!D669=\"\"),not(Stamdata!D670=\"\"),not(Stamdata!D671=\"\"),not(Stamdata!D672=\"\"),not(Stamdata!D673=\"\")),IF(+ Stamdata!D667 + Stamdata!D668 + Stamdata!D669 + Stamdata!D670 + Stamdata!D671 + Stamdata!D672 + Stamdata!D673 = Stamdata!D675 ,0,1),0)+AssertionId(\"valueAssertion_NotesShareCapitalStatementOfChangesNumberofSharesSpecification_PrtFST107Variables1\")","Stamdata!D672"]
["KvK: Jaarverantwoording 2023 NLGAAP - kleine rechtspersonen - publicatiestukken","valueAssertion_NotesShareCapitalStatementOfChangesNumberofSharesSpecification_PrtFST107Variables1","`ShareCapitalNumberSharesMovement` SHOULD be equal to + `ShareCapitalNumberSharesIssue` + `ShareCapitalNumberSharesPurchase` + `ShareCapitalNumberSharesGranting` + `ShareCapitalNumberSharesSale` + `ShareCapitalNumberSharesWithdrawal` + `ShareCapitalNumberSharesDistributionAsDividend` + `ShareCapitalNumberSharesOtherMovements`. ","non-blocking","IF(OR(not(Stamdata!E667=\"\"),not(Stamdata!E668=\"\"),not(Stamdata!E669=\"\"),not(Stamdata!E670=\"\"),not(Stamdata!E671=\"\"),not(Stamdata!E672=\"\"),not(Stamdata!E673=\"\")),IF(+ Stamdata!E667 + Stamdata!E668 + Stamdata!E669 + Stamdata!E670 + Stamdata!E671 + Stamdata!E672 + Stamdata!E673 = Stamdata!E675 ,0,1),0)+AssertionId(\"valueAssertion_NotesShareCapitalStatementOfChangesNumberofSharesSpecification_PrtFST107Variables1\")","Stamdata!E672"]
["KvK: Jaarverantwoording 2023 NLGAAP - kleine rechtspersonen - publicatiestukken","valueAssertion_NotesShareCapitalStatementOfChangesNumberofSharesSpecification_PrtFST107Variables1","`ShareCapitalNumberSharesMovement` SHOULD be equal to + `ShareCapitalNumberSharesIssue` + `ShareCapitalNumberSharesPurchase` + `ShareCapitalNumberSharesGranting` + `ShareCapitalNumberSharesSale` + `ShareCapitalNumberSharesWithdrawal` + `ShareCapitalNumberSharesDistributionAsDividend` + `ShareCapitalNumberSharesOtherMovements`. ","non-blocking","IF(OR(not(Stamdata!F667=\"\"),not(Stamdata!F668=\"\"),not(Stamdata!F669=\"\"),not(Stamdata!F670=\"\"),not(Stamdata!F671=\"\"),not(Stamdata!F672=\"\"),not(Stamdata!F673=\"\")),IF(+ Stamdata!F667 + Stamdata!F668 + Stamdata!F669 + Stamdata!F670 + Stamdata!F671 + Stamdata!F672 + Stamdata!F673 = Stamdata!F675 ,0,1),0)+AssertionId(\"valueAssertion_NotesShareCapitalStatementOfChangesNumberofSharesSpecification_PrtFST107Variables1\")","Stamdata!F672"]
["KvK: Jaarverantwoording 2023 NLGAAP - kleine rechtspersonen - publicatiestukken","valueAssertion_NotesShareCapitalStatementOfChangesNumberofSharesSpecification_PrtFST107Variables1","`ShareCapitalNumberSharesMovement` SHOULD be equal to + `ShareCapitalNumberSharesIssue` + `ShareCapitalNumberSharesPurchase` + `ShareCapitalNumberSharesGranting` + `ShareCapitalNumberSharesSale` + `ShareCapitalNumberSharesWithdrawal` + `ShareCapitalNumberSharesDistributionAsDividend` + `ShareCapitalNumberSharesOtherMovements`. ","non-blocking","IF(OR(not(Stamdata!G667=\"\"),not(Stamdata!G668=\"\"),not(Stamdata!G669=\"\"),not(Stamdata!G670=\"\"),not(Stamdata!G671=\"\"),not(Stamdata!G672=\"\"),not(Stamdata!G673=\"\")),IF(+ Stamdata!G667 + Stamdata!G668 + Stamdata!G669 + Stamdata!G670 + Stamdata!G671 + Stamdata!G672 + Stamdata!G673 = Stamdata!G675 ,0,1),0)+AssertionId(\"valueAssertion_NotesShareCapitalStatementOfChangesNumberofSharesSpecification_PrtFST107Variables1\")","Stamdata!G672"]
["KvK: Jaarverantwoording 2023 NLGAAP - kleine rechtspersonen - publicatiestukken","valueAssertion_NotesShareCapitalStatementOfChangesNumberofSharesSpecification_PrtFST107Variables1","`ShareCapitalNumberSharesMovement` SHOULD be equal to + `ShareCapitalNumberSharesIssue` + `ShareCapitalNumberSharesPurchase` + `ShareCapitalNumberSharesGranting` + `ShareCapitalNumberSharesSale` + `ShareCapitalNumberSharesWithdrawal` + `ShareCapitalNumberSharesDistributionAsDividend` + `ShareCapitalNumberSharesOtherMovements`. ","non-blocking","IF(OR(not(Stamdata!H667=\"\"),not(Stamdata!H668=\"\"),not(Stamdata!H669=\"\"),not(Stamdata!H670=\"\"),not(Stamdata!H671=\"\"),not(Stamdata!H672=\"\"),not(Stamdata!H673=\"\")),IF(+ Stamdata!H667 + Stamdata!H668 + Stamdata!H669 + Stamdata!H670 + Stamdata!H671 + Stamdata!H672 + Stamdata!H673 = Stamdata!H675 ,0,1),0)+AssertionId(\"valueAssertion_NotesShareCapitalStatementOfChangesNumberofSharesSpecification_PrtFST107Variables1\")","Stamdata!H672"]
["KvK: Jaarverantwoording 2023 NLGAAP - kleine rechtspersonen - publicatiestukken","valueAssertion_NotesShareCapitalStatementOfChangesNumberofSharesSpecification_PrtFST107Variables1","`ShareCapitalNumberSharesMovement` SHOULD be equal to + `ShareCapitalNumberSharesIssue` + `ShareCapitalNumberSharesPurchase` + `ShareCapitalNumberSharesGranting` + `ShareCapitalNumberSharesSale` + `ShareCapitalNumberSharesWithdrawal` + `ShareCapitalNumberSharesDistributionAsDividend` + `ShareCapitalNumberSharesOtherMovements`. ","non-blocking","IF(OR(not(Stamdata!D690=\"\"),not(Stamdata!D691=\"\"),not(Stamdata!D692=\"\"),not(Stamdata!D693=\"\"),not(Stamdata!D694=\"\"),not(Stamdata!D695=\"\"),not(Stamdata!D696=\"\")),IF(+ Stamdata!D690 + Stamdata!D691 + Stamdata!D692 + Stamdata!D693 + Stamdata!D694 + Stamdata!D695 + Stamdata!D696 = Stamdata!D698 ,0,1),0)+AssertionId(\"valueAssertion_NotesShareCapitalStatementOfChangesNumberofSharesSpecification_PrtFST107Variables1\")","Stamdata!D695"]
["KvK: Jaarverantwoording 2023 NLGAAP - kleine rechtspersonen - publicatiestukken","valueAssertion_NotesShareCapitalStatementOfChangesNumberofSharesSpecification_PrtFST107Variables1","`ShareCapitalNumberSharesMovement` SHOULD be equal to + `ShareCapitalNumberSharesIssue` + `ShareCapitalNumberSharesPurchase` + `ShareCapitalNumberSharesGranting` + `ShareCapitalNumberSharesSale` + `ShareCapitalNumberSharesWithdrawal` + `ShareCapitalNumberSharesDistributionAsDividend` + `ShareCapitalNumberSharesOtherMovements`. ","non-blocking","IF(OR(not(Stamdata!E690=\"\"),not(Stamdata!E691=\"\"),not(Stamdata!E692=\"\"),not(Stamdata!E693=\"\"),not(Stamdata!E694=\"\"),not(Stamdata!E695=\"\"),not(Stamdata!E696=\"\")),IF(+ Stamdata!E690 + Stamdata!E691 + Stamdata!E692 + Stamdata!E693 + Stamdata!E694 + Stamdata!E695 + Stamdata!E696 = Stamdata!E698 ,0,1),0)+AssertionId(\"valueAssertion_NotesShareCapitalStatementOfChangesNumberofSharesSpecification_PrtFST107Variables1\")","Stamdata!E695"]
["KvK: Jaarverantwoording 2023 NLGAAP - kleine rechtspersonen - publicatiestukken","valueAssertion_NotesShareCapitalStatementOfChangesNumberofSharesSpecification_PrtFST107Variables1","`ShareCapitalNumberSharesMovement` SHOULD be equal to + `ShareCapitalNumberSharesIssue` + `ShareCapitalNumberSharesPurchase` + `ShareCapitalNumberSharesGranting` + `ShareCapitalNumberSharesSale` + `ShareCapitalNumberSharesWithdrawal` + `ShareCapitalNumberSharesDistributionAsDividend` + `ShareCapitalNumberSharesOtherMovements`. ","non-blocking","IF(OR(not(Stamdata!F690=\"\"),not(Stamdata!F691=\"\"),not(Stamdata!F692=\"\"),not(Stamdata!F693=\"\"),not(Stamdata!F694=\"\"),not(Stamdata!F695=\"\"),not(Stamdata!F696=\"\")),IF(+ Stamdata!F690 + Stamdata!F691 + Stamdata!F692 + Stamdata!F693 + Stamdata!F694 + Stamdata!F695 + Stamdata!F696 = Stamdata!F698 ,0,1),0)+AssertionId(\"valueAssertion_NotesShareCapitalStatementOfChangesNumberofSharesSpecification_PrtFST107Variables1\")","Stamdata!F695"]
["KvK: Jaarverantwoording 2023 NLGAAP - kleine rechtspersonen - publicatiestukken","valueAssertion_NotesShareCapitalStatementOfChangesNumberofSharesSpecification_PrtFST107Variables1","`ShareCapitalNumberSharesMovement` SHOULD be equal to + `ShareCapitalNumberSharesIssue` + `ShareCapitalNumberSharesPurchase` + `ShareCapitalNumberSharesGranting` + `ShareCapitalNumberSharesSale` + `ShareCapitalNumberSharesWithdrawal` + `ShareCapitalNumberSharesDistributionAsDividend` + `ShareCapitalNumberSharesOtherMovements`. ","non-blocking","IF(OR(not(Stamdata!G690=\"\"),not(Stamdata!G691=\"\"),not(Stamdata!G692=\"\"),not(Stamdata!G693=\"\"),not(Stamdata!G694=\"\"),not(Stamdata!G695=\"\"),not(Stamdata!G696=\"\")),IF(+ Stamdata!G690 + Stamdata!G691 + Stamdata!G692 + Stamdata!G693 + Stamdata!G694 + Stamdata!G695 + Stamdata!G696 = Stamdata!G698 ,0,1),0)+AssertionId(\"valueAssertion_NotesShareCapitalStatementOfChangesNumberofSharesSpecification_PrtFST107Variables1\")","Stamdata!G695"]
["KvK: Jaarverantwoording 2023 NLGAAP - kleine rechtspersonen - publicatiestukken","valueAssertion_NotesShareCapitalStatementOfChangesNumberofSharesSpecification_PrtFST107Variables1","`ShareCapitalNumberSharesMovement` SHOULD be equal to + `ShareCapitalNumberSharesIssue` + `ShareCapitalNumberSharesPurchase` + `ShareCapitalNumberSharesGranting` + `ShareCapitalNumberSharesSale` + `ShareCapitalNumberSharesWithdrawal` + `ShareCapitalNumberSharesDistributionAsDividend` + `ShareCapitalNumberSharesOtherMovements`. ","non-blocking","IF(OR(not(Stamdata!H690=\"\"),not(Stamdata!H691=\"\"),not(Stamdata!H692=\"\"),not(Stamdata!H693=\"\"),not(Stamdata!H694=\"\"),not(Stamdata!H695=\"\"),not(Stamdata!H696=\"\")),IF(+ Stamdata!H690 + Stamdata!H691 + Stamdata!H692 + Stamdata!H693 + Stamdata!H694 + Stamdata!H695 + Stamdata!H696 = Stamdata!H698 ,0,1),0)+AssertionId(\"valueAssertion_NotesShareCapitalStatementOfChangesNumberofSharesSpecification_PrtFST107Variables1\")","Stamdata!H695"]
["KvK: Jaarverantwoording 2023 NLGAAP - kleine rechtspersonen - publicatiestukken","valueAssertion_SigningFinancialStatements_PrtDateEarlierThanEQDateCurrent1","The date reported for `SignatureManagingSupervisoryDirectorsDate` SHOULD be earlier than, or equal to, the current date. ","non-blocking","IF(Stamdata!D1408 <= NOW,0,1)+AssertionId(\"valueAssertion_SigningFinancialStatements_PrtDateEarlierThanEQDateCurrent1\")","Stamdata!D1408"]
["KvK: Jaarverantwoording 2023 NLGAAP - kleine rechtspersonen - publicatiestukken","valueAssertion_SigningFinancialStatements_PrtDateEarlierThanEQDateCurrent1","The date reported for `SignatureManagingSupervisoryDirectorsDate` SHOULD be earlier than, or equal to, the current date. ","non-blocking","IF(Stamdata!E1408 <= NOW,0,1)+AssertionId(\"valueAssertion_SigningFinancialStatements_PrtDateEarlierThanEQDateCurrent1\")","Stamdata!E1408"]
["KvK: Jaarverantwoording 2023 NLGAAP - kleine rechtspersonen - publicatiestukken","valueAssertion_SigningFinancialStatements_PrtDateEarlierThanEQDateCurrent1","The date reported for `SignatureManagingSupervisoryDirectorsDate` SHOULD be earlier than, or equal to, the current date. ","non-blocking","IF(Stamdata!F1408 <= NOW,0,1)+AssertionId(\"valueAssertion_SigningFinancialStatements_PrtDateEarlierThanEQDateCurrent1\")","Stamdata!F1408"]
["KvK: Jaarverantwoording 2023 NLGAAP - kleine rechtspersonen - publicatiestukken","valueAssertion_SigningFinancialStatements_PrtDateEarlierThanEQDateCurrent1","The date reported for `SignatureManagingSupervisoryDirectorsDate` SHOULD be earlier than, or equal to, the current date. ","non-blocking","IF(Stamdata!G1408 <= NOW,0,1)+AssertionId(\"valueAssertion_SigningFinancialStatements_PrtDateEarlierThanEQDateCurrent1\")","Stamdata!G1408"]
["KvK: Jaarverantwoording 2023 NLGAAP - kleine rechtspersonen - publicatiestukken","valueAssertion_SigningFinancialStatements_PrtDateEarlierThanEQDateCurrent1","The date reported for `SignatureManagingSupervisoryDirectorsDate` SHOULD be earlier than, or equal to, the current date. ","non-blocking","IF(Stamdata!H1408 <= NOW,0,1)+AssertionId(\"valueAssertion_SigningFinancialStatements_PrtDateEarlierThanEQDateCurrent1\")","Stamdata!H1408"]
["KvK: Jaarverantwoording 2023 NLGAAP - kleine rechtspersonen - publicatiestukken","valueAssertion_SigningFinancialStatements_PrtValueThnExistence1","`SignatureManagingSupervisoryDirectorsDate` SHOULD exist at least once, because the reported value of `DirectorSignedStatus` is equal to `Ja`. ","non-blocking","IF(Stamdata!D1409 = \"Ja\",IF(not(Stamdata!D1408=\"\"),0,1),0)+AssertionId(\"valueAssertion_SigningFinancialStatements_PrtValueThnExistence1\")","Stamdata!D1408"]
["KvK: Jaarverantwoording 2023 NLGAAP - kleine rechtspersonen - publicatiestukken","valueAssertion_SigningFinancialStatements_PrtValueThnExistence1","`SignatureManagingSupervisoryDirectorsDate` SHOULD exist at least once, because the reported value of `DirectorSignedStatus` is equal to `Ja`. ","non-blocking","IF(Stamdata!E1409 = \"Ja\",IF(not(Stamdata!E1408=\"\"),0,1),0)+AssertionId(\"valueAssertion_SigningFinancialStatements_PrtValueThnExistence1\")","Stamdata!E1408"]
["KvK: Jaarverantwoording 2023 NLGAAP - kleine rechtspersonen - publicatiestukken","valueAssertion_SigningFinancialStatements_PrtValueThnExistence1","`SignatureManagingSupervisoryDirectorsDate` SHOULD exist at least once, because the reported value of `DirectorSignedStatus` is equal to `Ja`. ","non-blocking","IF(Stamdata!F1409 = \"Ja\",IF(not(Stamdata!F1408=\"\"),0,1),0)+AssertionId(\"valueAssertion_SigningFinancialStatements_PrtValueThnExistence1\")","Stamdata!F1408"]
["KvK: Jaarverantwoording 2023 NLGAAP - kleine rechtspersonen - publicatiestukken","valueAssertion_SigningFinancialStatements_PrtValueThnExistence1","`SignatureManagingSupervisoryDirectorsDate` SHOULD exist at least once, because the reported value of `DirectorSignedStatus` is equal to `Ja`. ","non-blocking","IF(Stamdata!G1409 = \"Ja\",IF(not(Stamdata!G1408=\"\"),0,1),0)+AssertionId(\"valueAssertion_SigningFinancialStatements_PrtValueThnExistence1\")","Stamdata!G1408"]
["KvK: Jaarverantwoording 2023 NLGAAP - kleine rechtspersonen - publicatiestukken","valueAssertion_SigningFinancialStatements_PrtValueThnExistence1","`SignatureManagingSupervisoryDirectorsDate` SHOULD exist at least once, because the reported value of `DirectorSignedStatus` is equal to `Ja`. ","non-blocking","IF(Stamdata!H1409 = \"Ja\",IF(not(Stamdata!H1408=\"\"),0,1),0)+AssertionId(\"valueAssertion_SigningFinancialStatements_PrtValueThnExistence1\")","Stamdata!H1408"]
["KvK: Jaarverantwoording 2023 NLGAAP - kleine rechtspersonen - publicatiestukken","valueAssertion_SigningFinancialStatements_PrtValueThnExistence2","`SignatureManagingSupervisoryDirectorsLocation` SHOULD exist at least once, because the reported value of `DirectorSignedStatus` is equal to `Ja`. ","non-blocking","IF(Stamdata!D1409 = \"Ja\",IF(not(Stamdata!D1407=\"\"),0,1),0)+AssertionId(\"valueAssertion_SigningFinancialStatements_PrtValueThnExistence2\")","Stamdata!D1407"]
["KvK: Jaarverantwoording 2023 NLGAAP - kleine rechtspersonen - publicatiestukken","valueAssertion_SigningFinancialStatements_PrtValueThnExistence2","`SignatureManagingSupervisoryDirectorsLocation` SHOULD exist at least once, because the reported value of `DirectorSignedStatus` is equal to `Ja`. ","non-blocking","IF(Stamdata!E1409 = \"Ja\",IF(not(Stamdata!E1407=\"\"),0,1),0)+AssertionId(\"valueAssertion_SigningFinancialStatements_PrtValueThnExistence2\")","Stamdata!E1407"]
["KvK: Jaarverantwoording 2023 NLGAAP - kleine rechtspersonen - publicatiestukken","valueAssertion_SigningFinancialStatements_PrtValueThnExistence2","`SignatureManagingSupervisoryDirectorsLocation` SHOULD exist at least once, because the reported value of `DirectorSignedStatus` is equal to `Ja`. ","non-blocking","IF(Stamdata!F1409 = \"Ja\",IF(not(Stamdata!F1407=\"\"),0,1),0)+AssertionId(\"valueAssertion_SigningFinancialStatements_PrtValueThnExistence2\")","Stamdata!F1407"]
["KvK: Jaarverantwoording 2023 NLGAAP - kleine rechtspersonen - publicatiestukken","valueAssertion_SigningFinancialStatements_PrtValueThnExistence2","`SignatureManagingSupervisoryDirectorsLocation` SHOULD exist at least once, because the reported value of `DirectorSignedStatus` is equal to `Ja`. ","non-blocking","IF(Stamdata!G1409 = \"Ja\",IF(not(Stamdata!G1407=\"\"),0,1),0)+AssertionId(\"valueAssertion_SigningFinancialStatements_PrtValueThnExistence2\")","Stamdata!G1407"]
["KvK: Jaarverantwoording 2023 NLGAAP - kleine rechtspersonen - publicatiestukken","valueAssertion_SigningFinancialStatements_PrtValueThnExistence2","`SignatureManagingSupervisoryDirectorsLocation` SHOULD exist at least once, because the reported value of `DirectorSignedStatus` is equal to `Ja`. ","non-blocking","IF(Stamdata!H1409 = \"Ja\",IF(not(Stamdata!H1407=\"\"),0,1),0)+AssertionId(\"valueAssertion_SigningFinancialStatements_PrtValueThnExistence2\")","Stamdata!H1407"]
["KvK: Jaarverantwoording 2023 NLGAAP - kleine rechtspersonen - publicatiestukken","valueAssertion_SigningFinancialStatements_PrtValueThnExistence3","`DirectorReasonNoSignature` SHOULD exist at least once, because the reported value of `DirectorSignedStatus` is equal to `Nee`. ","non-blocking","IF(Stamdata!D1409 = \"Nee\",IF(not(Stamdata!D1410=\"\"),0,1),0)+AssertionId(\"valueAssertion_SigningFinancialStatements_PrtValueThnExistence3\")","Stamdata!D1410"]
["KvK: Jaarverantwoording 2023 NLGAAP - kleine rechtspersonen - publicatiestukken","valueAssertion_SigningFinancialStatements_PrtValueThnExistence3","`DirectorReasonNoSignature` SHOULD exist at least once, because the reported value of `DirectorSignedStatus` is equal to `Nee`. ","non-blocking","IF(Stamdata!E1409 = \"Nee\",IF(not(Stamdata!E1410=\"\"),0,1),0)+AssertionId(\"valueAssertion_SigningFinancialStatements_PrtValueThnExistence3\")","Stamdata!E1410"]
["KvK: Jaarverantwoording 2023 NLGAAP - kleine rechtspersonen - publicatiestukken","valueAssertion_SigningFinancialStatements_PrtValueThnExistence3","`DirectorReasonNoSignature` SHOULD exist at least once, because the reported value of `DirectorSignedStatus` is equal to `Nee`. ","non-blocking","IF(Stamdata!F1409 = \"Nee\",IF(not(Stamdata!F1410=\"\"),0,1),0)+AssertionId(\"valueAssertion_SigningFinancialStatements_PrtValueThnExistence3\")","Stamdata!F1410"]
["KvK: Jaarverantwoording 2023 NLGAAP - kleine rechtspersonen - publicatiestukken","valueAssertion_SigningFinancialStatements_PrtValueThnExistence3","`DirectorReasonNoSignature` SHOULD exist at least once, because the reported value of `DirectorSignedStatus` is equal to `Nee`. ","non-blocking","IF(Stamdata!G1409 = \"Nee\",IF(not(Stamdata!G1410=\"\"),0,1),0)+AssertionId(\"valueAssertion_SigningFinancialStatements_PrtValueThnExistence3\")","Stamdata!G1410"]
["KvK: Jaarverantwoording 2023 NLGAAP - kleine rechtspersonen - publicatiestukken","valueAssertion_SigningFinancialStatements_PrtValueThnExistence3","`DirectorReasonNoSignature` SHOULD exist at least once, because the reported value of `DirectorSignedStatus` is equal to `Nee`. ","non-blocking","IF(Stamdata!H1409 = \"Nee\",IF(not(Stamdata!H1410=\"\"),0,1),0)+AssertionId(\"valueAssertion_SigningFinancialStatements_PrtValueThnExistence3\")","Stamdata!H1410"]
["KvK: Jaarverantwoording 2023 NLGAAP - kleine rechtspersonen - publicatiestukken","valueAssertion_SigningFinancialStatements_PrtValueThnNoExistence1","`SignatureManagingSupervisoryDirectorsDate` SHOULD NOT be reported, because the reported value of `DirectorSignedStatus` is equal to `Nee`. ","non-blocking","IF(Stamdata!D1409 = \"Nee\",IF(Stamdata!D1408=\"\",0,1),0)+AssertionId(\"valueAssertion_SigningFinancialStatements_PrtValueThnNoExistence1\")","Stamdata!D1408"]
["KvK: Jaarverantwoording 2023 NLGAAP - kleine rechtspersonen - publicatiestukken","valueAssertion_SigningFinancialStatements_PrtValueThnNoExistence1","`SignatureManagingSupervisoryDirectorsDate` SHOULD NOT be reported, because the reported value of `DirectorSignedStatus` is equal to `Nee`. ","non-blocking","IF(Stamdata!E1409 = \"Nee\",IF(Stamdata!E1408=\"\",0,1),0)+AssertionId(\"valueAssertion_SigningFinancialStatements_PrtValueThnNoExistence1\")","Stamdata!E1408"]
["KvK: Jaarverantwoording 2023 NLGAAP - kleine rechtspersonen - publicatiestukken","valueAssertion_SigningFinancialStatements_PrtValueThnNoExistence1","`SignatureManagingSupervisoryDirectorsDate` SHOULD NOT be reported, because the reported value of `DirectorSignedStatus` is equal to `Nee`. ","non-blocking","IF(Stamdata!F1409 = \"Nee\",IF(Stamdata!F1408=\"\",0,1),0)+AssertionId(\"valueAssertion_SigningFinancialStatements_PrtValueThnNoExistence1\")","Stamdata!F1408"]
["KvK: Jaarverantwoording 2023 NLGAAP - kleine rechtspersonen - publicatiestukken","valueAssertion_SigningFinancialStatements_PrtValueThnNoExistence1","`SignatureManagingSupervisoryDirectorsDate` SHOULD NOT be reported, because the reported value of `DirectorSignedStatus` is equal to `Nee`. ","non-blocking","IF(Stamdata!G1409 = \"Nee\",IF(Stamdata!G1408=\"\",0,1),0)+AssertionId(\"valueAssertion_SigningFinancialStatements_PrtValueThnNoExistence1\")","Stamdata!G1408"]
["KvK: Jaarverantwoording 2023 NLGAAP - kleine rechtspersonen - publicatiestukken","valueAssertion_SigningFinancialStatements_PrtValueThnNoExistence1","`SignatureManagingSupervisoryDirectorsDate` SHOULD NOT be reported, because the reported value of `DirectorSignedStatus` is equal to `Nee`. ","non-blocking","IF(Stamdata!H1409 = \"Nee\",IF(Stamdata!H1408=\"\",0,1),0)+AssertionId(\"valueAssertion_SigningFinancialStatements_PrtValueThnNoExistence1\")","Stamdata!H1408"]
["KvK: Jaarverantwoording 2023 NLGAAP - kleine rechtspersonen - publicatiestukken","valueAssertion_SigningFinancialStatements_PrtValueThnNoExistence2","`DirectorReasonNoSignature` SHOULD NOT be reported, because the reported value of `DirectorSignedStatus` is equal to `Ja`. ","non-blocking","IF(Stamdata!D1409 = \"Ja\",IF(Stamdata!D1410=\"\",0,1),0)+AssertionId(\"valueAssertion_SigningFinancialStatements_PrtValueThnNoExistence2\")","Stamdata!D1410"]
["KvK: Jaarverantwoording 2023 NLGAAP - kleine rechtspersonen - publicatiestukken","valueAssertion_SigningFinancialStatements_PrtValueThnNoExistence2","`DirectorReasonNoSignature` SHOULD NOT be reported, because the reported value of `DirectorSignedStatus` is equal to `Ja`. ","non-blocking","IF(Stamdata!E1409 = \"Ja\",IF(Stamdata!E1410=\"\",0,1),0)+AssertionId(\"valueAssertion_SigningFinancialStatements_PrtValueThnNoExistence2\")","Stamdata!E1410"]
["KvK: Jaarverantwoording 2023 NLGAAP - kleine rechtspersonen - publicatiestukken","valueAssertion_SigningFinancialStatements_PrtValueThnNoExistence2","`DirectorReasonNoSignature` SHOULD NOT be reported, because the reported value of `DirectorSignedStatus` is equal to `Ja`. ","non-blocking","IF(Stamdata!F1409 = \"Ja\",IF(Stamdata!F1410=\"\",0,1),0)+AssertionId(\"valueAssertion_SigningFinancialStatements_PrtValueThnNoExistence2\")","Stamdata!F1410"]
["KvK: Jaarverantwoording 2023 NLGAAP - kleine rechtspersonen - publicatiestukken","valueAssertion_SigningFinancialStatements_PrtValueThnNoExistence2","`DirectorReasonNoSignature` SHOULD NOT be reported, because the reported value of `DirectorSignedStatus` is equal to `Ja`. ","non-blocking","IF(Stamdata!G1409 = \"Ja\",IF(Stamdata!G1410=\"\",0,1),0)+AssertionId(\"valueAssertion_SigningFinancialStatements_PrtValueThnNoExistence2\")","Stamdata!G1410"]
["KvK: Jaarverantwoording 2023 NLGAAP - kleine rechtspersonen - publicatiestukken","valueAssertion_SigningFinancialStatements_PrtValueThnNoExistence2","`DirectorReasonNoSignature` SHOULD NOT be reported, because the reported value of `DirectorSignedStatus` is equal to `Ja`. ","non-blocking","IF(Stamdata!H1409 = \"Ja\",IF(Stamdata!H1410=\"\",0,1),0)+AssertionId(\"valueAssertion_SigningFinancialStatements_PrtValueThnNoExistence2\")","Stamdata!H1410"]
["KvK: Jaarverantwoording 2023 NLGAAP - kleine rechtspersonen - publicatiestukken","valueAssertion_SigningFinancialStatements_PrtValueThnNoExistence3","`SignatureManagingSupervisoryDirectorsLocation` SHOULD NOT be reported, because the reported value of `DirectorSignedStatus` is equal to `Nee`. ","non-blocking","IF(Stamdata!D1409 = \"Nee\",IF(Stamdata!D1407=\"\",0,1),0)+AssertionId(\"valueAssertion_SigningFinancialStatements_PrtValueThnNoExistence3\")","Stamdata!D1407"]
["KvK: Jaarverantwoording 2023 NLGAAP - kleine rechtspersonen - publicatiestukken","valueAssertion_SigningFinancialStatements_PrtValueThnNoExistence3","`SignatureManagingSupervisoryDirectorsLocation` SHOULD NOT be reported, because the reported value of `DirectorSignedStatus` is equal to `Nee`. ","non-blocking","IF(Stamdata!E1409 = \"Nee\",IF(Stamdata!E1407=\"\",0,1),0)+AssertionId(\"valueAssertion_SigningFinancialStatements_PrtValueThnNoExistence3\")","Stamdata!E1407"]
["KvK: Jaarverantwoording 2023 NLGAAP - kleine rechtspersonen - publicatiestukken","valueAssertion_SigningFinancialStatements_PrtValueThnNoExistence3","`SignatureManagingSupervisoryDirectorsLocation` SHOULD NOT be reported, because the reported value of `DirectorSignedStatus` is equal to `Nee`. ","non-blocking","IF(Stamdata!F1409 = \"Nee\",IF(Stamdata!F1407=\"\",0,1),0)+AssertionId(\"valueAssertion_SigningFinancialStatements_PrtValueThnNoExistence3\")","Stamdata!F1407"]
["KvK: Jaarverantwoording 2023 NLGAAP - kleine rechtspersonen - publicatiestukken","valueAssertion_SigningFinancialStatements_PrtValueThnNoExistence3","`SignatureManagingSupervisoryDirectorsLocation` SHOULD NOT be reported, because the reported value of `DirectorSignedStatus` is equal to `Nee`. ","non-blocking","IF(Stamdata!G1409 = \"Nee\",IF(Stamdata!G1407=\"\",0,1),0)+AssertionId(\"valueAssertion_SigningFinancialStatements_PrtValueThnNoExistence3\")","Stamdata!G1407"]
["KvK: Jaarverantwoording 2023 NLGAAP - kleine rechtspersonen - publicatiestukken","valueAssertion_SigningFinancialStatements_PrtValueThnNoExistence3","`SignatureManagingSupervisoryDirectorsLocation` SHOULD NOT be reported, because the reported value of `DirectorSignedStatus` is equal to `Nee`. ","non-blocking","IF(Stamdata!H1409 = \"Nee\",IF(Stamdata!H1407=\"\",0,1),0)+AssertionId(\"valueAssertion_SigningFinancialStatements_PrtValueThnNoExistence3\")","Stamdata!H1407"]
["KvK: Jaarverantwoording 2023 NLGAAP - kleine rechtspersonen - publicatiestukken","existenceAssertion_SigningFinancialStatements_PrtExistence1","`DirectorSignedStatus` SHOULD exist at least once.","non-blocking","IF(NOT(Stamdata!D1409=\"\"),0,1)+AssertionId(\"existenceAssertion_SigningFinancialStatements_PrtExistence1\")","Stamdata!D1409"]
["KvK: Jaarverantwoording 2023 NLGAAP - kleine rechtspersonen - publicatiestukken","existenceAssertion_SigningFinancialStatements_PrtExistence1","`DirectorSignedStatus` SHOULD exist at least once.","non-blocking","IF(NOT(Stamdata!E1409=\"\"),0,1)+AssertionId(\"existenceAssertion_SigningFinancialStatements_PrtExistence1\")","Stamdata!E1409"]
["KvK: Jaarverantwoording 2023 NLGAAP - kleine rechtspersonen - publicatiestukken","existenceAssertion_SigningFinancialStatements_PrtExistence1","`DirectorSignedStatus` SHOULD exist at least once.","non-blocking","IF(NOT(Stamdata!F1409=\"\"),0,1)+AssertionId(\"existenceAssertion_SigningFinancialStatements_PrtExistence1\")","Stamdata!F1409"]
["KvK: Jaarverantwoording 2023 NLGAAP - kleine rechtspersonen - publicatiestukken","existenceAssertion_SigningFinancialStatements_PrtExistence1","`DirectorSignedStatus` SHOULD exist at least once.","non-blocking","IF(NOT(Stamdata!G1409=\"\"),0,1)+AssertionId(\"existenceAssertion_SigningFinancialStatements_PrtExistence1\")","Stamdata!G1409"]
["KvK: Jaarverantwoording 2023 NLGAAP - kleine rechtspersonen - publicatiestukken","existenceAssertion_SigningFinancialStatements_PrtExistence1","`DirectorSignedStatus` SHOULD exist at least once.","non-blocking","IF(NOT(Stamdata!H1409=\"\"),0,1)+AssertionId(\"existenceAssertion_SigningFinancialStatements_PrtExistence1\")","Stamdata!H1409"]

{"sheet":"XBRL Errors","index":4,"n_rows":1,"n_cols":2,"rows_kept":1,"cut":false,"hidden":false,"merged":[]}
["timestamp","Error"]