{"text_format":"1","workbook":"xlsx","n_sheets":5,"sheets":["Stamdata","labels","Enumerations","Pre-validation","XBRL Errors"],"not_rendered":{"charts":0,"images":0,"macros":1,"external_links":0,"defined_names":22,"comments":0,"pivot_tables":0},"unopened":[],"bounds":{"document_bytes":16777216,"sheet_cells":100000,"rows_first":2000,"rows_last":500,"rows_between":2000,"halvings":0,"cell_chars":16384,"cell_head_chars":4096},"cells_cut":0,"cells_raw":0,"read":"whole","date_system":"1900"}

{"sheet":"Stamdata","index":0,"n_rows":1409,"n_cols":33,"rows_kept":1409,"cut":false,"hidden":false,"merged":[[1385,3,1385,5],[1391,3,1391,5],[1392,3,1392,5],[1374,3,1374,5],[1375,3,1375,5],[1376,3,1376,5],[1377,3,1377,5],[1384,3,1384,5],[1369,3,1369,5],[1370,3,1370,5],[1371,3,1371,5],[1372,3,1372,5],[1373,3,1373,5],[1357,3,1357,5],[1359,3,1359,5],[1366,3,1366,5],[1367,3,1367,5],[1368,3,1368,5],[1058,3,1058,5],[1059,3,1059,5],[1060,3,1060,5],[1355,3,1355,5],[1356,3,1356,5],[1032,3,1032,5],[1033,3,1033,5],[1034,3,1034,5],[1050,3,1050,5],[1057,3,1057,5],[1027,3,1027,5],[1028,3,1028,5],[1029,3,1029,5],[1030,3,1030,5],[1031,3,1031,5],[1008,3,1008,5],[1009,3,1009,5],[1024,3,1024,5],[1025,3,1025,5],[1026,3,1026,5],[986,3,986,5],[987,3,987,5],[1005,3,1005,5],[1006,3,1006,5],[1007,3,1007,5],[951,3,951,5],[952,3,952,5],[953,3,953,5],[984,3,984,5],[985,3,985,5],[946,3,946,5],[947,3,947,5],[948,3,948,5],[949,3,949,5],[950,3,950,5],[941,3,941,5],[942,3,942,5],[943,3,943,5],[944,3,944,5],[945,3,945,5],[936,3,936,5],[937,3,937,5],[938,3,938,5],[939,3,939,5],[940,3,940,5],[919,3,919,5],[920,3,920,5],[921,3,921,5],[934,3,934,5],[935,3,935,5],[900,3,900,5],[901,3,901,5],[902,3,902,5],[903,3,903,5],[918,3,918,5],[895,3,895,5],[896,3,896,5],[897,3,897,5],[898,3,898,5],[899,3,899,5],[870,3,870,5],[871,3,871,5],[872,3,872,5],[878,3,878,5],[894,3,894,5],[865,3,865,5],[866,3,866,5],[867,3,867,5],[868,3,868,5],[869,3,869,5],[860,3,860,5],[861,3,861,5],[862,3,862,5],[863,3,863,5],[864,3,864,5],[855,3,855,5],[856,3,856,5],[857,3,857,5],[858,3,858,5],[859,3,859,5],[823,3,823,5],[829,3,829,5],[835,3,835,5],[842,3,842,5],[848,3,848,5],[731,3,731,5],[786,3,786,5],[787,3,787,5],[810,3,810,5],[817,3,817,5],[651,3,651,5],[704,3,704,5],[705,3,705,5],[706,3,706,5],[707,3,707,5],[640,3,640,5],[647,3,647,5],[648,3,648,5],[649,3,649,5],[650,3,650,5],[614,3,614,5],[615,3,615,5],[631,3,631,5],[632,3,632,5],[639,3,639,5],[577,3,577,5],[595,3,595,5],[611,3,611,5],[612,3,612,5],[613,3,613,5],[572,3,572,5],[573,3,573,5],[574,3,574,5],[575,3,575,5],[576,3,576,5],[549,3,549,5],[550,3,550,5],[569,3,569,5],[570,3,570,5],[571,3,571,5],[538,3,538,5],[545,3,545,5],[546,3,546,5],[547,3,547,5],[548,3,548,5],[533,3,533,5],[534,3,534,5],[535,3,535,5],[536,3,536,5],[537,3,537,5],[516,3,516,5],[517,3,517,5],[518,3,518,5],[519,3,519,5],[520,3,520,5],[511,3,511,5],[512,3,512,5],[513,3,513,5],[514,3,514,5],[515,3,515,5],[479,3,479,5],[480,3,480,5],[481,3,481,5],[482,3,482,5],[510,3,510,5],[474,3,474,5],[475,3,475,5],[476,3,476,5],[477,3,477,5],[478,3,478,5],[453,3,453,5],[454,3,454,5],[455,3,455,5],[456,3,456,5],[473,3,473,5],[448,3,448,5],[449,3,449,5],[450,3,450,5],[451,3,451,5],[452,3,452,5],[443,3,443,5],[444,3,444,5],[445,3,445,5],[446,3,446,5],[447,3,447,5],[438,3,438,5],[439,3,439,5],[440,3,440,5],[441,3,441,5],[442,3,442,5],[433,3,433,5],[434,3,434,5],[435,3,435,5],[436,3,436,5],[437,3,437,5],[428,3,428,5],[429,3,429,5],[430,3,430,5],[431,3,431,5],[432,3,432,5],[418,3,418,5],[419,3,419,5],[420,3,420,5],[421,3,421,5],[422,3,422,5],[413,3,413,5],[414,3,414,5],[415,3,415,5],[416,3,416,5],[417,3,417,5],[408,3,408,5],[409,3,409,5],[410,3,410,5],[411,3,411,5],[412,3,412,5],[403,3,403,5],[404,3,404,5],[405,3,405,5],[406,3,406,5],[407,3,407,5],[398,3,398,5],[399,3,399,5],[400,3,400,5],[401,3,401,5],[402,3,402,5],[393,3,393,5],[394,3,394,5],[395,3,395,5],[396,3,396,5],[397,3,397,5],[388,3,388,5],[389,3,389,5],[390,3,390,5],[391,3,391,5],[392,3,392,5],[383,3,383,5],[384,3,384,5],[385,3,385,5],[386,3,386,5],[387,3,387,5],[378,3,378,5],[379,3,379,5],[380,3,380,5],[381,3,381,5],[382,3,382,5],[373,3,373,5],[374,3,374,5],[375,3,375,5],[376,3,376,5],[377,3,377,5],[368,3,368,5],[369,3,369,5],[370,3,370,5],[371,3,371,5],[372,3,372,5],[363,3,363,5],[364,3,364,5],[365,3,365,5],[366,3,366,5],[367,3,367,5],[358,3,358,5],[359,3,359,5],[360,3,360,5],[361,3,361,5],[362,3,362,5],[353,3,353,5],[354,3,354,5],[355,3,355,5],[356,3,356,5],[357,3,357,5],[348,3,348,5],[349,3,349,5],[350,3,350,5],[351,3,351,5],[352,3,352,5],[343,3,343,5],[344,3,344,5],[345,3,345,5],[346,3,346,5],[347,3,347,5],[338,3,338,5],[339,3,339,5],[340,3,340,5],[341,3,341,5],[342,3,342,5],[333,3,333,5],[334,3,334,5],[335,3,335,5],[336,3,336,5],[337,3,337,5],[328,3,328,5],[329,3,329,5],[330,3,330,5],[331,3,331,5],[332,3,332,5],[323,3,323,5],[324,3,324,5],[325,3,325,5],[326,3,326,5],[327,3,327,5],[318,3,318,5],[319,3,319,5],[320,3,320,5],[321,3,321,5],[322,3,322,5],[313,3,313,5],[314,3,314,5],[315,3,315,5],[316,3,316,5],[317,3,317,5],[308,3,308,5],[309,3,309,5],[310,3,310,5],[311,3,311,5],[312,3,312,5],[297,3,297,5],[298,3,298,5],[299,3,299,5],[306,3,306,5],[307,3,307,5],[272,3,272,5],[273,3,273,5],[279,3,279,5],[285,3,285,5],[291,3,291,5],[262,3,262,5],[263,3,263,5],[264,3,264,5],[265,3,265,5],[271,3,271,5],[257,3,257,5],[258,3,258,5],[259,3,259,5],[260,3,260,5],[261,3,261,5],[201,3,201,5],[220,3,220,5],[221,3,221,5],[240,3,240,5],[256,3,256,5],[191,3,191,5],[192,3,192,5],[193,3,193,5],[194,3,194,5],[195,3,195,5],[186,3,186,5],[187,3,187,5],[188,3,188,5],[189,3,189,5],[190,3,190,5],[175,3,175,5],[176,3,176,5],[177,3,177,5],[178,3,178,5],[179,3,179,5],[160,3,160,5],[166,3,166,5],[172,3,172,5],[173,3,173,5],[174,3,174,5],[150,3,150,5],[156,3,156,5],[157,3,157,5],[158,3,158,5],[159,3,159,5],[135,3,135,5],[136,3,136,5],[142,3,142,5],[143,3,143,5],[144,3,144,5],[74,3,74,5],[126,3,126,5],[127,3,127,5],[133,3,133,5],[134,3,134,5],[69,3,69,5],[70,3,70,5],[71,3,71,5],[72,3,72,5],[73,3,73,5],[65,3,65,5],[66,3,66,5],[67,3,67,5],[68,3,68,5],[56,3,56,5],[42,3,42,5],[43,3,43,5],[44,3,44,5],[45,3,45,5],[46,3,46,5],[62,3,62,5],[63,3,63,5],[64,3,64,5],[57,3,57,5],[58,3,58,5],[59,3,59,5],[60,3,60,5],[61,3,61,5],[41,3,41,5],[28,3,28,5],[29,3,29,5],[35,3,35,5],[36,3,36,5],[47,3,47,5],[48,3,48,5],[54,3,54,5],[55,3,55,5],[23,3,23,5],[24,3,24,5],[25,3,25,5],[26,3,26,5],[27,3,27,5],[37,3,37,5],[38,3,38,5],[39,3,39,5],[40,3,40,5]]}
["",null,null,{"$f":"IF(D63=\"Fiscaal\",\"Fiscal\",\"Commercial\")","v":"Commercial"}]
["","Conversion info"]
["",null,null,null,null,null,null,null,null,null,null,null,null,null,null,null,null,null,null,null,null,null,null,null,null,"/General data label {2}","/General data value {4}"]
["","",null,"NL NT 18.0"]
["","",null,"nl"]
["","entrypoint",null,"KvK: Jaarverantwoording 2023 NLGAAP - kleine rechtspersonen - publicatiestukken"]
["","identifier scheme",null,"http://www.kvk.nl/kvk-id"]
["","Vorigvorig jaar",null,{"$f":"DATE(YEAR(D59)-1,MONTH(D59),DAY(D59))","v":"3798-12-31"}]
["","",null,0]
["","",null,0]
["","",null,"INF"]
["","",null,"INF"]
["","",null,"FALSE"]
["","",null,"TRUE"]
["",null,null,null,null,null,null,null,null,null,null,null,null,null,null,null,null,null,null,null,null,null,null,null,null,"//General data label {2}","//General data value {4}"]
[""]
[""]
[""]
["",{"$f":"INDEX(labels!A2:C2,1,MATCH(PP_Language,labels!A1:C1,0))","v":"Informatie over de rapportage en de rechtspersoon"}]
["",{"$f":"INDEX(labels!A3:C3,1,MATCH(PP_Language,labels!A1:C1,0))","v":"Informatie over de rechtspersoon"}]
{"$rows_left_out":1390}
{"sheet":"labels","index":1,"n_rows":760,"n_cols":3,"rows_kept":760,"cut":false,"hidden":true,"merged":[]}
["id","en","nl"]
[0,"Document and entity information","Informatie over de rapportage en de rechtspersoon"]
[1,"Entity information","Informatie over de rechtspersoon"]
[2,"Name of the legal entity","Naam van de rechtspersoon"]
[3,"Legal form of the legal entity","Rechtsvorm van de rechtspersoon"]
[4,"Registered office of the legal entity","Zetel van de rechtspersoon"]
[5,"Registration number at the Chamber of Commerce","Registratienummer bij de Kamer van Koophandel"]
[6,"Business names","Handelsnamen"]
[7,"Classification of the legal entity based on the legal size criteria small","Classificatie van de rechtspersoon op basis van de wettelijke groottecriteria klein"]
[8,"SBI-code","SBI-code"]
[9,"Address of the legal entity","Adres van de rechtspersoon"]
[10,"Description of location NL","Locatieomschrijving NL"]
[11,"Street name NL","Straatnaam NL"]
[12,"House number NL","Huisnummer NL"]
[13,"House number addition","Huisnummertoevoeging"]
[14,"PO box number","Postbusnummer"]
[15,"Postal code NL","Postcode NL"]
[16,"Place of residence NL","Vestigingsplaats NL"]
[17,"Description of location abroad","Locatieomschrijving buitenland"]
[18,"Street name abroad","Straatnaam buitenland"]
{"$rows_left_out":741}
{"sheet":"Enumerations","index":2,"n_rows":934,"n_cols":161,"rows_kept":934,"cut":false,"hidden":true,"merged":[]}
["Besloten vennootschap met beperkte aansprakelijkheid",null,"Klein",null,"Micro",null,"0111",null,"Ja",null,"Commercieel",null,"Enkelvoudig",null,"AED",null,"Categoriaal",null,"Direct",null,"Ja",null,"Ja",null,"Ja",null,"Enkelvoudig",null,"Na",null,"Na",null,"Ja",null,"Ja",null,"Ja",null,"Ja",null,"Ja",null,"Ja",null,"Ja",null,"Ja",null,"Ja",null,"Ja",null,"Ja",null,"Ja",null,"Ja",null,"Ja",null,"Ja",null,"Ja",null,"Ja",null,"Ja",null,"Ja",null,"Ja",null,"Ja",null,"Ja",null,"Ja",null,"Ja",null,"Ja",null,"Ja",null,"Ja",null,"Ja",null,"Ja",null,"Ja",null,"Ja",null,"Ja",null,"Ja",null,"Ja",null,"Ja",null,"Ja",null,"Ja",null,"Ja",null,"Ja",null,"Ja",null,"Ja",null,"Ja",null,"Ja",null,"Ja",null,"Ja",null,"Ja",null,"Ja",null,"Ja",null,"Ja",null,"Ja",null,"Ja",null,"Ja",null,"Ja",null,"Ja",null,"Ja",null,"Bestuurder (huidig)",null,"Bestuurder (huidig)",null,"Bestuurder (huidig)",null,"Bestuurder (huidig)",null,"Bestuurder (huidig)",null,"Ja",null,"Ja",null,"Ja",null,"Ja",null,"Ja"]
["Commanditaire vennootschap",null,"Micro",null,null,null,"0116",null,"Nee",null,"Fiscaal",null,"Geconsolideerd en enkelvoudig",null,"AFN",null,"Functioneel",null,"Indirect",null,"Nee",null,"Nee",null,"Nee",null,"Geconsolideerd en enkelvoudig",null,"Voor",null,"Voor",null,"Nee",null,"Nee",null,"Nee",null,"Nee",null,"Nee",null,"Nee",null,"Nee",null,"Nee",null,"Nee",null,"Nee",null,"Nee",null,"Nee",null,"Nee",null,"Nee",null,"Nee",null,"Nee",null,"Nee",null,"Nee",null,"Nee",null,"Nee",null,"Nee",null,"Nee",null,"Nee",null,"Nee",null,"Nee",null,"Nee",null,"Nee",null,"Nee",null,"Nee",null,"Nee",null,"Nee",null,"Nee",null,"Nee",null,"Nee",null,"Nee",null,"Nee",null,"Nee",null,"Nee",null,"Nee",null,"Nee",null,"Nee",null,"Nee",null,"Nee",null,"Nee",null,"Nee",null,"Nee",null,"Nee",null,"Nee",null,"Nee",null,"Nee",null,"Nee",null,"Nee",null,"Nee",null,"Nee",null,"Nee",null,"Bestuurder (voormalig)",null,"Bestuurder (voormalig)",null,"Bestuurder (voormalig)",null,"Bestuurder (voormalig)",null,"Bestuurder (voormalig)",null,"Nee",null,"Nee",null,"Nee",null,"Nee",null,"Nee"]
["Cooperatie",null,null,null,null,null,"0121",null,null,null,null,null,"Geconsolideerd",null,"ALL",null,"Niet van toepassing",null,"Niet van toepassing",null,null,null,null,null,null,null,"Geconsolideerd",null,null,null,null,null,null,null,null,null,null,null,null,null,null,null,null,null,null,null,null,null,null,null,null,null,null,null,null,null,null,null,null,null,null,null,null,null,null,null,null,null,null,null,null,null,null,null,null,null,null,null,null,null,null,null,null,null,null,null,null,null,null,null,null,null,null,null,null,null,null,null,null,null,null,null,null,null,null,null,null,null,null,null,null,null,null,null,null,null,null,null,null,null,null,null,null,null,null,null,null,null,null,null,null,null,null,null,null,null,null,null,null,null,null,null,"Commissaris (huidig)",null,"Commissaris (huidig)",null,"Commissaris (huidig)",null,"Commissaris (huidig)",null,"Commissaris (huidig)"]
["Naamloze vennootschap",null,null,null,null,null,"0127",null,null,null,null,null,null,null,"AMD",null,null,null,null,null,null,null,null,null,null,null,"Jaarrekening andere rechtspersoon",null,null,null,null,null,null,null,null,null,null,null,null,null,null,null,null,null,null,null,null,null,null,null,null,null,null,null,null,null,null,null,null,null,null,null,null,null,null,null,null,null,null,null,null,null,null,null,null,null,null,null,null,null,null,null,null,null,null,null,null,null,null,null,null,null,null,null,null,null,null,null,null,null,null,null,null,null,null,null,null,null,null,null,null,null,null,null,null,null,null,null,null,null,null,null,null,null,null,null,null,null,null,null,null,null,null,null,null,null,null,null,null,null,null,null,"Commissaris (voormalig)",null,"Commissaris (voormalig)",null,"Commissaris (voormalig)",null,"Commissaris (voormalig)",null,"Commissaris (voormalig)"]
["Onderlinge waarborgmaatschappij",null,null,null,null,null,"0128",null,null,null,null,null,null,null,"ANG"]
["Stichting",null,null,null,null,null,"0129",null,null,null,null,null,null,null,"AOA"]
["Vennootschap onder firma",null,null,null,null,null,"0143",null,null,null,null,null,null,null,"ARS"]
["Vereniging",null,null,null,null,null,"0150",null,null,null,null,null,null,null,"AUD"]
[null,null,null,null,null,null,"0161",null,null,null,null,null,null,null,"AWG"]
[null,null,null,null,null,null,"0162",null,null,null,null,null,null,null,"AZN"]
[null,null,null,null,null,null,"0163",null,null,null,null,null,null,null,"BAM"]
[null,null,null,null,null,null,"0164",null,null,null,null,null,null,null,"BBD"]
[null,null,null,null,null,null,"0170",null,null,null,null,null,null,null,"BDT"]
[null,null,null,null,null,null,"0210",null,null,null,null,null,null,null,"BGN"]
[null,null,null,null,null,null,"0220",null,null,null,null,null,null,null,"BHD"]
[null,null,null,null,null,null,"0240",null,null,null,null,null,null,null,"BIF"]
[null,null,null,null,null,null,"0311",null,null,null,null,null,null,null,"BMD"]
[null,null,null,null,null,null,"0312",null,null,null,null,null,null,null,"BND"]
[null,null,null,null,null,null,"0321",null,null,null,null,null,null,null,"BOB"]
[null,null,null,null,null,null,"0322",null,null,null,null,null,null,null,"BOV"]
{"$rows_left_out":915}
{"sheet":"Pre-validation","index":3,"n_rows":268,"n_cols":6,"rows_kept":268,"cut":false,"hidden":true,"merged":[]}
[{"$f":"IF(NOT(Stamdata!H1405=\"\"),0,1)+AssertionId(\"existenceAssertion_SigningFinancialStatements_PrtExistence1\")","v":1}]
["KvK: Jaarverantwoording 2023 NLGAAP - kleine rechtspersonen - publicatiestukken","valueAssertion_BalanceSheet_PrtFST1SumOfChildrenDParentCredit1","`Equity` SHOULD be equal to the summation of the underlying values. ","non-blocking","IF(OR(not(AND(Stamdata!D106=\"\",Stamdata!D107=\"\",Stamdata!D108=\"\",Stamdata!D109=\"\",Stamdata!D110=\"\",Stamdata!D111=\"\",Stamdata!D112=\"\",Stamdata!D113=\"\",Stamdata!D114=\"\",Stamdata!D115=\"\")),not(0=0)),IF( Stamdata!D116 = sum(Stamdata!D106,Stamdata!D107,Stamdata!D108,Stamdata!D109,Stamdata!D110,Stamdata!D111,Stamdata!D112,Stamdata!D113,Stamdata!D114,Stamdata!D115),0,1),0)+AssertionId(\"valueAssertion_BalanceSheet_PrtFST1SumOfChildrenDParentCredit1\")","Stamdata!D116"]
["KvK: Jaarverantwoording 2023 NLGAAP - kleine rechtspersonen - publicatiestukken","valueAssertion_BalanceSheet_PrtFST1SumOfChildrenDParentCredit1","`Equity` SHOULD be equal to the summation of the underlying values. ","non-blocking","IF(OR(not(AND(Stamdata!F106=\"\",Stamdata!F107=\"\",Stamdata!F108=\"\",Stamdata!F109=\"\",Stamdata!F110=\"\",Stamdata!F111=\"\",Stamdata!F112=\"\",Stamdata!F113=\"\",Stamdata!F114=\"\",Stamdata!F115=\"\")),not(0=0)),IF( Stamdata!F116 = sum(Stamdata!F106,Stamdata!F107,Stamdata!F108,Stamdata!F109,Stamdata!F110,Stamdata!F111,Stamdata!F112,Stamdata!F113,Stamdata!F114,Stamdata!F115),0,1),0)+AssertionId(\"valueAssertion_BalanceSheet_PrtFST1SumOfChildrenDParentCredit1\")","Stamdata!F116"]
["KvK: Jaarverantwoording 2023 NLGAAP - kleine rechtspersonen - publicatiestukken","valueAssertion_BalanceSheet_PrtFST1SumOfChildrenDParentCredit2","`EquityAndLiabilities` SHOULD be equal to the summation of the underlying values. ","non-blocking","IF(OR(not(AND(Stamdata!D116=\"\",Stamdata!D118=\"\",Stamdata!D119=\"\",Stamdata!D120=\"\")),not(0=0)),IF( Stamdata!D121 = sum(Stamdata!D116,Stamdata!D118,Stamdata!D119,Stamdata!D120),0,1),0)+AssertionId(\"valueAssertion_BalanceSheet_PrtFST1SumOfChildrenDParentCredit2\")","Stamdata!D121"]
["KvK: Jaarverantwoording 2023 NLGAAP - kleine rechtspersonen - publicatiestukken","valueAssertion_BalanceSheet_PrtFST1SumOfChildrenDParentCredit2","`EquityAndLiabilities` SHOULD be equal to the summation of the underlying values. ","non-blocking","IF(OR(not(AND(Stamdata!F116=\"\",Stamdata!F118=\"\",Stamdata!F119=\"\",Stamdata!F120=\"\")),not(0=0)),IF( Stamdata!F121 = sum(Stamdata!F116,Stamdata!F118,Stamdata!F119,Stamdata!F120),0,1),0)+AssertionId(\"valueAssertion_BalanceSheet_PrtFST1SumOfChildrenDParentCredit2\")","Stamdata!F121"]
["KvK: Jaarverantwoording 2023 NLGAAP - kleine rechtspersonen - publicatiestukken","valueAssertion_BalanceSheet_PrtFST1SumOfChildrenDParentDebit1","`AssetsNoncurrent` SHOULD be equal to the summation of the underlying values. ","non-blocking","IF(OR(not(0=0),not(AND(Stamdata!D91=\"\",Stamdata!D92=\"\",Stamdata!D93=\"\",Stamdata!D94=\"\"))),IF( Stamdata!D95 = + sum(Stamdata!D91,Stamdata!D92,Stamdata!D93,Stamdata!D94),0,1),0)+AssertionId(\"valueAssertion_BalanceSheet_PrtFST1SumOfChildrenDParentDebit1\")","Stamdata!D95"]
["KvK: Jaarverantwoording 2023 NLGAAP - kleine rechtspersonen - publicatiestukken","valueAssertion_BalanceSheet_PrtFST1SumOfChildrenDParentDebit1","`AssetsNoncurrent` SHOULD be equal to the summation of the underlying values. ","non-blocking","IF(OR(not(0=0),not(AND(Stamdata!F91=\"\",Stamdata!F92=\"\",Stamdata!F93=\"\",Stamdata!F94=\"\"))),IF( Stamdata!F95 = + sum(Stamdata!F91,Stamdata!F92,Stamdata!F93,Stamdata!F94),0,1),0)+AssertionId(\"valueAssertion_BalanceSheet_PrtFST1SumOfChildrenDParentDebit1\")","Stamdata!F95"]
["KvK: Jaarverantwoording 2023 NLGAAP - kleine rechtspersonen - publicatiestukken","valueAssertion_BalanceSheet_PrtFST1SumOfChildrenDParentDebit2","`AssetsCurrent` SHOULD be equal to the summation of the underlying values. ","non-blocking","IF(OR(not(0=0),not(AND(Stamdata!D97=\"\",Stamdata!D98=\"\",Stamdata!D99=\"\",Stamdata!D100=\"\",Stamdata!D101=\"\"))),IF( Stamdata!D102 = + sum(Stamdata!D97,Stamdata!D98,Stamdata!D99,Stamdata!D100,Stamdata!D101),0,1),0)+AssertionId(\"valueAssertion_BalanceSheet_PrtFST1SumOfChildrenDParentDebit2\")","Stamdata!D102"]
["KvK: Jaarverantwoording 2023 NLGAAP - kleine rechtspersonen - publicatiestukken","valueAssertion_BalanceSheet_PrtFST1SumOfChildrenDParentDebit2","`AssetsCurrent` SHOULD be equal to the summation of the underlying values. ","non-blocking","IF(OR(not(0=0),not(AND(Stamdata!F97=\"\",Stamdata!F98=\"\",Stamdata!F99=\"\",Stamdata!F100=\"\",Stamdata!F101=\"\"))),IF( Stamdata!F102 = + sum(Stamdata!F97,Stamdata!F98,Stamdata!F99,Stamdata!F100,Stamdata!F101),0,1),0)+AssertionId(\"valueAssertion_BalanceSheet_PrtFST1SumOfChildrenDParentDebit2\")","Stamdata!F102"]
["KvK: Jaarverantwoording 2023 NLGAAP - kleine rechtspersonen - publicatiestukken","valueAssertion_BalanceSheet_PrtFST1SumOfChildrenDParentDebit3","`Assets` SHOULD be equal to the summation of the underlying values. ","non-blocking","IF(OR(not(0=0),not(AND(Stamdata!D95=\"\",Stamdata!D102=\"\"))),IF( Stamdata!D104 = + sum(Stamdata!D95,Stamdata!D102),0,1),0)+AssertionId(\"valueAssertion_BalanceSheet_PrtFST1SumOfChildrenDParentDebit3\")","Stamdata!D104"]
["KvK: Jaarverantwoording 2023 NLGAAP - kleine rechtspersonen - publicatiestukken","valueAssertion_BalanceSheet_PrtFST1SumOfChildrenDParentDebit3","`Assets` SHOULD be equal to the summation of the underlying values. ","non-blocking","IF(OR(not(0=0),not(AND(Stamdata!F95=\"\",Stamdata!F102=\"\"))),IF( Stamdata!F104 = + sum(Stamdata!F95,Stamdata!F102),0,1),0)+AssertionId(\"valueAssertion_BalanceSheet_PrtFST1SumOfChildrenDParentDebit3\")","Stamdata!F104"]
["KvK: Jaarverantwoording 2023 NLGAAP - kleine rechtspersonen - publicatiestukken","valueAssertion_BalanceSheet_PrtFST101Variable1","`EquityAndLiabilities` SHOULD be equal to + `Assets`. ","non-blocking","IF(+ Stamdata!D104 = Stamdata!D121 ,0,1)+AssertionId(\"valueAssertion_BalanceSheet_PrtFST101Variable1\")","Stamdata!D104"]
["KvK: Jaarverantwoording 2023 NLGAAP - kleine rechtspersonen - publicatiestukken","valueAssertion_BalanceSheet_PrtFST101Variable1","`EquityAndLiabilities` SHOULD be equal to + `Assets`. ","non-blocking","IF(+ Stamdata!F104 = Stamdata!F121 ,0,1)+AssertionId(\"valueAssertion_BalanceSheet_PrtFST101Variable1\")","Stamdata!F104"]
["KvK: Jaarverantwoording 2023 NLGAAP - kleine rechtspersonen - publicatiestukken","valueAssertion_BalanceSheet_PrtValueThnNoExistenceCovA1","`ResultForTheYear` SHOULD NOT be reported, because the reported value of `BalanceSheetBeforeAfterAppropriationResults` is equal to `Na`. ","non-blocking","IF(Stamdata!D89 = \"Na\",IF(Stamdata!D114=\"\",0,1),0)+AssertionId(\"valueAssertion_BalanceSheet_PrtValueThnNoExistenceCovA1\")","Stamdata!D114"]
["KvK: Jaarverantwoording 2023 NLGAAP - kleine rechtspersonen - publicatiestukken","valueAssertion_BalanceSheet_PrtValueThnNoExistenceCovA1","`ResultForTheYear` SHOULD NOT be reported, because the reported value of `BalanceSheetBeforeAfterAppropriationResults` is equal to `Na`. ","non-blocking","IF(Stamdata!F89 = \"Na\",IF(Stamdata!F114=\"\",0,1),0)+AssertionId(\"valueAssertion_BalanceSheet_PrtValueThnNoExistenceCovA1\")","Stamdata!F114"]
["KvK: Jaarverantwoording 2023 NLGAAP - kleine rechtspersonen - publicatiestukken","existenceAssertion_BalanceSheet_PrtOnlyReportFactPeriodEQParam1","`BalanceSheetBeforeAfterAppropriationResults` SHOULD not exist for any period other than the current period.","non-blocking","IF(NOT(Stamdata!D89=\"\"),0,1)+AssertionId(\"existenceAssertion_BalanceSheet_PrtOnlyReportFactPeriodEQParam1\")","Stamdata!D89"]
["KvK: Jaarverantwoording 2023 NLGAAP - kleine rechtspersonen - publicatiestukken","existenceAssertion_BalanceSheet_PrtOnlyReportFactPeriodEQParam1","`BalanceSheetBeforeAfterAppropriationResults` SHOULD not exist for any period other than the current period.","non-blocking","IF(NOT(Stamdata!F89=\"\"),0,1)+AssertionId(\"existenceAssertion_BalanceSheet_PrtOnlyReportFactPeriodEQParam1\")","Stamdata!F89"]
["KvK: Jaarverantwoording 2023 NLGAAP - kleine rechtspersonen - publicatiestukken","valueAssertion_DocumentInformation_PrtDateEarlier24HDateLater1","The date reported for `FinancialReportingPeriodPreviousEndDate` MUST be one day earlier than the date reported for `FinancialReportingPeriodCurrentStartDate`. ","blocking","IF((Stamdata!D60)+ 1 = (Stamdata!D57),0,1)+AssertionId(\"valueAssertion_DocumentInformation_PrtDateEarlier24HDateLater1\")","Stamdata!D57"]
["KvK: Jaarverantwoording 2023 NLGAAP - kleine rechtspersonen - publicatiestukken","valueAssertion_DocumentInformation_PrtDateEarlierDateLater1","The date reported for `FinancialReportingPeriodCurrentEndDate` MUST be earlier than the date reported for `DocumentAdoptionDate`. ","blocking","IF(Stamdata!D58 < Stamdata!D72,0,1)+AssertionId(\"valueAssertion_DocumentInformation_PrtDateEarlierDateLater1\")","Stamdata!D72"]
["KvK: Jaarverantwoording 2023 NLGAAP - kleine rechtspersonen - publicatiestukken","valueAssertion_DocumentInformation_PrtDateEarlierDateLater2","The date reported for `FinancialReportingPeriodPreviousStartDate` MUST be earlier than the date reported for `FinancialReportingPeriodPreviousEndDate`. ","blocking","IF(Stamdata!D59 < Stamdata!D60,0,1)+AssertionId(\"valueAssertion_DocumentInformation_PrtDateEarlierDateLater2\")","Stamdata!D60"]
{"$rows_left_out":249}
{"sheet":"XBRL Errors","index":4,"n_rows":1,"n_cols":2,"rows_kept":1,"cut":false,"hidden":false,"merged":[]}
["timestamp","Error"]