{"text_format":"1","workbook":"xlsx","n_sheets":5,"sheets":["Stamdata","labels","Enumerations","Pre-validation","XBRL Errors"],"not_rendered":{"charts":0,"images":0,"macros":1,"external_links":0,"defined_names":17,"comments":0,"pivot_tables":0},"unopened":[],"bounds":{"document_bytes":16777216,"sheet_cells":100000,"rows_first":2000,"rows_last":500,"rows_between":2000,"halvings":0,"cell_chars":16384,"cell_head_chars":4096},"cells_cut":0,"cells_raw":0,"read":"whole","date_system":"1900"}

{"sheet":"Stamdata","index":0,"n_rows":131,"n_cols":32,"rows_kept":131,"cut":false,"hidden":false,"merged":[[22,3,22,5],[23,3,23,5],[24,3,24,5],[25,3,25,5],[26,3,26,5],[27,3,27,5],[28,3,28,5],[34,3,34,5],[35,3,35,5],[36,3,36,5],[37,3,37,5],[38,3,38,5],[39,3,39,5],[40,3,40,5],[41,3,41,5],[42,3,42,5],[43,3,43,5],[44,3,44,5],[45,3,45,5],[46,3,46,5],[47,3,47,5],[53,3,53,5],[54,3,54,5],[55,3,55,5],[56,3,56,5],[57,3,57,5],[58,3,58,5],[59,3,59,5],[60,3,60,5],[61,3,61,5],[62,3,62,5],[63,3,63,5],[64,3,64,5],[65,3,65,5],[66,3,66,5],[67,3,67,5],[68,3,68,5],[69,3,69,5],[70,3,70,5],[71,3,71,5],[105,3,105,5],[111,3,111,5],[112,3,112,5],[113,3,113,5],[114,3,114,5]]}
["",null,null,{"$f":"IF(D62=\"Fiscaal\",\"Fiscal\",\"Commercial\")","v":"Commercial"}]
["","Conversion info"]
["",null,null,null,null,null,null,null,null,null,null,null,null,null,null,null,null,null,null,null,null,null,null,null,null,"/General data label {2}","/General data value {4}"]
["","",null,"NL NT 18.0"]
["","",null,"EN"]
["","entrypoint",null,"KvK: Jaarverantwoording 2023 NLGAAP - micro rechtspersonen - publicatiestukken"]
["","identifier scheme",null,"http://www.kvk.nl/kvk-id"]
["","",null,0]
["","",null,0]
["","",null,"INF"]
["","",null,"INF"]
["","",null,"FALSE"]
["","",null,"TRUE"]
["",null,null,null,null,null,null,null,null,null,null,null,null,null,null,null,null,null,null,null,null,null,null,null,null,"//General data label {2}","//General data value {4}"]
[""]
[""]
[""]
["",{"$f":"INDEX(labels!A2:C2,1,MATCH(PP_Language,labels!A1:C1,0))","v":"Document and entity information"}]
["",{"$f":"INDEX(labels!A3:C3,1,MATCH(PP_Language,labels!A1:C1,0))","v":"Entity information"}]
["",{"$f":"INDEX(labels!A3:C3,1,MATCH(PP_Language,labels!A1:C1,0))","v":"Entity information"}]
[""]
[""]
["",{"$f":"INDEX(labels!A4:C4,1,MATCH(PP_Language,labels!A1:C1,0))","v":"Name of the legal entity"},"",null,null,null,null,null,null,null,null,null,null,null,null,null,null,null,null,null,null,null,null,null,null,{"$f":"\"/entity-information label {\"&COLUMN(B21)&\"}\"","v":"/entity-information label {2}"},null,{"$f":"\"/entity-information   {\"&COLUMN(D21)&\"}\"","v":"/entity-information   {4}"}]
["",{"$f":"INDEX(labels!A5:C5,1,MATCH(PP_Language,labels!A1:C1,0))","v":"Legal form of the legal entity"},""]
["",{"$f":"INDEX(labels!A6:C6,1,MATCH(PP_Language,labels!A1:C1,0))","v":"Registered office of the legal entity"},""]
["",{"$f":"INDEX(labels!A7:C7,1,MATCH(PP_Language,labels!A1:C1,0))","v":"Registration number at the Chamber of Commerce"},""]
["",{"$f":"INDEX(labels!A8:C8,1,MATCH(PP_Language,labels!A1:C1,0))","v":"Business names"},""]
["",{"$f":"INDEX(labels!A9:C9,1,MATCH(PP_Language,labels!A1:C1,0))","v":"Classification of the legal entity based on the legal size criteria"},""]
["",{"$f":"INDEX(labels!A10:C10,1,MATCH(PP_Language,labels!A1:C1,0))","v":"SBI-code"},""]
[""]
{"$rows_left_out":102}
{"sheet":"labels","index":1,"n_rows":81,"n_cols":3,"rows_kept":81,"cut":false,"hidden":true,"merged":[]}
["id","en","nl"]
[0,"Document and entity information","Informatie over de rapportage en de rechtspersoon"]
[1,"Entity information","Informatie over de rechtspersoon"]
[2,"Name of the legal entity","Naam van de rechtspersoon"]
[3,"Legal form of the legal entity","Rechtsvorm van de rechtspersoon"]
[4,"Registered office of the legal entity","Zetel van de rechtspersoon"]
[5,"Registration number at the Chamber of Commerce","Registratienummer bij de Kamer van Koophandel"]
[6,"Business names","Handelsnamen"]
[7,"Classification of the legal entity based on the legal size criteria","Classificatie van de rechtspersoon op basis van de wettelijke groottecriteria"]
[8,"SBI-code","SBI-code"]
[9,"Address of the legal entity","Adres van de rechtspersoon"]
[10,"Description of location NL","Locatieomschrijving NL"]
[11,"Street name NL","Straatnaam NL"]
[12,"House number NL","Huisnummer NL"]
[13,"House number addition","Huisnummertoevoeging"]
[14,"PO box number","Postbusnummer"]
[15,"Postal code NL","Postcode NL"]
[16,"Place of residence NL","Vestigingsplaats NL"]
[17,"Description of location abroad","Locatieomschrijving buitenland"]
[18,"Street name abroad","Straatnaam buitenland"]
[19,"House number abroad","Huisnummer buitenland"]
[20,"Postal code abroad","Postcode buitenland"]
[21,"Place of residence abroad","Vestigingsplaats buitenland"]
[22,"Name region","Regionaam"]
[23,"Country name, ISO","Landnaam, ISO"]
[24,"Document information","Informatie over de rapportage"]
[25,"Title of the document","Titel van het document"]
[26,"Start date of the period concerning the financial statement","Startdatum van de periode waarop de jaarrekening betrekking heeft"]
[27,"End date of the period concerning the financial statement","Einddatum van de periode waarop de jaarrekening betrekking heeft"]
[28,"Start date of the previous period concerning the financial statement","Startdatum van de voorgaande periode waarop de jaarrekening betrekking heeft"]
{"$rows_left_out":52}
{"sheet":"Enumerations","index":2,"n_rows":934,"n_cols":41,"rows_kept":934,"cut":false,"hidden":true,"merged":[]}
["Besloten vennootschap met beperkte aansprakelijkheid",null,"Micro",null,"0111",null,"Ja",null,"Commercieel",null,"AED",null,"Ja",null,"Ja",null,"Ja",null,"Na",null,"Na",null,"Bestuurder (huidig)",null,"Bestuurder (huidig)",null,"Bestuurder (huidig)",null,"Bestuurder (huidig)",null,"Bestuurder (huidig)",null,"Ja",null,"Ja",null,"Ja",null,"Ja",null,"Ja"]
["Commanditaire vennootschap",null,null,null,"0116",null,"Nee",null,"Fiscaal",null,"AFN",null,"Nee",null,"Nee",null,"Nee",null,"Voor",null,"Voor",null,"Bestuurder (voormalig)",null,"Bestuurder (voormalig)",null,"Bestuurder (voormalig)",null,"Bestuurder (voormalig)",null,"Bestuurder (voormalig)",null,"Nee",null,"Nee",null,"Nee",null,"Nee",null,"Nee"]
["Cooperatie",null,null,null,"0121",null,null,null,null,null,"ALL",null,null,null,null,null,null,null,null,null,null,null,"Commissaris (huidig)",null,"Commissaris (huidig)",null,"Commissaris (huidig)",null,"Commissaris (huidig)",null,"Commissaris (huidig)"]
["Naamloze vennootschap",null,null,null,"0127",null,null,null,null,null,"AMD",null,null,null,null,null,null,null,null,null,null,null,"Commissaris (voormalig)",null,"Commissaris (voormalig)",null,"Commissaris (voormalig)",null,"Commissaris (voormalig)",null,"Commissaris (voormalig)"]
["Onderlinge waarborgmaatschappij",null,null,null,"0128",null,null,null,null,null,"ANG"]
["Stichting",null,null,null,"0129",null,null,null,null,null,"AOA"]
["Vennootschap onder firma",null,null,null,"0143",null,null,null,null,null,"ARS"]
["Vereniging",null,null,null,"0150",null,null,null,null,null,"AUD"]
[null,null,null,null,"0161",null,null,null,null,null,"AWG"]
[null,null,null,null,"0162",null,null,null,null,null,"AZN"]
[null,null,null,null,"0163",null,null,null,null,null,"BAM"]
[null,null,null,null,"0164",null,null,null,null,null,"BBD"]
[null,null,null,null,"0170",null,null,null,null,null,"BDT"]
[null,null,null,null,"0210",null,null,null,null,null,"BGN"]
[null,null,null,null,"0220",null,null,null,null,null,"BHD"]
[null,null,null,null,"0240",null,null,null,null,null,"BIF"]
[null,null,null,null,"0311",null,null,null,null,null,"BMD"]
[null,null,null,null,"0312",null,null,null,null,null,"BND"]
[null,null,null,null,"0321",null,null,null,null,null,"BOB"]
[null,null,null,null,"0322",null,null,null,null,null,"BOV"]
[null,null,null,null,"0610",null,null,null,null,null,"BRL"]
[null,null,null,null,"0620",null,null,null,null,null,"BSD"]
[null,null,null,null,"0812",null,null,null,null,null,"BTN"]
[null,null,null,null,"0892",null,null,null,null,null,"BWP"]
[null,null,null,null,"0893",null,null,null,null,null,"BYN"]
[null,null,null,null,"0899",null,null,null,null,null,"BZD"]
[null,null,null,null,"0910",null,null,null,null,null,"CAD"]
[null,null,null,null,"0990",null,null,null,null,null,"CDF"]
[null,null,null,null,"1011",null,null,null,null,null,"CHE"]
[null,null,null,null,"1012",null,null,null,null,null,"CHF"]
{"$rows_left_out":905}
{"sheet":"Pre-validation","index":3,"n_rows":102,"n_cols":6,"rows_kept":102,"cut":false,"hidden":true,"merged":[]}
[{"$f":"IF(NOT(Stamdata!H127=\"\"),0,1)+AssertionId(\"existenceAssertion_SigningFinancialStatements_PrtExistence1\")","v":1}]
["KvK: Jaarverantwoording 2023 NLGAAP - micro rechtspersonen - publicatiestukken","valueAssertion_BalanceSheetMicroEntities_PrtFST1SumOfChildrenDParentCredit1","`EquityAndLiabilities` SHOULD be equal to the summation of the underlying values. ","blocking","IF(OR(not(AND(Stamdata!D93=\"\",Stamdata!D94=\"\",Stamdata!D97=\"\")),not(0=0)),IF( Stamdata!D99 = sum(Stamdata!D93,Stamdata!D94,Stamdata!D97),0,1),0)+AssertionId(\"valueAssertion_BalanceSheetMicroEntities_PrtFST1SumOfChildrenDParentCredit1\")","Stamdata!D99"]
["KvK: Jaarverantwoording 2023 NLGAAP - micro rechtspersonen - publicatiestukken","valueAssertion_BalanceSheetMicroEntities_PrtFST1SumOfChildrenDParentCredit1","`EquityAndLiabilities` SHOULD be equal to the summation of the underlying values. ","blocking","IF(OR(not(AND(Stamdata!F93=\"\",Stamdata!F94=\"\",Stamdata!F97=\"\")),not(0=0)),IF( Stamdata!F99 = sum(Stamdata!F93,Stamdata!F94,Stamdata!F97),0,1),0)+AssertionId(\"valueAssertion_BalanceSheetMicroEntities_PrtFST1SumOfChildrenDParentCredit1\")","Stamdata!F99"]
["KvK: Jaarverantwoording 2023 NLGAAP - micro rechtspersonen - publicatiestukken","valueAssertion_BalanceSheetMicroEntities_PrtFST1SumOfChildrenDParentCredit2","`Liabilities` SHOULD be equal to the summation of the underlying values. ","blocking","IF(OR(not(AND(Stamdata!D95=\"\",Stamdata!D96=\"\")),not(0=0)),IF( Stamdata!D97 = sum(Stamdata!D95,Stamdata!D96),0,1),0)+AssertionId(\"valueAssertion_BalanceSheetMicroEntities_PrtFST1SumOfChildrenDParentCredit2\")","Stamdata!D97"]
["KvK: Jaarverantwoording 2023 NLGAAP - micro rechtspersonen - publicatiestukken","valueAssertion_BalanceSheetMicroEntities_PrtFST1SumOfChildrenDParentCredit2","`Liabilities` SHOULD be equal to the summation of the underlying values. ","blocking","IF(OR(not(AND(Stamdata!F95=\"\",Stamdata!F96=\"\")),not(0=0)),IF( Stamdata!F97 = sum(Stamdata!F95,Stamdata!F96),0,1),0)+AssertionId(\"valueAssertion_BalanceSheetMicroEntities_PrtFST1SumOfChildrenDParentCredit2\")","Stamdata!F97"]
["KvK: Jaarverantwoording 2023 NLGAAP - micro rechtspersonen - publicatiestukken","valueAssertion_BalanceSheetMicroEntities_PrtFST1SumOfChildrenDParentDebit1","`AssetsCurrent` SHOULD be equal to the summation of the underlying values. ","blocking","IF(OR(not(0=0),not(AND(Stamdata!D87=\"\",Stamdata!D88=\"\"))),IF( Stamdata!D89 = + sum(Stamdata!D87,Stamdata!D88),0,1),0)+AssertionId(\"valueAssertion_BalanceSheetMicroEntities_PrtFST1SumOfChildrenDParentDebit1\")","Stamdata!D89"]
["KvK: Jaarverantwoording 2023 NLGAAP - micro rechtspersonen - publicatiestukken","valueAssertion_BalanceSheetMicroEntities_PrtFST1SumOfChildrenDParentDebit1","`AssetsCurrent` SHOULD be equal to the summation of the underlying values. ","blocking","IF(OR(not(0=0),not(AND(Stamdata!F87=\"\",Stamdata!F88=\"\"))),IF( Stamdata!F89 = + sum(Stamdata!F87,Stamdata!F88),0,1),0)+AssertionId(\"valueAssertion_BalanceSheetMicroEntities_PrtFST1SumOfChildrenDParentDebit1\")","Stamdata!F89"]
["KvK: Jaarverantwoording 2023 NLGAAP - micro rechtspersonen - publicatiestukken","valueAssertion_BalanceSheetMicroEntities_PrtFST1SumOfChildrenDParentDebit2","`AssetsNoncurrent` SHOULD be equal to the summation of the underlying values. ","blocking","IF(OR(not(0=0),not(AND(Stamdata!D83=\"\",Stamdata!D84=\"\"))),IF( Stamdata!D85 = + sum(Stamdata!D83,Stamdata!D84),0,1),0)+AssertionId(\"valueAssertion_BalanceSheetMicroEntities_PrtFST1SumOfChildrenDParentDebit2\")","Stamdata!D85"]
["KvK: Jaarverantwoording 2023 NLGAAP - micro rechtspersonen - publicatiestukken","valueAssertion_BalanceSheetMicroEntities_PrtFST1SumOfChildrenDParentDebit2","`AssetsNoncurrent` SHOULD be equal to the summation of the underlying values. ","blocking","IF(OR(not(0=0),not(AND(Stamdata!F83=\"\",Stamdata!F84=\"\"))),IF( Stamdata!F85 = + sum(Stamdata!F83,Stamdata!F84),0,1),0)+AssertionId(\"valueAssertion_BalanceSheetMicroEntities_PrtFST1SumOfChildrenDParentDebit2\")","Stamdata!F85"]
["KvK: Jaarverantwoording 2023 NLGAAP - micro rechtspersonen - publicatiestukken","valueAssertion_BalanceSheetMicroEntities_PrtFST1SumOfChildrenDParentDebit3","`Assets` SHOULD be equal to the summation of the underlying values. ","blocking","IF(OR(not(0=0),not(AND(Stamdata!D85=\"\",Stamdata!D89=\"\"))),IF( Stamdata!D91 = + sum(Stamdata!D85,Stamdata!D89),0,1),0)+AssertionId(\"valueAssertion_BalanceSheetMicroEntities_PrtFST1SumOfChildrenDParentDebit3\")","Stamdata!D91"]
["KvK: Jaarverantwoording 2023 NLGAAP - micro rechtspersonen - publicatiestukken","valueAssertion_BalanceSheetMicroEntities_PrtFST1SumOfChildrenDParentDebit3","`Assets` SHOULD be equal to the summation of the underlying values. ","blocking","IF(OR(not(0=0),not(AND(Stamdata!F85=\"\",Stamdata!F89=\"\"))),IF( Stamdata!F91 = + sum(Stamdata!F85,Stamdata!F89),0,1),0)+AssertionId(\"valueAssertion_BalanceSheetMicroEntities_PrtFST1SumOfChildrenDParentDebit3\")","Stamdata!F91"]
["KvK: Jaarverantwoording 2023 NLGAAP - micro rechtspersonen - publicatiestukken","valueAssertion_BalanceSheetMicroEntities_PrtFST101Variable1","`EquityAndLiabilities` SHOULD be equal to + `Assets`. ","blocking","IF(+ Stamdata!D91 = Stamdata!D99 ,0,1)+AssertionId(\"valueAssertion_BalanceSheetMicroEntities_PrtFST101Variable1\")","Stamdata!D91"]
["KvK: Jaarverantwoording 2023 NLGAAP - micro rechtspersonen - publicatiestukken","valueAssertion_BalanceSheetMicroEntities_PrtFST101Variable1","`EquityAndLiabilities` SHOULD be equal to + `Assets`. ","blocking","IF(+ Stamdata!F91 = Stamdata!F99 ,0,1)+AssertionId(\"valueAssertion_BalanceSheetMicroEntities_PrtFST101Variable1\")","Stamdata!F91"]
["KvK: Jaarverantwoording 2023 NLGAAP - micro rechtspersonen - publicatiestukken","existenceAssertion_BalanceSheetMicroEntities_PrtExistence1","`BalanceSheetBeforeAfterAppropriationResults` MUST exist at least once.","blocking","IF(NOT(Stamdata!D81=\"\"),0,1)+AssertionId(\"existenceAssertion_BalanceSheetMicroEntities_PrtExistence1\")","Stamdata!D81"]
["KvK: Jaarverantwoording 2023 NLGAAP - micro rechtspersonen - publicatiestukken","existenceAssertion_BalanceSheetMicroEntities_PrtExistence1","`BalanceSheetBeforeAfterAppropriationResults` MUST exist at least once.","blocking","IF(NOT(Stamdata!F81=\"\"),0,1)+AssertionId(\"existenceAssertion_BalanceSheetMicroEntities_PrtExistence1\")","Stamdata!F81"]
["KvK: Jaarverantwoording 2023 NLGAAP - micro rechtspersonen - publicatiestukken","existenceAssertion_BalanceSheetMicroEntities_PrtOnlyReportFactPeriodEQParam1","`BalanceSheetBeforeAfterAppropriationResults` SHOULD not exist for any period other than the current period.","blocking","IF(NOT(Stamdata!D81=\"\"),0,1)+AssertionId(\"existenceAssertion_BalanceSheetMicroEntities_PrtOnlyReportFactPeriodEQParam1\")","Stamdata!D81"]
["KvK: Jaarverantwoording 2023 NLGAAP - micro rechtspersonen - publicatiestukken","existenceAssertion_BalanceSheetMicroEntities_PrtOnlyReportFactPeriodEQParam1","`BalanceSheetBeforeAfterAppropriationResults` SHOULD not exist for any period other than the current period.","blocking","IF(NOT(Stamdata!F81=\"\"),0,1)+AssertionId(\"existenceAssertion_BalanceSheetMicroEntities_PrtOnlyReportFactPeriodEQParam1\")","Stamdata!F81"]
["KvK: Jaarverantwoording 2023 NLGAAP - micro rechtspersonen - publicatiestukken","valueAssertion_DocumentInformation_PrtDateEarlier24HDateLater1","The date reported for `FinancialReportingPeriodPreviousEndDate` MUST be one day earlier than the date reported for `FinancialReportingPeriodCurrentStartDate`. ","blocking","IF((Stamdata!D59)+ 1 = (Stamdata!D56),0,1)+AssertionId(\"valueAssertion_DocumentInformation_PrtDateEarlier24HDateLater1\")","Stamdata!D56"]
["KvK: Jaarverantwoording 2023 NLGAAP - micro rechtspersonen - publicatiestukken","valueAssertion_DocumentInformation_PrtDateEarlierDateLater1","The date reported for `FinancialReportingPeriodCurrentEndDate` MUST be earlier than the date reported for `DocumentAdoptionDate`. ","blocking","IF(Stamdata!D57 < Stamdata!D68,0,1)+AssertionId(\"valueAssertion_DocumentInformation_PrtDateEarlierDateLater1\")","Stamdata!D68"]
["KvK: Jaarverantwoording 2023 NLGAAP - micro rechtspersonen - publicatiestukken","valueAssertion_DocumentInformation_PrtDateEarlierDateLater2","The date reported for `FinancialReportingPeriodPreviousStartDate` MUST be earlier than the date reported for `FinancialReportingPeriodPreviousEndDate`. ","blocking","IF(Stamdata!D58 < Stamdata!D59,0,1)+AssertionId(\"valueAssertion_DocumentInformation_PrtDateEarlierDateLater2\")","Stamdata!D59"]
["KvK: Jaarverantwoording 2023 NLGAAP - micro rechtspersonen - publicatiestukken","valueAssertion_DocumentInformation_PrtDateEarlierDateLater3","The date reported for `FinancialReportingPeriodCurrentStartDate` MUST be earlier than the date reported for `FinancialReportingPeriodCurrentEndDate`. ","blocking","IF(Stamdata!D56 < Stamdata!D57,0,1)+AssertionId(\"valueAssertion_DocumentInformation_PrtDateEarlierDateLater3\")","Stamdata!D57"]
["KvK: Jaarverantwoording 2023 NLGAAP - micro rechtspersonen - publicatiestukken","valueAssertion_DocumentInformation_PrtDateEarlierEQDateLater1","The date reported for `FinancialStatementsDateOfPreparation` SHOULD be earlier than, or equal to, the date reported for `DocumentAdoptionDate`. ","blocking","IF(Stamdata!D66 <= Stamdata!D68,0,1)+AssertionId(\"valueAssertion_DocumentInformation_PrtDateEarlierEQDateLater1\")","Stamdata!D68"]
["KvK: Jaarverantwoording 2023 NLGAAP - micro rechtspersonen - publicatiestukken","valueAssertion_DocumentInformation_PrtDateEarlierEQYearDateLaterThnValue1","The reported value of `FinancialReportingPeriodDifferentThanAnnualStatus` SHOULD be equal to `Nee`, because the period from `FinancialReportingPeriodCurrentStartDate` to `FinancialReportingPeriodCurrentEndDate` is equal to the standard reporting period of one year. ","blocking","IF(((Stamdata!D56) + 365 - 1) = (Stamdata!D57),IF(Stamdata!D60 = \"Nee\",0,1),0)+AssertionId(\"valueAssertion_DocumentInformation_PrtDateEarlierEQYearDateLaterThnValue1\")","Stamdata!D60"]
["KvK: Jaarverantwoording 2023 NLGAAP - micro rechtspersonen - publicatiestukken","valueAssertion_DocumentInformation_PrtDateEarlierNEYearDateLaterThnValue1","The reported value of `FinancialReportingPeriodDifferentThanAnnualStatus` SHOULD be equal to `Ja`, because the period from `FinancialReportingPeriodCurrentStartDate` to `FinancialReportingPeriodCurrentEndDate` differs from than the standard reporting period of one year. ","blocking","IF(((Stamdata!D56) + 365 - 1) <> (Stamdata!D57),IF(Stamdata!D60 = \"Ja\",0,1),0)+AssertionId(\"valueAssertion_DocumentInformation_PrtDateEarlierNEYearDateLaterThnValue1\")","Stamdata!D60"]
["KvK: Jaarverantwoording 2023 NLGAAP - micro rechtspersonen - publicatiestukken","valueAssertion_DocumentInformation_PrtDateEarlierThanCurrent1","The date reported for `FinancialReportingPeriodCurrentEndDate` SHOULD be earlier than the current date. ","blocking","IF(Stamdata!D57 < NOW,0,1)+AssertionId(\"valueAssertion_DocumentInformation_PrtDateEarlierThanCurrent1\")","Stamdata!D57"]
["KvK: Jaarverantwoording 2023 NLGAAP - micro rechtspersonen - publicatiestukken","valueAssertion_DocumentInformation_PrtDateEarlierThanEQDateCurrent1","The date reported for `DocumentAdoptionDate` SHOULD be earlier than, or equal to, the current date. ","blocking","IF(Stamdata!D68 <= NOW,0,1)+AssertionId(\"valueAssertion_DocumentInformation_PrtDateEarlierThanEQDateCurrent1\")","Stamdata!D68"]
["KvK: Jaarverantwoording 2023 NLGAAP - micro rechtspersonen - publicatiestukken","valueAssertion_DocumentInformation_PrtExistenceThnExistence1","`FinancialReportingPeriodPreviousStartDate` SHOULD exist at least once within the same context, because `FinancialReportingPeriodPreviousEndDate` is reported. ","blocking","IF(not(Stamdata!D58=\"\"),0,1)+AssertionId(\"valueAssertion_DocumentInformation_PrtExistenceThnExistence1\")","Stamdata!D58"]
["KvK: Jaarverantwoording 2023 NLGAAP - micro rechtspersonen - publicatiestukken","valueAssertion_DocumentInformation_PrtExistenceThnExistence2","`FinancialReportingPeriodPreviousEndDate` SHOULD exist at least once within the same context, because `FinancialReportingPeriodPreviousStartDate` is reported. ","blocking","IF(not(Stamdata!D59=\"\"),0,1)+AssertionId(\"valueAssertion_DocumentInformation_PrtExistenceThnExistence2\")","Stamdata!D59"]
["KvK: Jaarverantwoording 2023 NLGAAP - micro rechtspersonen - publicatiestukken","valueAssertion_DocumentInformation_PrtValueThnExistence1","`FinancialReportingPeriodDifferentThanAnnualReasonDescription` SHOULD exist at least once, because the reported value of `FinancialReportingPeriodDifferentThanAnnualStatus` is equal to `Ja`. ","blocking","IF(Stamdata!D60 = \"Ja\",IF(not(Stamdata!D61=\"\"),0,1),0)+AssertionId(\"valueAssertion_DocumentInformation_PrtValueThnExistence1\")","Stamdata!D61"]
["KvK: Jaarverantwoording 2023 NLGAAP - micro rechtspersonen - publicatiestukken","valueAssertion_DocumentInformation_PrtValueThnExistence2","`FinancialReportingPeriodDifferentThanAnnualImpactComparatives` SHOULD exist at least once, because the reported value of `FinancialReportingPeriodDifferentThanAnnualStatus` is equal to `Ja`. ","blocking","IF(Stamdata!D60 = \"Ja\",IF(not(Stamdata!D62=\"\"),0,1),0)+AssertionId(\"valueAssertion_DocumentInformation_PrtValueThnExistence2\")","Stamdata!D62"]
{"$rows_left_out":73}
{"sheet":"XBRL Errors","index":4,"n_rows":1,"n_cols":2,"rows_kept":1,"cut":false,"hidden":false,"merged":[]}
["timestamp","Error"]