{"text_format":"1","workbook":"xlsx","n_sheets":38,"sheets":["General data","XBRL Errors","Index","Show","Hierarchies","T0","T1","T2","T3","T4","T5","T6","T6-1","T7","T8","T9","T10","T11","T12","T13","T14","T15-1","T15-2","T16-1","T16-2","T17","T18","T19","T20","T21","T22","T23","T24A","T24B","T25A","T25B","T26A","T26B"],"not_rendered":{"charts":0,"images":3,"macros":1,"external_links":0,"defined_names":55,"comments":0,"pivot_tables":0},"unopened":[],"bounds":{"document_bytes":16777216,"sheet_cells":100000,"rows_first":2000,"rows_last":500,"rows_between":2000,"halvings":0,"cell_chars":16384,"cell_head_chars":4096},"cells_cut":0,"cells_raw":0,"read":"whole","date_system":"1900"}

{"sheet":"General data","index":0,"n_rows":247,"n_cols":23,"rows_kept":247,"cut":false,"hidden":false,"merged":[[0,6,2,6],[3,0,5,9]]}
[null,null,null,null,null,null,null,"Version:",null,"2.5.0.1",null,null,null,null,null,null,"Not applicable/All geographical areas","http://standards.iso.org/iso/17442","Module met alle tabellen","PPI-ALL","01","EUR","NL PPI 2.5.0"]
[null,null,null,null,null,null,null,null,null,null,null,null,null,null,null,null,"AFGHANISTAN","http://standards.iso.org/iso/17442","Premiepensioeninstellingen, Kwartaalrapportage","PPI-KW","16","AED"]
[null,null,null,null,null,null,null," ",null,null,null,null,null,null,null,null,"ALBANIA","http://standards.iso.org/iso/17442","Premiepensioeninstellingen, Jaarrapportage","PPI-J","17","AFN"]
[null,null,null,null,null,null,null,null,null,null,null,null,null,null,null,null,"ALGERIA","http://standards.iso.org/iso/17442",null,null,"18","ALL"]
[null,null,null,null,null,null,null,null,null,null,null,null,null,null,null,null,"AMERICAN SAMOA","http://standards.iso.org/iso/17442",null,null,"19","AMD"]
[null,null,null,null,null,null,null,null,null,null,null,null,null,null,null,null,"ANDORRA","http://standards.iso.org/iso/17442",null,null,"20","ANG"]
[null,null,null,null,null,null,null,null,null,null,null,null,null,null,null,null,"ANGOLA","http://standards.iso.org/iso/17442",null,null,"All","AOA"]
[null,"General Data",null,null,null,null,null,null,null,null,null,"/General data label{B}","/General data value{E}",null,null,null,"ANGUILLA","http://standards.iso.org/iso/17442",null,null,"All","ARS"]
[null,null,null,null,null,null,null,null,null,null,null,null,null,null,null,null,"ANTARCTICA","http://standards.iso.org/iso/17442",null,null,null,"AUD"]
["*","Identifier",":","LEGALIDENTIFIER20POS",{"$f":"\"\"&D10","v":"LEGALIDENTIFIER20POS"},{"$f":"IF(D10=\"\",1,0)","v":0},null,null,null,null,null,null,null,null,null,null,"ANTIGUA AND BARBUDA","http://standards.iso.org/iso/17442",null,null,null,"AWG"]
{"$rows_left_out":238}
{"sheet":"XBRL Errors","index":1,"n_rows":1,"n_cols":2,"rows_kept":1,"cut":false,"hidden":false,"merged":[]}
["Timestamp","Error"]

{"sheet":"Index","index":2,"n_rows":38,"n_cols":5,"rows_kept":38,"cut":false,"hidden":false,"merged":[[2,1,2,14]]}
[]
[]
[null,"Index"]
[]
[null,"Template Code","Template Name","Reporting Status"]
[null,"T0","Algemene gegevens",null,{"$f":"IF($D$6=\"Reported\",\"@ForceFilingCode:true\",IF($D$6=\"Not Reported\",\"@ForceFilingCode:false\",\"\"))","v":""}]
[null,"T1","Geconsolideerde balans, voor winstbestemming",null,{"$f":"IF($D$7=\"Reported\",\"@ForceFilingCode:true\",IF($D$7=\"Not Reported\",\"@ForceFilingCode:false\",\"\"))","v":""}]
[null,"T2","Winst- en verliesrekening",null,{"$f":"IF($D$8=\"Reported\",\"@ForceFilingCode:true\",IF($D$8=\"Not Reported\",\"@ForceFilingCode:false\",\"\"))","v":""}]
[null,"T3","Verplichtingen voor rekening en risico deelnemers",null,{"$f":"IF($D$9=\"Reported\",\"@ForceFilingCode:true\",IF($D$9=\"Not Reported\",\"@ForceFilingCode:false\",\"\"))","v":""}]
[null,"T4","Buiten de balans blijkende onderdelen",null,{"$f":"IF($D$10=\"Reported\",\"@ForceFilingCode:true\",IF($D$10=\"Not Reported\",\"@ForceFilingCode:false\",\"\"))","v":""}]
{"$rows_left_out":29}
{"sheet":"Show","index":3,"n_rows":68,"n_cols":5,"rows_kept":68,"cut":false,"hidden":true,"merged":[]}
["Sheet","Prefix","PPI-ALL","PPI-KW","PPI-J"]
["T0",{"$f":"IF(AND(HLOOKUP('General data'!$E$22,$C$1:$F$2,2,FALSE)=\"X\",Index!D6=\"Reported\"),\"/\",\"!\")","v":"!"},"X","X","X"]
["T1",{"$f":"IF(AND(HLOOKUP('General data'!$E$22,$C$1:$F$3,3,FALSE)=\"X\",Index!D7=\"Reported\"),\"/\",\"!\")","v":"!"},"X","X","X"]
["T2",{"$f":"IF(AND(HLOOKUP('General data'!$E$22,$C$1:$F$4,4,FALSE)=\"X\",Index!D8=\"Reported\"),\"/\",\"!\")","v":"!"},"X","X","X"]
["T3",{"$f":"IF(AND(HLOOKUP('General data'!$E$22,$C$1:$F$5,5,FALSE)=\"X\",Index!D9=\"Reported\"),\"/\",\"!\")","v":"!"},"X","X","X"]
["T4",{"$f":"IF(AND(HLOOKUP('General data'!$E$22,$C$1:$F$6,6,FALSE)=\"X\",Index!D10=\"Reported\"),\"/\",\"!\")","v":"!"},"X","X","X"]
["T5",{"$f":"IF(AND(HLOOKUP('General data'!$E$22,$C$1:$F$7,7,FALSE)=\"X\",Index!D11=\"Reported\"),\"/\",\"!\")","v":"!"},"X","X","X"]
["T6",{"$f":"IF(AND(HLOOKUP('General data'!$E$22,$C$1:$F$8,8,FALSE)=\"X\",Index!D12=\"Reported\"),\"/\",\"!\")","v":"!"},"X","X","X"]
["T6-1",{"$f":"IF(AND(HLOOKUP('General data'!$E$22,$C$1:$F$9,9,FALSE)=\"X\",Index!D13=\"Reported\"),\"/\",\"!\")","v":"!"},"X","X","X"]
["T7",{"$f":"IF(AND(HLOOKUP('General data'!$E$22,$C$1:$F$10,10,FALSE)=\"X\",Index!D14=\"Reported\"),\"/\",\"!\")","v":"!"},"X","X","X"]
{"$rows_left_out":59}
{"sheet":"Hierarchies","index":4,"n_rows":7,"n_cols":5,"rows_kept":7,"cut":false,"hidden":true,"merged":[]}
["hier_ppi_dom002_001","hier_ppi_dom007_001","hier_ppi_dom015_001","hier_ppi_dom022_001","hier_ppi_dom027_001"]
["Nederland","Verstrekte leningen","Ja","Statutaire directie, bestuursleden","Onderpand toegezegd [CP]"]
["Wereldwijd niet-EU-landen","Ontvangen leningen","Nee","Overige dagelijkse beleidsbepalers","Ontvangen onderpand voor herverzekering [CR]"]
["EU-landen exclusief Nederland","Verstrekte garanties",null,"Wettelijke vertegenwoordigders voor Nederlandse bijkantoren","Onderpand voor geleende effecten [CB]"]
[null,"Ontvangen garanties",null,"Interne toezichthouders","Repos [R]"]
[null,"Overige vorderingen",null,null,"Geen onderpand"]
[null,"Overige passiva"]

{"sheet":"T0","index":5,"n_rows":20,"n_cols":9,"rows_kept":20,"cut":false,"hidden":true,"merged":[[1,1,1,14],[4,1,4,11],[8,3,9,3],[10,3,11,3]]}
["Back to Index"]
[null,"Tabel groep 0: Algemene gegevens"]
[]
[]
[null,"Algemene gegevens"]
[]
[]
[]
[null,null,null,"x-as"]
[]
{"$rows_left_out":11}
{"sheet":"T1","index":6,"n_rows":68,"n_cols":9,"rows_kept":68,"cut":false,"hidden":true,"merged":[[1,1,1,14],[4,1,4,11],[8,3,9,3],[10,3,13,3]]}
["Back to Index"]
[null,"Tabel groep 1: Geconsolideerde balans, voor winstbestemming"]
[]
[]
[null,"Geconsolideerde balans, voor winstbestemming"]
[]
[]
[]
[null,null,null,"x-as"]
[]
{"$rows_left_out":59}
{"sheet":"T2","index":7,"n_rows":47,"n_cols":9,"rows_kept":47,"cut":false,"hidden":true,"merged":[[1,1,1,14],[4,1,4,11],[8,3,9,3],[10,3,12,3]]}
["Back to Index"]
[null,"Tabel groep 2: Winst- en verliesrekening"]
[]
[]
[null,"Winst- en verliesrekening"]
[]
[]
[]
[null,null,null,"x-as"]
[]
{"$rows_left_out":38}
{"sheet":"T3","index":8,"n_rows":32,"n_cols":9,"rows_kept":32,"cut":false,"hidden":true,"merged":[[1,1,1,14],[4,1,4,11],[8,3,9,3],[10,3,13,3]]}
["Back to Index"]
[null,"Tabel groep 3: Verplichtingen voor rekening en risico deelnemers"]
[]
[]
[null,"Verplichtingen voor rekening en risico deelnemers"]
[]
[]
[]
[null,null,null,"x-as"]
[]
{"$rows_left_out":23}
{"sheet":"T4","index":9,"n_rows":14,"n_cols":9,"rows_kept":14,"cut":false,"hidden":true,"merged":[[1,1,1,14],[4,1,4,11],[8,1,10,1],[8,2,9,3]]}
["Back to Index"]
[null,"Tabel groep 4: Niet uit de balans blijkende vorderingen en verplichtingen"]
[]
[]
[null,"Buiten de balans blijkende onderdelen"]
[]
[]
[]
[null,"Naam","x-as"]
[]
{"$rows_left_out":5}
{"sheet":"T5","index":10,"n_rows":39,"n_cols":9,"rows_kept":39,"cut":false,"hidden":true,"merged":[[1,1,1,14],[4,1,4,11],[8,3,9,3],[10,3,11,3]]}
["Back to Index"]
[null,"Tabel groep 5: Berekening minimaal vereist eigen vermogen en solvabiliteitseis"]
[]
[]
[null,"Berekening minimaal vereist eigen vermogen en solvabiliteitseis"]
[]
[]
[]
[null,null,null,"x-as"]
[]
{"$rows_left_out":30}
{"sheet":"T6","index":11,"n_rows":21,"n_cols":14,"rows_kept":21,"cut":false,"hidden":true,"merged":[[1,1,1,14],[4,1,4,11],[8,3,9,8],[10,3,10,8]]}
["Back to Index"]
[null,"Tabel groep 6: Deelnemers"]
[]
[]
[null,"Deelnemers naar leeftijdscohort"]
[]
[]
[]
[null,null,null,"x-as"]
[]
{"$rows_left_out":12}
{"sheet":"T6-1","index":12,"n_rows":20,"n_cols":15,"rows_kept":20,"cut":false,"hidden":true,"merged":[[1,1,1,14],[4,1,4,11],[8,3,9,9],[10,3,12,3],[10,4,10,8],[10,9,12,9],[11,4,11,5],[11,6,11,8]]}
["Back to Index"]
[null,"Tabel groep 6: Deelnemers"]
[]
[]
[null,"Deelnemers"]
[]
[]
[]
[null,null,null,"x-as"]
[]
{"$rows_left_out":11}
{"sheet":"T7","index":13,"n_rows":49,"n_cols":11,"rows_kept":49,"cut":false,"hidden":true,"merged":[[1,1,1,14],[4,1,4,11],[8,3,9,5],[10,3,12,3],[10,4,12,4],[10,5,12,5]]}
["Back to Index"]
[null,"Tabel groep 7: Beleggingen voor risico deelnemer (marktwaarde)"]
[]
[]
[null,"Beleggingen voor risico deelnemer"]
[]
[]
[]
[null,null,null,"x-as"]
[]
{"$rows_left_out":40}
{"sheet":"T8","index":14,"n_rows":22,"n_cols":14,"rows_kept":22,"cut":false,"hidden":true,"merged":[[1,1,1,14],[4,1,4,11],[8,3,9,8],[10,3,10,8]]}
["Back to Index"]
[null,"Tabel groep 8: Life cycle beleggingen naar leeftijdscohort"]
[]
[]
[null,"Beleggingen naar leeftijdscohort"]
[]
[]
[]
[null,null,null,"x-as"]
[]
{"$rows_left_out":13}
{"sheet":"T9","index":15,"n_rows":38,"n_cols":14,"rows_kept":38,"cut":false,"hidden":true,"merged":[[1,1,1,14],[4,1,4,11],[8,3,9,8],[10,3,10,8],[11,3,12,3],[11,4,12,4],[11,5,12,5],[11,6,12,6],[11,7,12,7],[11,8,12,8]]}
["Back to Index"]
[null,"Tabel groep 9: Life Cycle beleggingen naar leeftijdscohort"]
[]
[]
[null,"Life cycle beleggingen naar leeftijdscohort"]
[]
[]
[]
[null,null,null,"x-as"]
[]
{"$rows_left_out":29}
{"sheet":"T10","index":16,"n_rows":26,"n_cols":11,"rows_kept":26,"cut":false,"hidden":true,"merged":[[1,1,1,14],[4,1,4,11],[8,3,9,5],[10,3,11,3],[10,4,11,4],[10,5,11,5]]}
["Back to Index"]
[null,"Tabel groep 10: Life cycle beleggingen, vastrentende waarden"]
[]
[]
[null,"Life cycle beleggingen, vastrentende waarden, exclusief derivaten: credit ratings"]
[]
[]
[]
[null,null,null,"x-as"]
[]
{"$rows_left_out":17}
{"sheet":"T11","index":17,"n_rows":18,"n_cols":14,"rows_kept":18,"cut":false,"hidden":true,"merged":[[1,1,1,14],[4,1,4,11],[8,3,9,8],[10,3,10,8]]}
["Back to Index"]
[null,"Tabel groep 11: Life cycle beleggingen, modified duration"]
[]
[]
[null,"Life cycle beleggingen: modified duration"]
[]
[]
[]
[null,null,null,"x-as"]
[]
{"$rows_left_out":9}
{"sheet":"T12","index":18,"n_rows":25,"n_cols":20,"rows_kept":25,"cut":false,"hidden":true,"merged":[[11,3,11,5],[11,6,11,8],[11,9,11,11],[11,12,11,14],[1,1,1,14],[4,1,4,11],[8,3,9,14],[10,3,10,8],[10,9,10,14]]}
["Back to Index"]
[null,"Tabel groep 12: Beleggingen, rendementen"]
[]
[]
[null,"Beleggingen: rendementen"]
[]
[]
[]
[null,null,null,"x-as"]
[]
{"$rows_left_out":16}
{"sheet":"T13","index":19,"n_rows":17,"n_cols":9,"rows_kept":17,"cut":false,"hidden":true,"merged":[[1,1,1,14],[4,1,4,11],[8,3,9,3]]}
["Back to Index"]
[null,"Tabel groep 13: Contracten en reglementen"]
[]
[]
[null,"Reglementen en contracten"]
[]
[]
[]
[null,null,null,"x-as"]
[]
{"$rows_left_out":8}
{"sheet":"T14","index":20,"n_rows":50,"n_cols":9,"rows_kept":50,"cut":false,"hidden":true,"merged":[[1,1,1,14],[4,1,4,11],[8,3,9,3],[10,3,11,3]]}
["Back to Index"]
[null,"Tabel groep 14: Toelichtingen"]
[]
[]
[null,"Toelichtingen"]
[]
[]
[]
[null,null,null,"x-as"]
[]
{"$rows_left_out":41}
{"sheet":"T15-1","index":21,"n_rows":22,"n_cols":11,"rows_kept":22,"cut":false,"hidden":true,"merged":[[1,1,1,14],[4,1,4,11],[8,3,9,5],[10,3,11,3],[10,4,11,4],[10,5,11,5]]}
["Back to Index"]
[null,"Tabel groep 15: Kostenspecificatie"]
[]
[]
[null,"Specificatie uitvoeringskosten"]
[]
[]
[]
[null,null,null,"x-as"]
[]
{"$rows_left_out":13}
{"sheet":"T15-2","index":22,"n_rows":33,"n_cols":12,"rows_kept":33,"cut":false,"hidden":true,"merged":[[1,1,1,14],[4,1,4,11],[8,3,9,6],[10,3,11,3],[10,4,11,4],[10,5,11,5],[10,6,11,6]]}
["Back to Index"]
[null,"Tabel groep 15: Kostenspecificatie"]
[]
[]
[null,"Specificatie vermogensbeheerkosten"]
[]
[]
[]
[null,null,null,"x-as"]
[]
{"$rows_left_out":24}
{"sheet":"T16-1","index":23,"n_rows":24,"n_cols":17,"rows_kept":24,"cut":false,"hidden":true,"merged":[[1,1,1,14],[4,1,4,11],[8,3,9,11],[10,3,10,8],[10,9,10,10],[10,11,11,11]]}
["Back to Index"]
[null,"Tabel groep 16: Toelichting balans: eigen vermogen"]
[]
[]
[null,"Toelichting balans: eigen vermogen"]
[]
[]
[]
[null,null,null,"x-as"]
[]
{"$rows_left_out":15}
{"sheet":"T16-2","index":24,"n_rows":14,"n_cols":13,"rows_kept":14,"cut":false,"hidden":true,"merged":[[1,1,1,14],[4,1,4,11],[8,1,10,1],[8,2,9,7]]}
["Back to Index"]
[null,"Tabel groep 16: Toelichting balans: eigen vermogen"]
[]
[]
[null,"Toelichting balans: eigen vermogen, NV of BV: aandelen naar soort"]
[]
[]
[]
[null,"Soort aandeel","x-as"]
[]
{"$rows_left_out":5}
{"sheet":"T17","index":25,"n_rows":14,"n_cols":16,"rows_kept":14,"cut":false,"hidden":true,"merged":[[1,1,1,14],[4,1,4,11],[8,1,10,1],[8,2,9,10]]}
["Back to Index"]
[null,"Tabel groep 17: Toelichting balans: achtergestelde leningen"]
[]
[]
[null,"Toelichting balans: achtergestelde leningen"]
[]
[]
[]
[null,"Omschrijving lening / naam schuldeiser","x-as"]
[]
{"$rows_left_out":5}
{"sheet":"T18","index":26,"n_rows":21,"n_cols":10,"rows_kept":21,"cut":false,"hidden":true,"merged":[[1,1,1,14],[4,1,4,11],[8,3,9,4],[10,3,11,3],[10,4,11,4]]}
["Back to Index"]
[null,"Tabel groep 18: Toelichting winst- en verliesrekening: premie en provisie"]
[]
[]
[null,"Toelichting winst- en verliesrekening: premie en provisie"]
[]
[]
[]
[null,null,null,"x-as"]
[]
{"$rows_left_out":12}
{"sheet":"T19","index":27,"n_rows":22,"n_cols":18,"rows_kept":22,"cut":false,"hidden":true,"merged":[[1,1,1,14],[4,1,4,11],[8,3,9,12],[10,3,10,7],[10,8,10,12]]}
["Back to Index"]
[null,"Tabel groep 19: Beloningen"]
[]
[]
[null,"Beloningen"]
[]
[]
[]
[null,null,null,"x-as"]
[]
{"$rows_left_out":13}
{"sheet":"T20","index":28,"n_rows":14,"n_cols":11,"rows_kept":14,"cut":false,"hidden":true,"merged":[[1,1,1,14],[4,1,4,11],[8,1,10,1],[8,2,9,5]]}
["Back to Index"]
[null,"Tabel groep 20: Organisatie en risico's"]
[]
[]
[null,"Organisatie en risico´s"]
[]
[]
[]
[null,"Naam","x-as"]
[]
{"$rows_left_out":5}
{"sheet":"T21","index":29,"n_rows":21,"n_cols":12,"rows_kept":21,"cut":false,"hidden":true,"merged":[[1,1,1,14],[4,1,4,11],[8,3,9,6],[10,3,11,3],[10,4,11,4],[10,5,11,5],[10,6,11,6]]}
["Back to Index"]
[null,"Tabel groep 21: Nevenactiviteiten"]
[]
[]
[null,"Nevenactiviteiten"]
[]
[]
[]
[null,null,null,"x-as"]
[]
{"$rows_left_out":12}
{"sheet":"T22","index":30,"n_rows":15,"n_cols":15,"rows_kept":15,"cut":false,"hidden":true,"merged":[[1,1,1,14],[4,1,4,11],[8,1,11,1],[8,2,9,9],[10,2,10,5],[10,6,10,7],[10,8,10,9]]}
["Back to Index"]
[null,"Tabel groep 22: Bijkantoren en vrije dienstverrichting (EU en niet-EU)"]
[]
[]
[null,"Bijkantoren en vrije dienstverrichting, EU en niet-EU"]
[]
[]
[]
[null,"Land","x-as"]
[]
{"$rows_left_out":6}
{"sheet":"T23","index":31,"n_rows":113,"n_cols":9,"rows_kept":113,"cut":false,"hidden":true,"merged":[[1,1,1,14],[4,1,4,11],[8,3,9,3],[10,3,12,3]]}
["Back to Index"]
[null,"Tabel groep 23: Toelichtingen"]
[]
[]
[null,"Toelichtingen"]
[]
[]
[]
[null,null,null,"x-as"]
[]
{"$rows_left_out":104}
{"sheet":"T24A","index":32,"n_rows":14,"n_cols":19,"rows_kept":14,"cut":false,"hidden":true,"merged":[[1,1,1,14],[4,1,4,11],[8,1,10,1],[8,2,10,2],[8,3,9,13]]}
["Back to Index"]
[null,"Tabel groep 24: Aangehouden beleggingen"]
[]
[]
[null,"Aangehouden beleggingen - informatie over posities"]
[]
[]
[]
[null,"Regelnummer","Identificatiecode en soortcode van de activa","x-as"]
[]
{"$rows_left_out":5}
{"sheet":"T24B","index":33,"n_rows":14,"n_cols":28,"rows_kept":14,"cut":false,"hidden":true,"merged":[[1,1,1,14],[4,1,4,11],[8,1,10,1],[8,2,9,22]]}
["Back to Index"]
[null,"Tabel groep 24: Aangehouden beleggingen"]
[]
[]
[null,"Aangehouden beleggingen - Informatie over activa"]
[]
[]
[]
[null,"Identificatiecode en soortcode van de activa","x-as"]
[]
{"$rows_left_out":5}
{"sheet":"T25A","index":34,"n_rows":14,"n_cols":19,"rows_kept":14,"cut":false,"hidden":true,"merged":[[1,1,1,14],[4,1,4,11],[8,1,10,1],[8,2,10,2],[8,3,9,13]]}
["Back to Index"]
[null,"Tabel groep 25: Doorkijk beleggingsfondsen"]
[]
[]
[null,"Doorkijk beleggingsfondsen - informatie over posities"]
[]
[]
[]
[null,"Identificatiecode en soortcode van het beleggingsfonds","Identificatiecode en soortcode van de activa","x-as"]
[]
{"$rows_left_out":5}
{"sheet":"T25B","index":35,"n_rows":14,"n_cols":29,"rows_kept":14,"cut":false,"hidden":true,"merged":[[1,1,1,14],[4,1,4,11],[8,1,10,1],[8,2,10,2],[8,3,9,23]]}
["Back to Index"]
[null,"Tabel groep 25: Doorkijk beleggingsfondsen"]
[]
[]
[null,"Doorkijk beleggingsfondsen - Informatie over activa"]
[]
[]
[]
[null,"Identificatiecode en soortcode van het beleggingsfonds","Identificatiecode en soortcode van de activa","x-as"]
[]
{"$rows_left_out":5}
{"sheet":"T26A","index":36,"n_rows":14,"n_cols":25,"rows_kept":14,"cut":false,"hidden":true,"merged":[[1,1,1,14],[4,1,4,11],[8,1,10,1],[8,2,10,2],[8,3,9,19]]}
["Back to Index"]
[null,"Tabel groep 26: Aangehouden derivaten"]
[]
[]
[null,"Aangehouden derivaten - informatie over posities"]
[]
[]
[]
[null,"Regelnummer","Identificatiecode en soortcode van het derivaat","x-as"]
[]
{"$rows_left_out":5}
{"sheet":"T26B","index":37,"n_rows":14,"n_cols":24,"rows_kept":14,"cut":false,"hidden":true,"merged":[[1,1,1,14],[4,1,4,11],[8,1,10,1],[8,2,9,18]]}
["Back to Index"]
[null,"Tabel groep 26: Aangehouden derivaten"]
[]
[]
[null,"Aangehouden derivaten - informatie over derivaten"]
[]
[]
[]
[null,"Identificatiecode en soortcode van het derivaat","x-as"]
[]
{"$rows_left_out":4}