{"text_format":"1","workbook":"xlsx","n_sheets":16,"sheets":["General data","XBRL Errors","Index","Show","Hierarchies","FC.00.00.36","FC.00.01.36","FC.01.01.36","FC.02.01.36","FC.03.01.36","FC.04.01.36","FC.05.01.36","FC.06.01.36","FC.07.01.36","FC.08.01.36","FT.99.01.01"],"not_rendered":{"charts":0,"images":3,"macros":1,"external_links":0,"defined_names":96,"comments":0,"pivot_tables":0},"unopened":[],"bounds":{"document_bytes":16777216,"sheet_cells":100000,"rows_first":2000,"rows_last":500,"rows_between":2000,"halvings":0,"cell_chars":16384,"cell_head_chars":4096},"cells_cut":0,"cells_raw":0,"read":"whole","date_system":"1900"}

{"sheet":"General data","index":0,"n_rows":247,"n_cols":23,"rows_kept":247,"cut":false,"hidden":false,"merged":[[0,6,2,6],[3,0,5,9]]}
[null,null,null,null,null,null,null,"Version:",null,"2.8.1.1",null,null,null,null,null,null,"Not applicable/All geographical areas","http://standards.iso.org/iso/17442","Quarterly FICO reporting","QFI","01","EUR","SII 2.8.1 FICOD"]
[null,null,null,null,null,null,null,null,null,null,null,null,null,null,null,null,"AFGHANISTAN","http://standards.iso.org/iso/17442","Annual FICO reporting","AFI","16","AED"]
[null,null,null,null,null,null,null," ",null,null,null,null,null,null,null,null,"ALBANIA","http://standards.iso.org/iso/17442","Semi-annual FICO reporting","SFI","17","AFN"]
[null,null,null,null,null,null,null,null,null,null,null,null,null,null,null,null,"ALGERIA","http://standards.iso.org/iso/17442",null,null,"18","ALL"]
[null,null,null,null,null,null,null,null,null,null,null,null,null,null,null,null,"AMERICAN SAMOA","http://standards.iso.org/iso/17442",null,null,"19","AMD"]
[null,null,null,null,null,null,null,null,null,null,null,null,null,null,null,null,"ANDORRA","http://standards.iso.org/iso/17442",null,null,"20","ANG"]
[null,null,null,null,null,null,null,null,null,null,null,null,null,null,null,null,"ANGOLA","http://standards.iso.org/iso/17442",null,null,"All","AOA"]
[null,"General Data",null,null,null,null,null,null,null,null,null,"/General data label{B}","/General data value{E}",null,null,null,"ANGUILLA","http://standards.iso.org/iso/17442",null,null,"All","ARS"]
[null,null,null,null,null,null,null,null,null,null,null,null,null,null,null,null,"ANTARCTICA","http://standards.iso.org/iso/17442",null,null,null,"AUD"]
["*","Identifier",":","LEGALIDENTIFIER20POS",{"$f":"\"\"&D10","v":"LEGALIDENTIFIER20POS"},{"$f":"IF(D10=\"\",1,0)","v":0},null,null,null,null,null,null,null,null,null,null,"ANTIGUA AND BARBUDA","http://standards.iso.org/iso/17442",null,null,null,"AWG"]
{"$rows_left_out":238}
{"sheet":"XBRL Errors","index":1,"n_rows":1,"n_cols":2,"rows_kept":1,"cut":false,"hidden":false,"merged":[]}
["Timestamp","Error"]

{"sheet":"Index","index":2,"n_rows":16,"n_cols":5,"rows_kept":16,"cut":false,"hidden":false,"merged":[[2,1,2,14]]}
[]
[]
[null,"Index"]
[]
[null,"Template Code","Template Name","Reporting Status"]
[null,"FC.00.00.36","Content of the submission",null,{"$f":"IF($D$6=\"Reported\",\"@ForceFilingCode:true\",IF($D$6=\"Not Reported\",\"@ForceFilingCode:false\",\"\"))","v":""}]
[null,"FC.00.01.36","Summary template",null,{"$f":"IF($D$7=\"Reported\",\"@ForceFilingCode:true\",IF($D$7=\"Not Reported\",\"@ForceFilingCode:false\",\"\"))","v":""}]
[null,"FC.01.01.36","IGT - Equity-type transactions, debt and asset transfer",null,{"$f":"IF($D$8=\"Reported\",\"@ForceFilingCode:true\",IF($D$8=\"Not Reported\",\"@ForceFilingCode:false\",\"\"))","v":""}]
[null,"FC.02.01.36","IGT - Derivatives",null,{"$f":"IF($D$9=\"Reported\",\"@ForceFilingCode:true\",IF($D$9=\"Not Reported\",\"@ForceFilingCode:false\",\"\"))","v":""}]
[null,"FC.03.01.36","IGT - Off-balance sheet and contingent liabilities",null,{"$f":"IF($D$10=\"Reported\",\"@ForceFilingCode:true\",IF($D$10=\"Not Reported\",\"@ForceFilingCode:false\",\"\"))","v":""}]
{"$rows_left_out":7}
{"sheet":"Show","index":3,"n_rows":12,"n_cols":5,"rows_kept":12,"cut":false,"hidden":true,"merged":[]}
["Sheet","Prefix","QFI","AFI","SFI"]
["FC.00.00.36",{"$f":"IF(AND(HLOOKUP('General data'!$E$22,$C$1:$F$2,2,FALSE)=\"X\",Index!D6=\"Reported\"),\"/\",\"!\")","v":"!"},"X","X","X"]
["FC.00.01.36",{"$f":"IF(AND(HLOOKUP('General data'!$E$22,$C$1:$F$3,3,FALSE)=\"X\",Index!D7=\"Reported\"),\"/\",\"!\")","v":"!"},"X","X","X"]
["FC.01.01.36",{"$f":"IF(AND(HLOOKUP('General data'!$E$22,$C$1:$F$4,4,FALSE)=\"X\",Index!D8=\"Reported\"),\"/\",\"!\")","v":"!"},"X","X","X"]
["FC.02.01.36",{"$f":"IF(AND(HLOOKUP('General data'!$E$22,$C$1:$F$5,5,FALSE)=\"X\",Index!D9=\"Reported\"),\"/\",\"!\")","v":"!"},"X","X","X"]
["FC.03.01.36",{"$f":"IF(AND(HLOOKUP('General data'!$E$22,$C$1:$F$6,6,FALSE)=\"X\",Index!D10=\"Reported\"),\"/\",\"!\")","v":"!"},"X","X","X"]
["FC.04.01.36",{"$f":"IF(AND(HLOOKUP('General data'!$E$22,$C$1:$F$7,7,FALSE)=\"X\",Index!D11=\"Reported\"),\"/\",\"!\")","v":"!"},"X","X","X"]
["FC.05.01.36",{"$f":"IF(AND(HLOOKUP('General data'!$E$22,$C$1:$F$8,8,FALSE)=\"X\",Index!D12=\"Reported\"),\"/\",\"!\")","v":"!"},"X","X","X"]
["FC.06.01.36",{"$f":"IF(AND(HLOOKUP('General data'!$E$22,$C$1:$F$9,9,FALSE)=\"X\",Index!D13=\"Reported\"),\"/\",\"!\")","v":"!"},"X","X","X"]
["FC.07.01.36",{"$f":"IF(AND(HLOOKUP('General data'!$E$22,$C$1:$F$10,10,FALSE)=\"X\",Index!D14=\"Reported\"),\"/\",\"!\")","v":"!"},"X","X","X"]
{"$rows_left_out":3}
{"sheet":"Hierarchies","index":4,"n_rows":984,"n_cols":39,"rows_kept":984,"cut":false,"hidden":true,"merged":[]}
["hier_CN_2","hier_CN_61","hier_CN_63","hier_CN_65","hier_CN_147","hier_CN_140","hier_CN_1","hier_CU_5","hier_CS_13","hier_SE_34","hier_MC_70","hier_MC_35","hier_CU_1","hier_MC_71","hier_MC_72","hier_PU_41","hier_MC_73","hier_SE_35","hier_MC_74","hier_TB_14","hier_LB_57","hier_CE_801","hier_MC_800","hier_SE_33","hier_NC_1","hier_GA_18","hier_CU_7","hier_CU_7","hier_GA_43","hier_GA_43","hier_MC_76","hier_MC_76","hier_0","hier_0","hier_0","hier_0","hier_0","hier_0","hier_0"]
["Reported","Reported","Reported","Reported","Reported","Reported","Reported","EUR","Initial submission","Banks","Bonds/Debt","Bonds/Debt - collateralised","Total/NA","Futures","Credit default","Micro hedge [MI]","Financial guarantees","Insurance/reinsurance sector","Insurance","Quota share","Medical expense insurance [direct business]","Fees","Bonds/Debt","Scope Hamburg GmbH (previously Euler Hermes Rating GmbH) (LEI code: 391200QXGLWHK9VK6V27)","Total/NA","AFGHANISTAN","Total/NA","Total/NA","AFGHANISTAN","AFGHANISTAN","Government, International financial organisations and Central banks bonds","Government, International financial organisations and Central banks bonds"]
[null,"Not reported as no IGT on Equity-type transactions, debt and asset transfer","Not reported as no IGT on Derivatives","Not reported as no IGT on off-balance sheet and contingent liabilities","Not reported as no IGT on Insurance and Reinsurance","Not reported as no IGT","Not reported","AED","Re-submission","Investments services sector","Equity type","Bonds/Debt - uncollateralised","EUR","Forwards","Interest rate","Macro hedge [MA]","Legally binding commitment to subscribe and pay for subordinated liabilities",null,"Reinsurance","Variable quota share","Income protection insurance [direct business]","Commissions","Equity type","Japan Credit Rating Agency Ltd (LEI code: 35380002378CEGMRVW86)","A - Agriculture, forestry and fishing","ÅLAND ISLANDS","EUR","EUR","ÅLAND ISLANDS","ÅLAND ISLANDS","Regional governments, local authorities and public sector entities bonds","Regional governments, local authorities and public sector entities bonds"]
[null,"Not reported other reason","Not reported other reason","Not reported other reason","Not reported other reason","Not reported other reason",null,"AFN",null,"Insurance/reinsurance sector","Other asset transfer","Equity type - shares/participations","AED","Derivatives - options","Currency","Matching assets and liabilities cash-flows used in the context of matching adjustment portfolios","Letter of Credit",null,null,"Surplus","Workers' compensation insurance [direct business]","Interests","Other asset transfer","BCRA-Credit Rating Agency AD (LEI code: 747800Z0IC3P66HTQ142)","A1 - Crop and animal production, hunting and related service activities","ALBANIA","AED","AED","ALBANIA","ALBANIA","Corporate Bonds","Corporate Bonds"]
[null,null,null,null,null,null,null,"ALL",null,"Sector other than banking, investment services, insurance or reinsurance sectors",null,"Equity type - others","AFN","Derivatives - others","Other than credit default, interest rate and currency","Efficient portfolio management, other than “Matching assets and liabilities cash-flows used in the context of matching adjustment portfolios”","Undrawn credit facilities",null,null,"Excess of loss [per event and per risk]","Motor vehicle liability insurance [direct business]","Dividends","Derivatives","Creditreform Rating AG (LEI code: 391200PHL11KDUTTST66)","A1.1 - Growing of non-perennial crops","ALGERIA","AFN","AFN","ALGERIA","ALGERIA"]
[null,null,null,null,null,null,null,"AMD",null,null,null,"Other asset transfer - properties","ALL","Guarantees - credit protection",null,"Other than micro hedge, macro hedge, matching assets and liabilities cash-flows and efficient portfolio management, other than 'Matching assets and liabilities cash-flows'","Assets purchased under outright forward purchase agreements (currency or other)",null,null,"Excess of loss [per risk]","Other motor insurance [direct business]","Costs or revenues","Off balance sheet items","Scope Ratings GmbH (previously Scope Ratings AG and PSR Rating GmbH)(LEI code: 391200WU1EZUQFHDWE91)","A1.1.1 - Growing of cereals (except rice), leguminous crops and oil seeds","AMERICAN SAMOA","ALL","ALL","AMERICAN SAMOA","AMERICAN SAMOA"]
[null,null,null,null,null,null,null,"ANG",null,null,null,"Other asset transfer - others","AMD","Guarantees - others",null,null,"Asset sale and repurchase agreements as referred to in Article 12(3) and (5) of Directive 86/635/EEC",null,null,"Excess of loss [per event]","Marine, aviation and transport insurance [direct business]","Premiums [insurance]","Intragroup outsourcing, internal cost sharing and rental agreement","ICAP CRIF S.A. (previously ICAP S.A.)(LEI code: 2138008U6LKT8VG2UK85)","A1.1.2 - Growing of rice","ANDORRA","AMD","AMD","ANDORRA","ANDORRA"]
[null,null,null,null,null,null,null,"AOA",null,null,null,null,"ANG","Swaps",null,null,"Contingent liabilities",null,null,"Excess of loss “back-up”","Fire and other damage to property insurance [direct business]","Claims [insurance]","Internal insurance/reinsurance","GBB-Rating Gesellschaft für Bonitätsbeurteilung GmbH (LEI code: 391200OLWXCTKPADVV72)","A1.1.3 - Growing of vegetables and melons, roots and tubers","ANGOLA","ANG","ANG","ANGOLA","ANGOLA"]
[null,null,null,null,null,null,null,"ARS",null,null,null,null,"AOA","Other than derivatives, guarantees and swaps",null,null,"Other than guarantees, commitment, letter of credit, undrawn credit facilities, assets purchased under outright forward purchase agreements (currency or other), asset sale and repurchase agreements as referred to in Article 12(3) and (5) of Directive 86/6",null,null,"Excess of loss with basic risk","General liability insurance [direct business]","Technical result [reinsurance]","Other than bonds/debt, equity type, other assets transfer, derivatives, off balance sheet items, intragroup outsourcing, internal cost sharing and rental agreement and internal insurance/reinsurance","ASSEKURATA Assekuranz Rating-Agentur GmbH (LEI code: 529900977LETWLJF3295)","A1.1.4 - Growing of sugar cane","ANGUILLA","AOA","AOA","ANGUILLA","ANGUILLA"]
[null,null,null,null,null,null,null,"AUD",null,null,null,null,"ARS",null,null,null,null,null,null,"Reinstatement cover","Credit and suretyship insurance [direct business]","Other than fees, commissions, interests, dividends, costs of revenues, premiums for insurance, claims for insurance and technical result for reinsurance",null,"ARC Ratings, S.A. (previously Companhia Portuguesa de Rating, S.A) (LEI code: 213800OZNJQMV6UA7D79)","A1.1.5 - Growing of tobacco","ANTARCTICA","ARS","ARS","ANTARCTICA","ANTARCTICA"]
{"$rows_left_out":975}
{"sheet":"FC.00.00.36","index":5,"n_rows":25,"n_cols":10,"rows_kept":25,"cut":false,"hidden":true,"merged":[[1,1,1,14],[4,1,4,11],[8,3,9,3],[10,3,11,3]]}
[]
[null,"Content of the submission"]
[]
[]
[null,"FC.00.00.36.01 - Content of the submission"]
[]
[]
[]
[null,null,null,"Columns"]
[]
{"$rows_left_out":16}
{"sheet":"FC.00.01.36","index":6,"n_rows":60,"n_cols":21,"rows_kept":60,"cut":false,"hidden":true,"merged":[[40,10,41,10],[40,11,41,11],[39,3,39,5],[39,6,39,8],[39,9,39,11],[40,3,41,3],[40,4,41,4],[40,5,41,5],[40,6,41,6],[40,7,41,7],[40,8,41,8],[40,9,41,9],[37,3,38,11],[1,1,1,14],[4,1,4,11],[8,3,9,3],[10,3,11,3],[33,1,33,11]]}
[]
[null,"Summary template"]
[]
[]
[null,"FC.00.01.36.01 - Summary template"]
[]
[]
[]
[null,null,null,"Columns"]
[]
{"$rows_left_out":51}
{"sheet":"FC.01.01.36","index":7,"n_rows":18,"n_cols":44,"rows_kept":18,"cut":false,"hidden":true,"merged":[[13,14,13,15],[13,16,13,19],[13,20,13,21],[1,1,1,14],[4,1,4,11],[10,1,14,1],[10,2,14,2],[10,3,14,3],[10,4,14,4],[10,5,14,5],[10,6,11,22],[12,6,12,11],[12,12,12,13],[12,14,12,21],[12,22,14,22],[13,6,13,9],[13,10,14,10],[13,11,14,11],[13,12,13,13]]}
[]
[null,"IGT - Equity-type transactions, debt and asset transfer"]
[]
[]
[null,"FC.01.01.36.01 - Equity-type transactions, debt and asset transfer"]
[]
[null,"Sheets",null,null,null,null,null,null,null,null,null,null,null,null,null,null,null,null,null,null,null,null,null,null,null,null,null,null,null,null,null,null,null,null,null,null,null,null,null,null,null,null,{"$f":"Show!$B$4&\"FC.01.01.36.01 Table label {\"&COLUMN($C$1)&\"}\"","v":"!FC.01.01.36.01 Table label {3}"},{"$f":"Show!$B$4&\"FC.01.01.36.01 Table value {\"&COLUMN($D$1)&\"}\"","v":"!FC.01.01.36.01 Table value {4}"}]
[null,"Z Axis:","Z0001",1]
[null,null,null,null,null,null,null,null,null,null,null,null,null,null,null,null,null,null,null,null,null,null,null,null,null,null,null,null,null,null,null,null,null,null,null,null,null,null,null,null,null,null,{"$f":"Show!$B$4&Show!$B$4&\"FC.01.01.36.01 Table label {\"&COLUMN($C$1)&\"}\"","v":"!!FC.01.01.36.01 Table label {3}"},{"$f":"Show!$B$4&Show!$B$4&\"FC.01.01.36.01 Table value {\"&COLUMN($D$1)&\"}\"","v":"!!FC.01.01.36.01 Table value {4}"}]
[]
{"$rows_left_out":9}
{"sheet":"FC.02.01.36","index":8,"n_rows":18,"n_cols":51,"rows_kept":18,"cut":false,"hidden":true,"merged":[[13,15,13,16],[13,17,13,20],[13,21,13,26],[1,1,1,14],[4,1,4,11],[10,1,14,1],[10,2,14,2],[10,3,14,3],[10,4,14,4],[10,5,14,5],[10,6,11,28],[12,6,12,11],[12,12,12,14],[12,15,12,27],[12,28,14,28],[13,6,13,9],[13,10,14,10],[13,11,14,11],[13,12,13,14]]}
[]
[null,"IGT - Derivatives"]
[]
[]
[null,"FC.02.01.36.01 - IGT - Derivatives"]
[]
[null,"Sheets",null,null,null,null,null,null,null,null,null,null,null,null,null,null,null,null,null,null,null,null,null,null,null,null,null,null,null,null,null,null,null,null,null,null,null,null,null,null,null,null,null,null,null,null,null,null,null,{"$f":"Show!$B$5&\"FC.02.01.36.01 Table label {\"&COLUMN($C$1)&\"}\"","v":"!FC.02.01.36.01 Table label {3}"},{"$f":"Show!$B$5&\"FC.02.01.36.01 Table value {\"&COLUMN($D$1)&\"}\"","v":"!FC.02.01.36.01 Table value {4}"}]
[null,"Z Axis:","Z0001",1]
[null,null,null,null,null,null,null,null,null,null,null,null,null,null,null,null,null,null,null,null,null,null,null,null,null,null,null,null,null,null,null,null,null,null,null,null,null,null,null,null,null,null,null,null,null,null,null,null,null,{"$f":"Show!$B$5&Show!$B$5&\"FC.02.01.36.01 Table label {\"&COLUMN($C$1)&\"}\"","v":"!!FC.02.01.36.01 Table label {3}"},{"$f":"Show!$B$5&Show!$B$5&\"FC.02.01.36.01 Table value {\"&COLUMN($D$1)&\"}\"","v":"!!FC.02.01.36.01 Table value {4}"}]
[]
{"$rows_left_out":9}
{"sheet":"FC.03.01.36","index":9,"n_rows":18,"n_cols":40,"rows_kept":18,"cut":false,"hidden":true,"merged":[[13,14,13,19],[1,1,1,14],[4,1,4,11],[10,1,14,1],[10,2,14,2],[10,3,14,3],[10,4,14,4],[10,5,11,21],[12,5,12,10],[12,11,12,20],[12,21,14,21],[13,5,13,8],[13,9,14,9],[13,10,14,10],[13,11,14,11],[13,12,13,13]]}
[]
[null,"IGT - Off-balance sheet and contingent liabilities"]
[]
[]
[null,"FC.03.01.36.01 - IGT - Off-balance sheet and contingent liabilities"]
[]
[null,"Sheets",null,null,null,null,null,null,null,null,null,null,null,null,null,null,null,null,null,null,null,null,null,null,null,null,null,null,null,null,null,null,null,null,null,null,null,null,{"$f":"Show!$B$6&\"FC.03.01.36.01 Table label {\"&COLUMN($C$1)&\"}\"","v":"!FC.03.01.36.01 Table label {3}"},{"$f":"Show!$B$6&\"FC.03.01.36.01 Table value {\"&COLUMN($D$1)&\"}\"","v":"!FC.03.01.36.01 Table value {4}"}]
[null,"Z Axis:","Z0001",1]
[null,null,null,null,null,null,null,null,null,null,null,null,null,null,null,null,null,null,null,null,null,null,null,null,null,null,null,null,null,null,null,null,null,null,null,null,null,null,{"$f":"Show!$B$6&Show!$B$6&\"FC.03.01.36.01 Table label {\"&COLUMN($C$1)&\"}\"","v":"!!FC.03.01.36.01 Table label {3}"},{"$f":"Show!$B$6&Show!$B$6&\"FC.03.01.36.01 Table value {\"&COLUMN($D$1)&\"}\"","v":"!!FC.03.01.36.01 Table value {4}"}]
[]
{"$rows_left_out":9}
{"sheet":"FC.04.01.36","index":10,"n_rows":18,"n_cols":44,"rows_kept":18,"cut":false,"hidden":true,"merged":[[13,15,13,18],[13,19,13,21],[13,22,14,22],[1,1,1,14],[4,1,4,11],[10,1,14,1],[10,2,14,2],[10,3,14,3],[10,4,14,4],[10,5,11,23],[12,5,12,10],[12,11,12,12],[12,13,12,22],[12,23,14,23],[13,5,13,8],[13,9,14,9],[13,10,14,10],[13,11,13,12],[13,13,13,14]]}
[]
[null,"IGT - Insurance-reinsurance"]
[]
[]
[null,"FC.04.01.36.01 - IGT - Insurance-reinsurance"]
[]
[null,"Sheets",null,null,null,null,null,null,null,null,null,null,null,null,null,null,null,null,null,null,null,null,null,null,null,null,null,null,null,null,null,null,null,null,null,null,null,null,null,null,null,null,{"$f":"Show!$B$7&\"FC.04.01.36.01 Table label {\"&COLUMN($C$1)&\"}\"","v":"!FC.04.01.36.01 Table label {3}"},{"$f":"Show!$B$7&\"FC.04.01.36.01 Table value {\"&COLUMN($D$1)&\"}\"","v":"!FC.04.01.36.01 Table value {4}"}]
[null,"Z Axis:","Z0001",1]
[null,null,null,null,null,null,null,null,null,null,null,null,null,null,null,null,null,null,null,null,null,null,null,null,null,null,null,null,null,null,null,null,null,null,null,null,null,null,null,null,null,null,{"$f":"Show!$B$7&Show!$B$7&\"FC.04.01.36.01 Table label {\"&COLUMN($C$1)&\"}\"","v":"!!FC.04.01.36.01 Table label {3}"},{"$f":"Show!$B$7&Show!$B$7&\"FC.04.01.36.01 Table value {\"&COLUMN($D$1)&\"}\"","v":"!!FC.04.01.36.01 Table value {4}"}]
[]
{"$rows_left_out":9}
{"sheet":"FC.05.01.36","index":11,"n_rows":17,"n_cols":32,"rows_kept":17,"cut":false,"hidden":true,"merged":[[12,11,12,12],[12,13,12,15],[12,16,13,16],[1,1,1,14],[4,1,4,11],[10,1,13,1],[10,2,13,2],[10,3,13,3],[10,4,13,4],[10,5,11,16],[12,5,12,8],[12,9,13,9],[12,10,13,10]]}
[]
[null,"IGT - P&L"]
[]
[]
[null,"FC.05.01.36.01 - IGT - P&L"]
[]
[null,"Sheets",null,null,null,null,null,null,null,null,null,null,null,null,null,null,null,null,null,null,null,null,null,null,null,null,null,null,null,null,{"$f":"Show!$B$8&\"FC.05.01.36.01 Table label {\"&COLUMN($C$1)&\"}\"","v":"!FC.05.01.36.01 Table label {3}"},{"$f":"Show!$B$8&\"FC.05.01.36.01 Table value {\"&COLUMN($D$1)&\"}\"","v":"!FC.05.01.36.01 Table value {4}"}]
[null,"Z Axis:","Z0001",1]
[null,null,null,null,null,null,null,null,null,null,null,null,null,null,null,null,null,null,null,null,null,null,null,null,null,null,null,null,null,null,{"$f":"Show!$B$8&Show!$B$8&\"FC.05.01.36.01 Table label {\"&COLUMN($C$1)&\"}\"","v":"!!FC.05.01.36.01 Table label {3}"},{"$f":"Show!$B$8&Show!$B$8&\"FC.05.01.36.01 Table value {\"&COLUMN($D$1)&\"}\"","v":"!!FC.05.01.36.01 Table value {4}"}]
[]
{"$rows_left_out":8}
{"sheet":"FC.06.01.36","index":12,"n_rows":14,"n_cols":40,"rows_kept":14,"cut":false,"hidden":true,"merged":[[1,1,1,14],[4,1,4,11],[8,1,10,1],[8,2,10,2],[8,3,10,3],[8,4,9,28]]}
[]
[null,"Risk concentration – Exposure to Counterparties"]
[]
[]
[null,"FC.06.01.36.01 - Risk concentration - Exposure to counterparties"]
[]
[]
[]
[null,"Line identification","Identification code and type of code of the external counterparty of the group","Identification code and type of code of the Entity of financial conglomerate","Columns"]
[]
{"$rows_left_out":5}
{"sheet":"FC.07.01.36","index":13,"n_rows":51,"n_cols":14,"rows_kept":51,"cut":false,"hidden":true,"merged":[[26,1,26,11],[30,1,32,1],[30,2,31,3],[37,1,37,11],[41,3,42,3],[19,1,21,1],[19,2,20,3],[1,1,1,14],[4,1,4,11],[8,1,10,1],[8,2,9,3],[15,1,15,11]]}
[]
[null,"Risk Concentration - Exposure by currency, sector, country"]
[]
[]
[null,"FC.07.01.36.01 - Exposure by currency"]
[]
[]
[]
[null,"Currency area","Columns"]
[]
{"$rows_left_out":42}
{"sheet":"FC.08.01.36","index":14,"n_rows":39,"n_cols":11,"rows_kept":39,"cut":false,"hidden":true,"merged":[[1,1,1,14],[4,1,4,11],[10,3,11,4],[19,1,19,11],[26,3,27,4]]}
[]
[null,"Risk Concentration - Exposure by asset class and rating"]
[]
[]
[null,"FC.08.01.36.01 - Equity"]
[]
[null,"Sheets",null,null,null,null,null,null,null,{"$f":"Show!$B$11&\"FC.08.01.36.01 Table label {\"&COLUMN($C$1)&\"}\"","v":"!FC.08.01.36.01 Table label {3}"},{"$f":"Show!$B$11&\"FC.08.01.36.01 Table value {\"&COLUMN($D$1)&\"}\"","v":"!FC.08.01.36.01 Table value {4}"}]
[null,"Z Axis:","Z0001",1]
[null,null,null,null,null,null,null,null,null,{"$f":"Show!$B$11&Show!$B$11&\"FC.08.01.36.01 Table label {\"&COLUMN($C$1)&\"}\"","v":"!!FC.08.01.36.01 Table label {3}"},{"$f":"Show!$B$11&Show!$B$11&\"FC.08.01.36.01 Table value {\"&COLUMN($D$1)&\"}\"","v":"!!FC.08.01.36.01 Table value {4}"}]
[]
{"$rows_left_out":30}
{"sheet":"FT.99.01.01","index":15,"n_rows":14,"n_cols":25,"rows_kept":14,"cut":false,"hidden":true,"merged":[[1,1,1,14],[4,1,4,11],[8,1,10,1],[8,2,10,2],[8,3,10,3],[8,4,10,4],[8,5,9,12]]}
[]
[null,"Technical table"]
[]
[]
[null,"FT.99.01.01.01 - Technical table"]
[]
[]
[]
[null,"Table","X axis","Y axis","Z axis","Columns"]
[]
{"$rows_left_out":4}