{"text_format":"1","workbook":"xlsx","n_sheets":9,"sheets":["General data","XBRL Errors","Index","Show","Hierarchies","1","2","3","4"],"not_rendered":{"charts":0,"images":3,"macros":1,"external_links":0,"defined_names":40,"comments":0,"pivot_tables":0},"unopened":[],"bounds":{"document_bytes":16777216,"sheet_cells":100000,"rows_first":2000,"rows_last":500,"rows_between":2000,"halvings":0,"cell_chars":16384,"cell_head_chars":4096},"cells_cut":0,"cells_raw":0,"read":"whole","date_system":"1900"}

{"sheet":"General data","index":0,"n_rows":247,"n_cols":23,"rows_kept":247,"cut":false,"hidden":false,"merged":[[0,6,2,6],[3,0,5,9]]}
[null,null,null,null,null,null,null,"Version:",null,"11.0.1.1",null,null,null,null,null,null,"Not applicable/All geographical areas","http://standards.iso.org/iso/17442","Ex-ante contributions to the Single Resolution Fund - reporting form for the 2026 contribution period","EX-ANTE CONTRIBUTIONS TO THE SINGLE RESOLUTION FUND - REPORTING FORM FOR THE 2026 CONTRIBUTION PERIOD","01","EUR","SRF 11.0.1"]
[null,null,null,null,null,null,null,null,null,null,null,null,null,null,null,null,"AFGHANISTAN","http://standards.iso.org/iso/17442",null,null,"18","AED"]
[null,null,null,null,null,null,null," ",null,null,null,null,null,null,null,null,"ALBANIA","http://standards.iso.org/iso/17442",null,null,"19","AFN"]
[null,null,null,null,null,null,null,null,null,null,null,null,null,null,null,null,"ALGERIA","http://standards.iso.org/iso/17442",null,null,"20","ALL"]
[null,null,null,null,null,null,null,null,null,null,null,null,null,null,null,null,"AMERICAN SAMOA","http://standards.iso.org/iso/17442",null,null,"All","AMD"]
[null,null,null,null,null,null,null,null,null,null,null,null,null,null,null,null,"ANDORRA","http://standards.iso.org/iso/17442",null,null,"All","ANG"]
[null,null,null,null,null,null,null,null,null,null,null,null,null,null,null,null,"ANGOLA","http://standards.iso.org/iso/17442",null,null,null,"AOA"]
[null,"General Data",null,null,null,null,null,null,null,null,null,"/General data label{B}","/General data value{E}",null,null,null,"ANGUILLA","http://standards.iso.org/iso/17442",null,null,null,"ARS"]
[null,null,null,null,null,null,null,null,null,null,null,null,null,null,null,null,"ANTARCTICA","http://standards.iso.org/iso/17442",null,null,null,"AUD"]
["*","Identifier",":","LEGALIDENTIFIER20POS",{"$f":"\"\"&D10","v":"LEGALIDENTIFIER20POS"},{"$f":"IF(D10=\"\",1,0)","v":0},null,null,null,null,null,null,null,null,null,null,"ANTIGUA AND BARBUDA","http://standards.iso.org/iso/17442",null,null,null,"AWG"]
[null,null,null,null,null,null,null,null,null,null,null,null,null,null,null,null,"ARGENTINA","http://standards.iso.org/iso/17442",null,null,null,"AZN"]
["*","Period start date",":","2024-01-01",{"$f":"D12","v":"2024-01-01"},{"$f":"IF(D12=\"\",1,0)","v":0},null,null,null,null,null,null,null,null,null,null,"ARMENIA","http://standards.iso.org/iso/17442",null,null,null,"BAM"]
[null,null,null,null,null,null,null,null,null,null,null,null,null,null,null,null,"ARUBA","http://standards.iso.org/iso/17442",null,null,null,"BBD"]
["*","Period end date",":","2024-12-31",{"$f":"D14","v":"2024-12-31"},{"$f":"IF(D14=\"\",1,0)","v":0},null,null,null,null,null,null,null,null,null,null,"AUSTRALIA","http://standards.iso.org/iso/17442",null,null,null,"BDT"]
[null,null,null,null,null,null,null,null,null,null,null,null,null,null,null,null,"AUSTRIA","http://standards.iso.org/iso/17442",null,null,null,"BGN"]
[null,"Country",":","Not applicable/All geographical areas",null,null,null,null,null,null,null,null,null,null,null,null,"AZERBAIJAN","http://standards.iso.org/iso/17442",null,null,null,"BHD"]
[null,null,null,null,null,null,null,null,null,null,null,null,null,null,null,null,"BAHAMAS","http://standards.iso.org/iso/17442",null,null,null,"BIF"]
["*","Filing Currency",":","EUR",{"$f":"\"\"&D18","v":"EUR"},{"$f":"IF(D18=\"\",1,0)","v":0},null,null,null,null,null,null,null,null,null,null,"BAHRAIN","http://standards.iso.org/iso/17442",null,null,null,"BMD"]
[null,null,null,null,null,null,null,null,null,null,null,null,null,null,null,null,"BANGLADESH","http://standards.iso.org/iso/17442",null,null,null,"BND"]
["*","Taxonomy",":","SRF 11.0.1",null,{"$f":"IF(D20=\"\",1,0)","v":0},null,null,null,null,null,null,null,null,null,null,"BARBADOS","http://standards.iso.org/iso/17442",null,null,null,"BOB"]
{"$rows_left_out":228}
{"sheet":"XBRL Errors","index":1,"n_rows":4,"n_cols":2,"rows_kept":4,"cut":false,"hidden":false,"merged":[]}
["Timestamp","Error"]
["2025-12-10T23:22:27","The DTS discovered starting from XBRL instance 'xbrli:xbrl' is not valid."]
["2025-12-10T23:22:27","The schemas referenced by attribute 'xsi:schemaLocation' at element 'xs:schema' are valid with warnings."]
["2025-12-10T23:22:27","Unable to load a schema with target namespace 'http://www.eurofiling.info/xbrl/dict/exp' from 'http://www.eurofiling.info/eu/fr/xbrl/dict/dom/exp.xsd'."]

{"sheet":"Index","index":2,"n_rows":9,"n_cols":5,"rows_kept":9,"cut":false,"hidden":false,"merged":[[2,1,2,14]]}
[]
[]
[null,"Index"]
[]
[null,"Template Code","Template Name","Reporting Status"]
[null,"1","1. General information","Not Reported",{"$f":"IF($D$6=\"Reported\",\"@ForceFilingCode:true\",IF($D$6=\"Not Reported\",\"@ForceFilingCode:false\",\"\"))","v":"@ForceFilingCode:false"}]
[null,"2","2. Basic annual contribution","Not Reported",{"$f":"IF($D$7=\"Reported\",\"@ForceFilingCode:true\",IF($D$7=\"Not Reported\",\"@ForceFilingCode:false\",\"\"))","v":"@ForceFilingCode:false"}]
[null,"3","3. Deductions","Not Reported",{"$f":"IF($D$8=\"Reported\",\"@ForceFilingCode:true\",IF($D$8=\"Not Reported\",\"@ForceFilingCode:false\",\"\"))","v":"@ForceFilingCode:false"}]
[null,"4","4. Risk adjustment","Not Reported",{"$f":"IF($D$9=\"Reported\",\"@ForceFilingCode:true\",IF($D$9=\"Not Reported\",\"@ForceFilingCode:false\",\"\"))","v":"@ForceFilingCode:false"}]

{"sheet":"Show","index":3,"n_rows":25,"n_cols":3,"rows_kept":25,"cut":false,"hidden":true,"merged":[]}
["Sheet","Prefix","EX-ANTE CONTRIBUTIONS TO THE SINGLE RESOLUTION FUND - REPORTING FORM FOR THE 2026 CONTRIBUTION PERIOD"]
["1",{"$f":"IF(AND(HLOOKUP('General data'!$E$22,$C$1:$D$2,2,FALSE)=\"X\",Index!D6=\"Reported\"),\"/\",\"!\")","v":"!"},"X"]
["2",{"$f":"IF(AND(HLOOKUP('General data'!$E$22,$C$1:$D$3,3,FALSE)=\"X\",Index!D7=\"Reported\"),\"/\",\"!\")","v":"!"},"X"]
["3",{"$f":"IF(AND(HLOOKUP('General data'!$E$22,$C$1:$D$4,4,FALSE)=\"X\",Index!D8=\"Reported\"),\"/\",\"!\")","v":"!"},"X"]
["4",{"$f":"IF(AND(HLOOKUP('General data'!$E$22,$C$1:$D$5,5,FALSE)=\"X\",Index!D9=\"Reported\"),\"/\",\"!\")","v":"!"},"X"]
[]
[{"$f":"IF(Index!D6=\"Not Reported\",\"/A. Identification of the institution Rows{Z}@ForceFilingCode:false\",\"\")","v":"/A. Identification of the institution Rows{Z}@ForceFilingCode:false"},{"$f":"IF(Index!D6=\"Not Reported\",\"//A. Identification of the institution Rows{Z}@ForceFilingCode:false\",\"\")","v":"//A. Identification of the institution Rows{Z}@ForceFilingCode:false"}]
[{"$f":"IF(Index!D6=\"Not Reported\",\"/B. Contact person for this reporting form Rows{Z}@ForceFilingCode:false\",\"\")","v":"/B. Contact person for this reporting form Rows{Z}@ForceFilingCode:false"},{"$f":"IF(Index!D6=\"Not Reported\",\"//B. Contact person for this reporting form Rows{Z}@ForceFilingCode:false\",\"\")","v":"//B. Contact person for this reporting form Rows{Z}@ForceFilingCode:false"}]
[{"$f":"IF(Index!D6=\"Not Reported\",\"/C. Identification of possible specificities for the calculation of the individual annual contribution Rows{Z}@ForceFilingCode:false\",\"\")","v":"/C. Identification of possible specificities for the calculation of the individual annual contribution Rows{Z}@ForceFilingCode:false"},{"$f":"IF(Index!D6=\"Not Reported\",\"//C. Identification of possible specificities for the calculation of the individual annual contribution Rows{Z}@ForceFilingCode:false\",\"\")","v":"//C. Identification of possible specificities for the calculation of the individual annual contribution Rows{Z}@ForceFilingCode:false"}]
[{"$f":"IF(Index!D6=\"Not Reported\",\"/D. Newly supervised institutions and mergers Rows{Z}@ForceFilingCode:false\",\"\")","v":"/D. Newly supervised institutions and mergers Rows{Z}@ForceFilingCode:false"},{"$f":"IF(Index!D6=\"Not Reported\",\"//D. Newly supervised institutions and mergers Rows{Z}@ForceFilingCode:false\",\"\")","v":"//D. Newly supervised institutions and mergers Rows{Z}@ForceFilingCode:false"}]
[{"$f":"IF(Index!D6=\"Not Reported\",\"/E. Reference date for the reporting form Rows{Z}@ForceFilingCode:false\",\"\")","v":"/E. Reference date for the reporting form Rows{Z}@ForceFilingCode:false"},{"$f":"IF(Index!D6=\"Not Reported\",\"//E. Reference date for the reporting form Rows{Z}@ForceFilingCode:false\",\"\")","v":"//E. Reference date for the reporting form Rows{Z}@ForceFilingCode:false"}]
[{"$f":"IF(Index!D7=\"Not Reported\",\"/Section A. Basic annual contribution before adjustment of liabilities arising from derivative contracts (excluding credit derivatives) Rows{Z}@ForceFilingCode:false\",\"\")","v":"/Section A. Basic annual contribution before adjustment of liabilities arising from derivative contracts (excluding credit derivatives) Rows{Z}@ForceFilingCode:false"},{"$f":"IF(Index!D7=\"Not Reported\",\"//Section A. Basic annual contribution before adjustment of liabilities arising from derivative contracts (excluding credit derivatives) Rows{Z}@ForceFilingCode:false\",\"\")","v":"//Section A. Basic annual contribution before adjustment of liabilities arising from derivative contracts (excluding credit derivatives) Rows{Z}@ForceFilingCode:false"}]
[{"$f":"IF(Index!D7=\"Not Reported\",\"/Section B. Simplified calculation methods Rows{Z}@ForceFilingCode:false\",\"\")","v":"/Section B. Simplified calculation methods Rows{Z}@ForceFilingCode:false"},{"$f":"IF(Index!D7=\"Not Reported\",\"//Section B. Simplified calculation methods Rows{Z}@ForceFilingCode:false\",\"\")","v":"//Section B. Simplified calculation methods Rows{Z}@ForceFilingCode:false"}]
[{"$f":"IF(Index!D7=\"Not Reported\",\"/Section C. Determination of the exposure value of the derivative contracts (excluding credit derivatives) Rows{Z}@ForceFilingCode:false\",\"\")","v":"/Section C. Determination of the exposure value of the derivative contracts (excluding credit derivatives) Rows{Z}@ForceFilingCode:false"},{"$f":"IF(Index!D7=\"Not Reported\",\"//Section C. Determination of the exposure value of the derivative contracts (excluding credit derivatives) Rows{Z}@ForceFilingCode:false\",\"\")","v":"//Section C. Determination of the exposure value of the derivative contracts (excluding credit derivatives) Rows{Z}@ForceFilingCode:false"}]
[{"$f":"IF(Index!D8=\"Not Reported\",\"/Section A. Deductible amount of qualifying liabilities related to clearing activities Rows{Z}@ForceFilingCode:false\",\"\")","v":"/Section A. Deductible amount of qualifying liabilities related to clearing activities Rows{Z}@ForceFilingCode:false"},{"$f":"IF(Index!D8=\"Not Reported\",\"//Section A. Deductible amount of qualifying liabilities related to clearing activities Rows{Z}@ForceFilingCode:false\",\"\")","v":"//Section A. Deductible amount of qualifying liabilities related to clearing activities Rows{Z}@ForceFilingCode:false"}]
[{"$f":"IF(Index!D8=\"Not Reported\",\"/Section B. Deductible amount of qualifying liabilities related to the activities of a central securities depository (CSD) Rows{Z}@ForceFilingCode:false\",\"\")","v":"/Section B. Deductible amount of qualifying liabilities related to the activities of a central securities depository (CSD) Rows{Z}@ForceFilingCode:false"},{"$f":"IF(Index!D8=\"Not Reported\",\"//Section B. Deductible amount of qualifying liabilities related to the activities of a central securities depository (CSD) Rows{Z}@ForceFilingCode:false\",\"\")","v":"//Section B. Deductible amount of qualifying liabilities related to the activities of a central securities depository (CSD) Rows{Z}@ForceFilingCode:false"}]
[{"$f":"IF(Index!D8=\"Not Reported\",\"/Section C. Deductible amount of qualifying liabilities that arise by virtue of holding client assets or client money Rows{Z}@ForceFilingCode:false\",\"\")","v":"/Section C. Deductible amount of qualifying liabilities that arise by virtue of holding client assets or client money Rows{Z}@ForceFilingCode:false"},{"$f":"IF(Index!D8=\"Not Reported\",\"//Section C. Deductible amount of qualifying liabilities that arise by virtue of holding client assets or client money Rows{Z}@ForceFilingCode:false\",\"\")","v":"//Section C. Deductible amount of qualifying liabilities that arise by virtue of holding client assets or client money Rows{Z}@ForceFilingCode:false"}]
[{"$f":"IF(Index!D8=\"Not Reported\",\"/Section D. Deductible amount of qualifying liabilities that arise from promotional loans Rows{Z}@ForceFilingCode:false\",\"\")","v":"/Section D. Deductible amount of qualifying liabilities that arise from promotional loans Rows{Z}@ForceFilingCode:false"},{"$f":"IF(Index!D8=\"Not Reported\",\"//Section D. Deductible amount of qualifying liabilities that arise from promotional loans Rows{Z}@ForceFilingCode:false\",\"\")","v":"//Section D. Deductible amount of qualifying liabilities that arise from promotional loans Rows{Z}@ForceFilingCode:false"}]
[{"$f":"IF(Index!D8=\"Not Reported\",\"/Section E. Deductible amount of assets and liabilities arising from qualifying Institutional Protection Scheme (IPS) liabilities Rows{Z}@ForceFilingCode:false\",\"\")","v":"/Section E. Deductible amount of assets and liabilities arising from qualifying Institutional Protection Scheme (IPS) liabilities Rows{Z}@ForceFilingCode:false"},{"$f":"IF(Index!D8=\"Not Reported\",\"//Section E. Deductible amount of assets and liabilities arising from qualifying Institutional Protection Scheme (IPS) liabilities Rows{Z}@ForceFilingCode:false\",\"\")","v":"//Section E. Deductible amount of assets and liabilities arising from qualifying Institutional Protection Scheme (IPS) liabilities Rows{Z}@ForceFilingCode:false"}]
[{"$f":"IF(Index!D8=\"Not Reported\",\"/Section F. Deductible amount of assets and liabilities arising from qualifying intragroup liabilities Rows{Z}@ForceFilingCode:false\",\"\")","v":"/Section F. Deductible amount of assets and liabilities arising from qualifying intragroup liabilities Rows{Z}@ForceFilingCode:false"},{"$f":"IF(Index!D8=\"Not Reported\",\"//Section F. Deductible amount of assets and liabilities arising from qualifying intragroup liabilities Rows{Z}@ForceFilingCode:false\",\"\")","v":"//Section F. Deductible amount of assets and liabilities arising from qualifying intragroup liabilities Rows{Z}@ForceFilingCode:false"}]
{"$rows_left_out":6}
{"sheet":"Hierarchies","index":4,"n_rows":28,"n_cols":5,"rows_kept":28,"cut":false,"hidden":true,"merged":[]}
["hier_eba_GA_GA1","hier_YN_1","hier_YN_2","hier_RL_5","hier_RL_6"]
["AUSTRIA","Yes","Not applicable","individual","individual"]
["BELGIUM","No","Yes","sub-consolidated","sub-consolidated"]
["BULGARIA",null,"No","consolidated","consolidated"]
["CYPRUS"]
["CZECH REPUBLIC"]
["GERMANY"]
["DENMARK"]
["ESTONIA"]
["SPAIN"]
["FINLAND"]
["FRANCE"]
["GREECE"]
["CROATIA"]
["HUNGARY"]
["IRELAND"]
["ITALY"]
["LITHUANIA"]
["LUXEMBOURG"]
["LATVIA"]
{"$rows_left_out":9}
{"sheet":"1","index":5,"n_rows":84,"n_cols":10,"rows_kept":84,"cut":false,"hidden":true,"merged":[[39,1,39,11],[1,1,1,14],[4,1,4,11],[8,3,9,3],[23,1,23,11],[27,3,28,3],[43,3,44,3],[60,1,60,11],[64,3,65,3],[73,1,73,11],[77,3,78,3]]}
["Back to Index"]
[null,"1. General information"]
[]
[]
[null,"A. Identification of the institution"]
[]
[]
[]
[null,null,null,"X"]
[]
[null,null,null,"Value"]
[null,null,null,"1",null,null,null,null,{"$f":"Show!$B$2&\"A. Identification of the institution Rows {\"&COLUMN($C$1)&\"}\"&Index!$E$6","v":"!A. Identification of the institution Rows {3}@ForceFilingCode:false"},{"$f":"Show!$B$2&\"A. Identification of the institution Columns {\"&COLUMN($D$1)&\"}\"","v":"!A. Identification of the institution Columns {4}"}]
[null,"Field",""]
[null,"Name of the institution","1A1"]
[null,"Address of the institution","1A2"]
[null,"Postal code of the institution","1A3"]
[null,"City of the institution","1A4"]
[null,"Country of registration of the institution","1A5"]
[null,"RIAD code of the institution (for credit institutions only) or SRB identifier where a RIAD code is not available","1A6"]
[null,"LEI code of the institution","1A7"]
{"$rows_left_out":65}
{"sheet":"2","index":6,"n_rows":48,"n_cols":10,"rows_kept":48,"cut":false,"hidden":true,"merged":[[36,3,37,3],[1,1,1,14],[4,1,4,11],[8,3,9,3],[18,1,18,11],[22,3,23,3],[32,1,32,11]]}
["Back to Index"]
[null,"2. Basic annual contribution"]
[]
[]
[null,"Section A. Basic annual contribution before adjustment of liabilities arising from derivative contracts (excluding credit derivatives)"]
[]
[]
[]
[null,null,null,"X"]
[]
[null,null,null,"Value"]
[null,null,null,"1",null,null,null,null,{"$f":"Show!$B$3&\"Section A. Basic annual contribution before adjustment of liabilities arising from derivative contracts (excluding credit derivatives) Rows {\"&COLUMN($C$1)&\"}\"&Index!$E$7","v":"!Section A. Basic annual contribution before adjustment of liabilities arising from derivative contracts (excluding credit derivatives) Rows {3}@ForceFilingCode:false"},{"$f":"Show!$B$3&\"Section A. Basic annual contribution before adjustment of liabilities arising from derivative contracts (excluding credit derivatives) Columns {\"&COLUMN($D$1)&\"}\"","v":"!Section A. Basic annual contribution before adjustment of liabilities arising from derivative contracts (excluding credit derivatives) Columns {4}"}]
[null,"Field",""]
[null,"Total liabilities, as defined for this field","2A1"]
[null,"Own funds, as defined for this field","2A2"]
[null,"Covered deposits, yearly average of the quarterly calculated amounts, as defined for this field","2A3"]
[null,null,null,null,null,null,null,null,{"$f":"Show!$B$3&Show!$B$3&\"Section A. Basic annual contribution before adjustment of liabilities arising from derivative contracts (excluding credit derivatives) Rows {\"&COLUMN($C$1)&\"}\"","v":"!!Section A. Basic annual contribution before adjustment of liabilities arising from derivative contracts (excluding credit derivatives) Rows {3}"},{"$f":"Show!$B$3&Show!$B$3&\"Section A. Basic annual contribution before adjustment of liabilities arising from derivative contracts (excluding credit derivatives) Columns {\"&COLUMN($D$1)&\"}\"","v":"!!Section A. Basic annual contribution before adjustment of liabilities arising from derivative contracts (excluding credit derivatives) Columns {4}"}]
[]
[null,"Section B. Simplified calculation methods"]
[]
{"$rows_left_out":29}
{"sheet":"3","index":7,"n_rows":173,"n_cols":10,"rows_kept":173,"cut":false,"hidden":true,"merged":[[80,3,81,3],[1,1,1,14],[4,1,4,11],[8,3,9,3],[10,3,12,3],[28,1,28,11],[32,3,33,3],[34,3,36,3],[52,1,52,11],[56,3,57,3],[58,3,60,3],[76,1,76,11],[135,3,137,3],[158,1,158,11],[162,3,163,3],[164,3,165,3],[82,3,84,3],[100,1,100,11],[104,3,105,3],[106,3,108,3],[129,1,129,11],[133,3,134,3]]}
["Back to Index"]
[null,"3. Deductions"]
[]
[]
[null,"Section A. Deductible amount of qualifying liabilities related to clearing activities"]
[]
[]
[]
[null,null,null,"X"]
[]
[null,null,null,"Value"]
[]
[]
[null,null,null,"1",null,null,null,null,{"$f":"Show!$B$4&\"Section A. Deductible amount of qualifying liabilities related to clearing activities Rows {\"&COLUMN($C$1)&\"}\"&Index!$E$8","v":"!Section A. Deductible amount of qualifying liabilities related to clearing activities Rows {3}@ForceFilingCode:false"},{"$f":"Show!$B$4&\"Section A. Deductible amount of qualifying liabilities related to clearing activities Columns {\"&COLUMN($D$1)&\"}\"","v":"!Section A. Deductible amount of qualifying liabilities related to clearing activities Columns {4}"}]
[null,"Field",""]
[null,"Sub-section A.i) Adjustment of qualifying liabilities related to clearing activities arising from derivatives held by the institution",""]
[null,"Liabilities arising from all derivative contracts (excluding credit derivatives) valued in accordance with Articles 5a to 5e of Delegated Regulation (yearly average of the quarterly calculated amounts).","2C1"]
[null,"Of which: qualifying liabilities arising from derivatives related to clearing activities (yearly average of the quarterly calculated amounts).","3A1"]
[null,"Of which: liabilities arising from derivatives not related to clearing activities (yearly average of the quarterly calculated amounts).","3A2"]
[null,"Derivative floor factor","3A3"]
{"$rows_left_out":154}
{"sheet":"4","index":8,"n_rows":117,"n_cols":10,"rows_kept":117,"cut":false,"hidden":true,"merged":[[86,3,89,3],[1,1,1,14],[4,1,4,11],[8,3,9,3],[10,3,11,3],[35,1,35,11],[39,3,40,3],[41,3,42,3],[61,1,61,11],[65,3,66,3],[80,1,80,11],[84,3,85,3]]}
["Back to Index"]
[null,"4. Risk adjustment"]
[]
[]
[null,"Section A. 'Risk exposure' pillar"]
[]
[]
[]
[null,null,null,"X"]
[]
[null,null,null,"Value"]
[]
[null,null,null,"1",null,null,null,null,{"$f":"Show!$B$5&\"Section A. 'Risk exposure' pillar Rows {\"&COLUMN($C$1)&\"}\"&Index!$E$9","v":"!Section A. 'Risk exposure' pillar Rows {3}@ForceFilingCode:false"},{"$f":"Show!$B$5&\"Section A. 'Risk exposure' pillar Columns {\"&COLUMN($D$1)&\"}\"","v":"!Section A. 'Risk exposure' pillar Columns {4}"}]
[null,"Field",""]
[null,"Risk indicator A.ii) Leverage ratio",""]
[null,"Has the competent authority granted a waiver from the application of the Leverage ratio risk indicator to the institution at individual level?","4A1"]
[null,"Reporting level of the Leverage ratio risk indicator","4A2"]
[null,"Name of the parent\n(only in case of waiver)","4A3"]
[null,"LEI code of the parent\n(only in case of waiver)","4A4"]
[null,"LEI code of the institutions which are part of the (sub-)consolidation\n(only in case of waiver)","4A6"]
{"$rows_left_out":97}