{"text_format":"1","workbook":"xlsx","n_sheets":17,"sheets":["General data","XBRL Errors","Index","Show","Hierarchies","T0","T1A","T1B","T1C","T1D","T1E","T2A","T2C","T2E","T2G","T3A","T3B"],"not_rendered":{"charts":0,"images":3,"macros":1,"external_links":0,"defined_names":38,"comments":0,"pivot_tables":0},"unopened":[],"bounds":{"document_bytes":16777216,"sheet_cells":100000,"rows_first":2000,"rows_last":500,"rows_between":2000,"halvings":0,"cell_chars":16384,"cell_head_chars":4096},"cells_cut":0,"cells_raw":0,"read":"whole","date_system":"1900"}

{"sheet":"General data","index":0,"n_rows":247,"n_cols":23,"rows_kept":247,"cut":false,"hidden":false,"merged":[[0,6,2,6],[3,0,5,9]]}
[null,null,null,null,null,null,null,"Version:",null,"2.0.0.1",null,null,null,null,null,null,"Not applicable/All geographical areas","http://standards.iso.org/iso/17442","Verzekeraars nationale staten, jaarlijkse rapportage","VNS-JR","01","EUR","NL VNS 2.0.0"]
[null,null,null,null,null,null,null,null,null,null,null,null,null,null,null,null,"AFGHANISTAN","http://standards.iso.org/iso/17442",null,null,"18","AED"]
[null,null,null,null,null,null,null," ",null,null,null,null,null,null,null,null,"ALBANIA","http://standards.iso.org/iso/17442",null,null,"19","AFN"]
[null,null,null,null,null,null,null,null,null,null,null,null,null,null,null,null,"ALGERIA","http://standards.iso.org/iso/17442",null,null,"20","ALL"]
[null,null,null,null,null,null,null,null,null,null,null,null,null,null,null,null,"AMERICAN SAMOA","http://standards.iso.org/iso/17442",null,null,"All","AMD"]
[null,null,null,null,null,null,null,null,null,null,null,null,null,null,null,null,"ANDORRA","http://standards.iso.org/iso/17442",null,null,"All","ANG"]
[null,null,null,null,null,null,null,null,null,null,null,null,null,null,null,null,"ANGOLA","http://standards.iso.org/iso/17442",null,null,null,"AOA"]
[null,"General Data",null,null,null,null,null,null,null,null,null,"/General data label{B}","/General data value{E}",null,null,null,"ANGUILLA","http://standards.iso.org/iso/17442",null,null,null,"ARS"]
[null,null,null,null,null,null,null,null,null,null,null,null,null,null,null,null,"ANTARCTICA","http://standards.iso.org/iso/17442",null,null,null,"AUD"]
["*","Identifier",":","LEGALIDENTIFIER20POS",{"$f":"\"\"&D10","v":"LEGALIDENTIFIER20POS"},{"$f":"IF(D10=\"\",1,0)","v":0},null,null,null,null,null,null,null,null,null,null,"ANTIGUA AND BARBUDA","http://standards.iso.org/iso/17442",null,null,null,"AWG"]
[null,null,null,null,null,null,null,null,null,null,null,null,null,null,null,null,"ARGENTINA","http://standards.iso.org/iso/17442",null,null,null,"AZN"]
["*","Period start date",":","2020-01-01",{"$f":"D12","v":"2020-01-01"},{"$f":"IF(D12=\"\",1,0)","v":0},null,null,null,null,null,null,null,null,null,null,"ARMENIA","http://standards.iso.org/iso/17442",null,null,null,"BAM"]
[null,null,null,null,null,null,null,null,null,null,null,null,null,null,null,null,"ARUBA","http://standards.iso.org/iso/17442",null,null,null,"BBD"]
["*","Period end date",":","2020-12-31",{"$f":"D14","v":"2020-12-31"},{"$f":"IF(D14=\"\",1,0)","v":0},null,null,null,null,null,null,null,null,null,null,"AUSTRALIA","http://standards.iso.org/iso/17442",null,null,null,"BDT"]
[null,null,null,null,null,null,null,null,null,null,null,null,null,null,null,null,"AUSTRIA","http://standards.iso.org/iso/17442",null,null,null,"BGN"]
[null,"Country",":","Not applicable/All geographical areas",null,null,null,null,null,null,null,null,null,null,null,null,"AZERBAIJAN","http://standards.iso.org/iso/17442",null,null,null,"BHD"]
[null,null,null,null,null,null,null,null,null,null,null,null,null,null,null,null,"BAHAMAS","http://standards.iso.org/iso/17442",null,null,null,"BIF"]
["*","Filing Currency",":","EUR",{"$f":"\"\"&D18","v":"EUR"},{"$f":"IF(D18=\"\",1,0)","v":0},null,null,null,null,null,null,null,null,null,null,"BAHRAIN","http://standards.iso.org/iso/17442",null,null,null,"BMD"]
[null,null,null,null,null,null,null,null,null,null,null,null,null,null,null,null,"BANGLADESH","http://standards.iso.org/iso/17442",null,null,null,"BND"]
["*","Taxonomy",":","NL VNS 2.0.0",null,{"$f":"IF(D20=\"\",1,0)","v":0},null,null,null,null,null,null,null,null,null,null,"BARBADOS","http://standards.iso.org/iso/17442",null,null,null,"BOB"]
{"$rows_left_out":228}
{"sheet":"XBRL Errors","index":1,"n_rows":1,"n_cols":2,"rows_kept":1,"cut":false,"hidden":false,"merged":[]}
["Timestamp","Error"]

{"sheet":"Index","index":2,"n_rows":17,"n_cols":5,"rows_kept":17,"cut":false,"hidden":false,"merged":[[2,1,2,14]]}
[]
[]
[null,"Index"]
[]
[null,"Template Code","Template Name","Reporting Status"]
[null,"T0","Tabel 0: Voorblad",null,{"$f":"IF($D$6=\"Reported\",\"@ForceFilingCode:true\",IF($D$6=\"Not Reported\",\"@ForceFilingCode:false\",\"\"))","v":""}]
[null,"T1A","Tabel 1A: Vereveningsbijdrage Zvw",null,{"$f":"IF($D$7=\"Reported\",\"@ForceFilingCode:true\",IF($D$7=\"Not Reported\",\"@ForceFilingCode:false\",\"\"))","v":""}]
[null,"T1B","Tabel 1B: Schade en technische voorziening basisverzekering",null,{"$f":"IF($D$8=\"Reported\",\"@ForceFilingCode:true\",IF($D$8=\"Not Reported\",\"@ForceFilingCode:false\",\"\"))","v":""}]
[null,"T1C","Tabel 1C: Schade en technische voorziening aanvullende verzekering",null,{"$f":"IF($D$9=\"Reported\",\"@ForceFilingCode:true\",IF($D$9=\"Not Reported\",\"@ForceFilingCode:false\",\"\"))","v":""}]
[null,"T1D","Tabel 1D: Verdiende premie basis en/of aanvullende verzekering",null,{"$f":"IF($D$10=\"Reported\",\"@ForceFilingCode:true\",IF($D$10=\"Not Reported\",\"@ForceFilingCode:false\",\"\"))","v":""}]
[null,"T1E","Tabel 1E: Aantal verzekerden basis en/of aanvullende verzekering",null,{"$f":"IF($D$11=\"Reported\",\"@ForceFilingCode:true\",IF($D$11=\"Not Reported\",\"@ForceFilingCode:false\",\"\"))","v":""}]
[null,"T2A","Tabel 2A: Winst- en verliesrekening levensverzekeraars (vennootschappelijk, grondslag BW)",null,{"$f":"IF($D$12=\"Reported\",\"@ForceFilingCode:true\",IF($D$12=\"Not Reported\",\"@ForceFilingCode:false\",\"\"))","v":""}]
[null,"T2C","Tabel 2C: Winst- en verliesrekening schadeverzekeraars (vennootschappelijk, grondslag BW)",null,{"$f":"IF($D$13=\"Reported\",\"@ForceFilingCode:true\",IF($D$13=\"Not Reported\",\"@ForceFilingCode:false\",\"\"))","v":""}]
[null,"T2E","Tabel 2E: Winst- en verliesrekening herverzekeraars (vennootschappelijk, grondslag BW)",null,{"$f":"IF($D$14=\"Reported\",\"@ForceFilingCode:true\",IF($D$14=\"Not Reported\",\"@ForceFilingCode:false\",\"\"))","v":""}]
[null,"T2G","Tabel 2G: Winst- en verliesrekening verzekeraars (vennootschappelijk, grondslag IFRS)",null,{"$f":"IF($D$15=\"Reported\",\"@ForceFilingCode:true\",IF($D$15=\"Not Reported\",\"@ForceFilingCode:false\",\"\"))","v":""}]
[null,"T3A","Tabel 3A: Concentratierisico Windstorm",null,{"$f":"IF($D$16=\"Reported\",\"@ForceFilingCode:true\",IF($D$16=\"Not Reported\",\"@ForceFilingCode:false\",\"\"))","v":""}]
[null,"T3B","Tabel 3B: Exposure Windstorm",null,{"$f":"IF($D$17=\"Reported\",\"@ForceFilingCode:true\",IF($D$17=\"Not Reported\",\"@ForceFilingCode:false\",\"\"))","v":""}]

{"sheet":"Show","index":3,"n_rows":26,"n_cols":3,"rows_kept":26,"cut":false,"hidden":true,"merged":[]}
["Sheet","Prefix","VNS-JR"]
["T0",{"$f":"IF(AND(HLOOKUP('General data'!$E$22,$C$1:$D$2,2,FALSE)=\"X\",Index!D6=\"Reported\"),\"/\",\"!\")","v":"!"},"X"]
["T1A",{"$f":"IF(AND(HLOOKUP('General data'!$E$22,$C$1:$D$3,3,FALSE)=\"X\",Index!D7=\"Reported\"),\"/\",\"!\")","v":"!"},"X"]
["T1B",{"$f":"IF(AND(HLOOKUP('General data'!$E$22,$C$1:$D$4,4,FALSE)=\"X\",Index!D8=\"Reported\"),\"/\",\"!\")","v":"!"},"X"]
["T1C",{"$f":"IF(AND(HLOOKUP('General data'!$E$22,$C$1:$D$5,5,FALSE)=\"X\",Index!D9=\"Reported\"),\"/\",\"!\")","v":"!"},"X"]
["T1D",{"$f":"IF(AND(HLOOKUP('General data'!$E$22,$C$1:$D$6,6,FALSE)=\"X\",Index!D10=\"Reported\"),\"/\",\"!\")","v":"!"},"X"]
["T1E",{"$f":"IF(AND(HLOOKUP('General data'!$E$22,$C$1:$D$7,7,FALSE)=\"X\",Index!D11=\"Reported\"),\"/\",\"!\")","v":"!"},"X"]
["T2A",{"$f":"IF(AND(HLOOKUP('General data'!$E$22,$C$1:$D$8,8,FALSE)=\"X\",Index!D12=\"Reported\"),\"/\",\"!\")","v":"!"},"X"]
["T2C",{"$f":"IF(AND(HLOOKUP('General data'!$E$22,$C$1:$D$9,9,FALSE)=\"X\",Index!D13=\"Reported\"),\"/\",\"!\")","v":"!"},"X"]
["T2E",{"$f":"IF(AND(HLOOKUP('General data'!$E$22,$C$1:$D$10,10,FALSE)=\"X\",Index!D14=\"Reported\"),\"/\",\"!\")","v":"!"},"X"]
["T2G",{"$f":"IF(AND(HLOOKUP('General data'!$E$22,$C$1:$D$11,11,FALSE)=\"X\",Index!D15=\"Reported\"),\"/\",\"!\")","v":"!"},"X"]
["T3A",{"$f":"IF(AND(HLOOKUP('General data'!$E$22,$C$1:$D$12,12,FALSE)=\"X\",Index!D16=\"Reported\"),\"/\",\"!\")","v":"!"},"X"]
["T3B",{"$f":"IF(AND(HLOOKUP('General data'!$E$22,$C$1:$D$13,13,FALSE)=\"X\",Index!D17=\"Reported\"),\"/\",\"!\")","v":"!"},"X"]
[]
[{"$f":"IF(Index!D6=\"Not Reported\",\"/T0 Rows{Z}@ForceFilingCode:false\",\"\")","v":""},{"$f":"IF(Index!D6=\"Not Reported\",\"//T0 Rows{Z}@ForceFilingCode:false\",\"\")","v":""}]
[{"$f":"IF(Index!D7=\"Not Reported\",\"/T1A Rows{Z}@ForceFilingCode:false\",\"\")","v":""},{"$f":"IF(Index!D7=\"Not Reported\",\"//T1A Rows{Z}@ForceFilingCode:false\",\"\")","v":""}]
[{"$f":"IF(Index!D8=\"Not Reported\",\"/T1B Rows{Z}@ForceFilingCode:false\",\"\")","v":""},{"$f":"IF(Index!D8=\"Not Reported\",\"//T1B Rows{Z}@ForceFilingCode:false\",\"\")","v":""}]
[{"$f":"IF(Index!D9=\"Not Reported\",\"/T1C Rows{Z}@ForceFilingCode:false\",\"\")","v":""},{"$f":"IF(Index!D9=\"Not Reported\",\"//T1C Rows{Z}@ForceFilingCode:false\",\"\")","v":""}]
[{"$f":"IF(Index!D10=\"Not Reported\",\"/T1D Rows{Z}@ForceFilingCode:false\",\"\")","v":""},{"$f":"IF(Index!D10=\"Not Reported\",\"//T1D Rows{Z}@ForceFilingCode:false\",\"\")","v":""}]
[{"$f":"IF(Index!D11=\"Not Reported\",\"/T1E Rows{Z}@ForceFilingCode:false\",\"\")","v":""},{"$f":"IF(Index!D11=\"Not Reported\",\"//T1E Rows{Z}@ForceFilingCode:false\",\"\")","v":""}]
{"$rows_left_out":7}
{"sheet":"Hierarchies","index":4,"n_rows":5,"n_cols":3,"rows_kept":5,"cut":false,"hidden":true,"merged":[]}
["hier_dom011_001","hier_dom012_001","hier_dom001_001"]
["Not applicable / All or Total","Not applicable / All or Total","Yes"]
["BW","Life","No"]
["IFRS","Non-life"]
[null,"Reinsurance"]

{"sheet":"T0","index":5,"n_rows":18,"n_cols":9,"rows_kept":18,"cut":false,"hidden":true,"merged":[[1,1,1,14],[4,1,4,11],[8,3,9,3]]}
["Back to Index"]
[null,"Tabel groep 0: Voorblad"]
[]
[]
[null,"Tabel 0: Voorblad"]
[]
[]
[]
[null,null,null,"x-axis"]
[]
[null,null,null,"Keuzes"]
[null,null,null,"010",null,null,null,{"$f":"Show!$B$2&\"T0 Rows {\"&COLUMN($C$1)&\"}\"&Index!$E$6","v":"!T0 Rows {3}"},{"$f":"Show!$B$2&\"T0 Columns {\"&COLUMN($D$1)&\"}\"","v":"!T0 Columns {4}"}]
[null,"y-axis",""]
[null,"IFRS of BW","010"]
[null,"Leven/Schade/Herverzekeraar","020"]
[null,"Windstorm: Verleent u stormdekkingen? ja/nee","030"]
[null,"Werknemers: Gemiddeld aantal fte's in boekjaar (afronden op hele getallen)","040"]
[null,null,null,null,null,null,null,{"$f":"Show!$B$2&Show!$B$2&\"T0 Rows {\"&COLUMN($C$1)&\"}\"","v":"!!T0 Rows {3}"},{"$f":"Show!$B$2&Show!$B$2&\"T0 Columns {\"&COLUMN($D$1)&\"}\"","v":"!!T0 Columns {4}"}]

{"sheet":"T1A","index":6,"n_rows":34,"n_cols":41,"rows_kept":34,"cut":false,"hidden":true,"merged":[[1,1,1,14],[4,1,4,11],[8,3,9,35],[10,3,10,19],[10,20,10,35],[11,3,11,17],[11,18,12,18],[11,19,12,19],[11,20,11,34],[11,35,12,35]]}
["Back to Index"]
[null,"Tabel groep 1: Zorg"]
[]
[]
[null,"Tabel 1A: Vereveningsbijdrage Zvw"]
[]
[]
[]
[null,null,null,"x-axis"]
[]
[null,null,null,"Ontvangen Vereveningsbijdrage Zvw",null,null,null,null,null,null,null,null,null,null,null,null,null,null,null,null,"(Nog) Niet Ontvangen Vereveningsbijdrage Zvw"]
[null,null,null,"Ontwikkelingsjaar",null,null,null,null,null,null,null,null,null,null,null,null,null,null,"Huidig boekjaar","Totaal naar schadejaar","Ontwikkelingsjaar",null,null,null,null,null,null,null,null,null,null,null,null,null,null,"Ultimo huidig boekjaar"]
[null,null,null,1,2,3,4,5,6,7,8,9,10,11,12,13,14,15,null,null,1,2,3,4,5,6,7,8,9,10,11,12,13,14,15]
[null,null,null,"010","020","030","040","050","060","070","080","090","100","110","120","130","140","150","160","170","180","190","200","210","220","230","240","250","260","270","280","290","300","310","320","330",null,null,null,{"$f":"Show!$B$3&\"T1A Rows {\"&COLUMN($C$1)&\"}\"&Index!$E$7","v":"!T1A Rows {3}"},{"$f":"Show!$B$3&\"T1A Columns {\"&COLUMN($D$1)&\"}\"","v":"!T1A Columns {4}"}]
[null,"y-axis",""]
[null,"Schadejaar",""]
[null,"Ouder","010"]
[null,"N-14","020"]
[null,"N-13","030"]
[null,"N-12","040"]
{"$rows_left_out":15}
{"sheet":"T1B","index":7,"n_rows":34,"n_cols":41,"rows_kept":34,"cut":false,"hidden":true,"merged":[[1,1,1,14],[4,1,4,11],[8,3,9,35],[10,3,10,19],[10,20,10,35],[11,3,11,17],[11,18,12,18],[11,19,12,19],[11,20,11,34],[11,35,12,35]]}
["Back to Index"]
[null,"Tabel groep 1: Zorg"]
[]
[]
[null,"Tabel 1B: Schade en technische voorziening basisverzekering"]
[]
[]
[]
[null,null,null,"x-axis"]
[]
[null,null,null,"Betaalde Schade Basisverzekering",null,null,null,null,null,null,null,null,null,null,null,null,null,null,null,null,"Technische Voorziening Schade Basisverzekering"]
[null,null,null,"Ontwikkelingsjaar",null,null,null,null,null,null,null,null,null,null,null,null,null,null,"Huidig boekjaar","Totaal naar schadejaar","Ontwikkelingsjaar",null,null,null,null,null,null,null,null,null,null,null,null,null,null,"Ultimo huidig boekjaar"]
[null,null,null,1,2,3,4,5,6,7,8,9,10,11,12,13,14,15,null,null,1,2,3,4,5,6,7,8,9,10,11,12,13,14,15]
[null,null,null,"010","020","030","040","050","060","070","080","090","100","110","120","130","140","150","160","170","180","190","200","210","220","230","240","250","260","270","280","290","300","310","320","330",null,null,null,{"$f":"Show!$B$4&\"T1B Rows {\"&COLUMN($C$1)&\"}\"&Index!$E$8","v":"!T1B Rows {3}"},{"$f":"Show!$B$4&\"T1B Columns {\"&COLUMN($D$1)&\"}\"","v":"!T1B Columns {4}"}]
[null,"y-axis",""]
[null,"Schadejaar",""]
[null,"Ouder","010"]
[null,"N-14","020"]
[null,"N-13","030"]
[null,"N-12","040"]
{"$rows_left_out":15}
{"sheet":"T1C","index":8,"n_rows":34,"n_cols":41,"rows_kept":34,"cut":false,"hidden":true,"merged":[[1,1,1,14],[4,1,4,11],[8,3,9,35],[10,3,10,19],[10,20,10,35],[11,3,11,17],[11,18,12,18],[11,19,12,19],[11,20,11,34],[11,35,12,35]]}
["Back to Index"]
[null,"Tabel groep 1: Zorg"]
[]
[]
[null,"Tabel 1C: Schade en technische voorziening aanvullende verzekering"]
[]
[]
[]
[null,null,null,"x-axis"]
[]
[null,null,null,"Betaalde Schade Aanvullende verzekering",null,null,null,null,null,null,null,null,null,null,null,null,null,null,null,null,"Technische Voorziening Schade Aanvullende verzekering"]
[null,null,null,"Ontwikkelingsjaar",null,null,null,null,null,null,null,null,null,null,null,null,null,null,"Huidig boekjaar","Totaal naar schadejaar","Ontwikkelingsjaar",null,null,null,null,null,null,null,null,null,null,null,null,null,null,"Ultimo huidig boekjaar"]
[null,null,null,1,2,3,4,5,6,7,8,9,10,11,12,13,14,15,null,null,1,2,3,4,5,6,7,8,9,10,11,12,13,14,15]
[null,null,null,"010","020","030","040","050","060","070","080","090","100","110","120","130","140","150","160","170","180","190","200","210","220","230","240","250","260","270","280","290","300","310","320","330",null,null,null,{"$f":"Show!$B$5&\"T1C Rows {\"&COLUMN($C$1)&\"}\"&Index!$E$9","v":"!T1C Rows {3}"},{"$f":"Show!$B$5&\"T1C Columns {\"&COLUMN($D$1)&\"}\"","v":"!T1C Columns {4}"}]
[null,"y-axis",""]
[null,"Schadejaar",""]
[null,"Ouder","010"]
[null,"N-14","020"]
[null,"N-13","030"]
[null,"N-12","040"]
{"$rows_left_out":15}
{"sheet":"T1D","index":9,"n_rows":31,"n_cols":10,"rows_kept":31,"cut":false,"hidden":true,"merged":[[1,1,1,14],[4,1,4,11],[8,3,9,4],[10,3,11,3],[10,4,11,4]]}
["Back to Index"]
[null,"Tabel groep 1: Zorg"]
[]
[]
[null,"Tabel 1D: Verdiende premie basis en/of aanvullende verzekering"]
[]
[]
[]
[null,null,null,"x-axis"]
[]
[null,null,null,"Verdiende Premie Basisverzekering","Verdiende Premie Aanvullende verzekering"]
[]
[null,null,null,"010","020",null,null,null,{"$f":"Show!$B$6&\"T1D Rows {\"&COLUMN($C$1)&\"}\"&Index!$E$10","v":"!T1D Rows {3}"},{"$f":"Show!$B$6&\"T1D Columns {\"&COLUMN($D$1)&\"}\"","v":"!T1D Columns {4}"}]
[null,"y-axis",""]
[null,"Schadejaar",""]
[null,"N-14","010"]
[null,"N-13","020"]
[null,"N-12","030"]
[null,"N-11","040"]
[null,"N-10","050"]
{"$rows_left_out":12}
{"sheet":"T1E","index":10,"n_rows":31,"n_cols":12,"rows_kept":31,"cut":false,"hidden":true,"merged":[[1,1,1,14],[4,1,4,11],[8,3,9,6],[10,3,10,4],[10,5,10,6]]}
["Back to Index"]
[null,"Tabel groep 1: Zorg"]
[]
[]
[null,"Tabel 1E: Aantal verzekerden basis en/of aanvullende verzekering"]
[]
[]
[]
[null,null,null,"x-axis"]
[]
[null,null,null,"Gemiddeld aantal verzekerden basisverzekering",null,"Gemiddeld aantal verzekerden aanvullende verzekering"]
[null,null,null,"Waarvan 18-","Waarvan 18+","Waarvan 18-","Waarvan 18+"]
[null,null,null,"020","030","050","060",null,null,null,{"$f":"Show!$B$7&\"T1E Rows {\"&COLUMN($C$1)&\"}\"&Index!$E$11","v":"!T1E Rows {3}"},{"$f":"Show!$B$7&\"T1E Columns {\"&COLUMN($D$1)&\"}\"","v":"!T1E Columns {4}"}]
[null,"y-axis",""]
[null,"Schadejaar",""]
[null,"N-14","010"]
[null,"N-13","020"]
[null,"N-12","030"]
[null,"N-11","040"]
[null,"N-10","050"]
{"$rows_left_out":12}
{"sheet":"T2A","index":11,"n_rows":76,"n_cols":10,"rows_kept":76,"cut":false,"hidden":true,"merged":[[1,1,1,14],[4,1,4,11],[8,3,9,4],[10,3,13,3],[10,4,13,4]]}
["Back to Index"]
[null,"Tabel groep 2: Winst- en verliesrekening"]
[]
[]
[null,"Tabel 2A: Winst- en verliesrekening levensverzekeraars (vennootschappelijk, grondslag BW)"]
[]
[]
[]
[null,null,null,"x-axis"]
[]
[null,null,null,"T","T-1"]
[]
[]
[]
[null,null,null,"010","020",null,null,null,{"$f":"Show!$B$8&\"T2A Rows {\"&COLUMN($C$1)&\"}\"&Index!$E$12","v":"!T2A Rows {3}"},{"$f":"Show!$B$8&\"T2A Columns {\"&COLUMN($D$1)&\"}\"","v":"!T2A Columns {4}"}]
[null,"y-axis",""]
[null,"Technische rekening",""]
[null,"Verdiende premies eigen rekening",""]
[null,"Brutopremies","010"]
[null,"Uitgaande herverzekeringspremies (-)","020"]
{"$rows_left_out":57}
{"sheet":"T2C","index":12,"n_rows":81,"n_cols":10,"rows_kept":81,"cut":false,"hidden":true,"merged":[[1,1,1,14],[4,1,4,11],[8,3,9,4],[10,3,13,3],[10,4,13,4]]}
["Back to Index"]
[null,"Tabel groep 2: Winst- en verliesrekening"]
[]
[]
[null,"Tabel 2C: Winst- en verliesrekening schadeverzekeraars (vennootschappelijk, grondslag BW)"]
[]
[]
[]
[null,null,null,"x-axis"]
[]
[null,null,null,"T","T-1"]
[]
[]
[]
[null,null,null,"010","020",null,null,null,{"$f":"Show!$B$9&\"T2C Rows {\"&COLUMN($C$1)&\"}\"&Index!$E$13","v":"!T2C Rows {3}"},{"$f":"Show!$B$9&\"T2C Columns {\"&COLUMN($D$1)&\"}\"","v":"!T2C Columns {4}"}]
[null,"y-axis",""]
[null,"Technische rekening",""]
[null,"Verdiende premies eigen rekening",""]
[null,"Brutopremies","010"]
[null,"Uitgaande herverzekeringspremies  (-)","020"]
{"$rows_left_out":62}
{"sheet":"T2E","index":13,"n_rows":131,"n_cols":10,"rows_kept":131,"cut":false,"hidden":true,"merged":[[1,1,1,14],[4,1,4,11],[8,3,9,4],[10,3,13,3],[10,4,13,4]]}
["Back to Index"]
[null,"Tabel groep 2: Winst- en verliesrekening"]
[]
[]
[null,"Tabel 2E: Winst- en verliesrekening herverzekeraars (vennootschappelijk, grondslag BW)"]
[]
[]
[]
[null,null,null,"x-axis"]
[]
[null,null,null,"T","T-1"]
[]
[]
[]
[null,null,null,"010","020",null,null,null,{"$f":"Show!$B$10&\"T2E Rows {\"&COLUMN($C$1)&\"}\"&Index!$E$14","v":"!T2E Rows {3}"},{"$f":"Show!$B$10&\"T2E Columns {\"&COLUMN($D$1)&\"}\"","v":"!T2E Columns {4}"}]
[null,"y-axis",""]
[null,"Technische rekening  schadeherverzekering",""]
[null,"Verdiende premies eigen rekening",""]
[null,"Brutopremies","010"]
[null,"Uitgaande retrocessiepremies (-)","020"]
{"$rows_left_out":112}
{"sheet":"T2G","index":14,"n_rows":43,"n_cols":10,"rows_kept":43,"cut":false,"hidden":true,"merged":[[1,1,1,14],[4,1,4,11],[8,3,9,4]]}
["Back to Index"]
[null,"Tabel groep 2: Winst- en verliesrekening"]
[]
[]
[null,"Tabel 2G: Winst- en verliesrekening verzekeraars (vennootschappelijk, grondslag IFRS)"]
[]
[]
[]
[null,null,null,"x-axis"]
[]
[null,null,null,"T","T-1"]
[null,null,null,"010","020",null,null,null,{"$f":"Show!$B$11&\"T2G Rows {\"&COLUMN($C$1)&\"}\"&Index!$E$15","v":"!T2G Rows {3}"},{"$f":"Show!$B$11&\"T2G Columns {\"&COLUMN($D$1)&\"}\"","v":"!T2G Columns {4}"}]
[null,"y-axis",""]
[null,"Verzekeringsopbrengsten","011"]
[null,"Lasten uit hoofde van verzekeringsdiensten","021"]
[null,"Verzekeringsdienstenresultaat","031"]
[null,"Toerekening van betaalde herverzekeringspremies","041"]
[null,"De op de herverzekeraar verhaalde bedragen voor ontstane claims","051"]
[null,"Netto resultaat gehouden herverzekeringscontracten","061"]
[null,"Netto verzekeringsdienstenresultaat","071"]
{"$rows_left_out":24}
{"sheet":"T3A","index":15,"n_rows":29,"n_cols":20,"rows_kept":29,"cut":false,"hidden":true,"merged":[[1,1,1,14],[4,1,4,11],[8,3,9,14],[10,3,10,5],[10,6,10,8],[10,9,10,11],[10,12,10,14]]}
["Back to Index"]
[null,"Tabel groep 3: Windstorm"]
[]
[]
[null,"Tabel 3A: Concentratierisico Windstorm"]
[]
[]
[]
[null,null,null,"x-axis"]
[]
[null,null,null,"Burgerrisico's",null,null,"Commerciële risico's",null,null,"Industriële risico's",null,null,"Agrarische risico's"]
[null,null,null,"Aantal risico's","Verzekerde som","Verzekeringspremie","Aantal risico's","Verzekerde som","Verzekeringspremie","Aantal risico's","Verzekerde som","Verzekerings-premie","Aantal risico's","Verzekerde som","Verzekeringspremie"]
[null,null,null,"010","020","030","040","050","060","070","080","090","100","110","120",null,null,null,{"$f":"Show!$B$12&\"T3A Rows {\"&COLUMN($C$1)&\"}\"&Index!$E$16","v":"!T3A Rows {3}"},{"$f":"Show!$B$12&\"T3A Columns {\"&COLUMN($D$1)&\"}\"","v":"!T3A Columns {4}"}]
[null,"y-axis",""]
[null,"Provincie",""]
[null,"Groningen","010"]
[null,"Friesland","020"]
[null,"Drenthe","030"]
[null,"Overijssel","040"]
[null,"Gelderland","050"]
{"$rows_left_out":10}
{"sheet":"T3B","index":16,"n_rows":20,"n_cols":13,"rows_kept":20,"cut":false,"hidden":true,"merged":[[1,1,1,14],[4,1,4,11],[8,3,9,7],[10,3,10,7]]}
["Back to Index"]
[null,"Tabel groep 3: Windstorm"]
[]
[]
[null,"Tabel 3B: Exposure Windstorm"]
[]
[]
[]
[null,null,null,"x-axis"]
[]
[null,null,null,"Catastrofemodel"]
[null,null,null,"Eqecat","RMS","AIR","Overig","Intern"]
[null,null,null,"010","020","030","040","050",null,null,null,{"$f":"Show!$B$13&\"T3B Rows {\"&COLUMN($C$1)&\"}\"&Index!$E$17","v":"!T3B Rows {3}"},{"$f":"Show!$B$13&\"T3B Columns {\"&COLUMN($D$1)&\"}\"","v":"!T3B Columns {4}"}]
[null,"y-axis",""]
[null,"Terugkeerperiode",""]
[null,"100 jaar","010"]
[null,"150 jaar","020"]
[null,"200 jaar","030"]
[null,"250 jaar","040"]
[null,null,null,null,null,null,null,null,null,null,null,{"$f":"Show!$B$13&Show!$B$13&\"T3B Rows {\"&COLUMN($C$1)&\"}\"","v":"!!T3B Rows {3}"},{"$f":"Show!$B$13&Show!$B$13&\"T3B Columns {\"&COLUMN($H$1)&\"}\"","v":"!!T3B Columns {8}"}]